lucene-dev mailing list archives

Site index · List index
Message view « Date » · « Thread »
Top « Date » · « Thread »
From Policeman Jenkins Server <jenk...@thetaphi.de>
Subject [JENKINS] Lucene-Solr-7.x-Solaris (64bit/jdk1.8.0) - Build # 6 - Unstable!
Date Wed, 05 Jul 2017 20:30:41 GMT
Build: https://jenkins.thetaphi.de/job/Lucene-Solr-7.x-Solaris/6/
Java: 64bit/jdk1.8.0 -XX:+UseCompressedOops -XX:+UseG1GC

1 tests failed.
FAILED:  org.apache.lucene.index.TestMixedDocValuesUpdates.testManyReopensAndFields

Error Message:
invalid numeric value for doc=0, field=f0, reader=_g(7.1.0):c51:fieldInfosGen=1:dvGen=1 expected:<3>
but was:<2>

Stack Trace:
java.lang.AssertionError: invalid numeric value for doc=0, field=f0, reader=_g(7.1.0):c51:fieldInfosGen=1:dvGen=1
expected:<3> but was:<2>
	at __randomizedtesting.SeedInfo.seed([482E0B60E01B5A8E:7ED2694F61EE3992]:0)
	at org.junit.Assert.fail(Assert.java:93)
	at org.junit.Assert.failNotEquals(Assert.java:647)
	at org.junit.Assert.assertEquals(Assert.java:128)
	at org.junit.Assert.assertEquals(Assert.java:472)
	at org.apache.lucene.index.TestMixedDocValuesUpdates.testManyReopensAndFields(TestMixedDocValuesUpdates.java:138)
	at sun.reflect.NativeMethodAccessorImpl.invoke0(Native Method)
	at sun.reflect.NativeMethodAccessorImpl.invoke(NativeMethodAccessorImpl.java:62)
	at sun.reflect.DelegatingMethodAccessorImpl.invoke(DelegatingMethodAccessorImpl.java:43)
	at java.lang.reflect.Method.invoke(Method.java:498)
	at com.carrotsearch.randomizedtesting.RandomizedRunner.invoke(RandomizedRunner.java:1713)
	at com.carrotsearch.randomizedtesting.RandomizedRunner$8.evaluate(RandomizedRunner.java:907)
	at com.carrotsearch.randomizedtesting.RandomizedRunner$9.evaluate(RandomizedRunner.java:943)
	at com.carrotsearch.randomizedtesting.RandomizedRunner$10.evaluate(RandomizedRunner.java:957)
	at org.apache.lucene.util.TestRuleSetupTeardownChained$1.evaluate(TestRuleSetupTeardownChained.java:49)
	at org.apache.lucene.util.AbstractBeforeAfterRule$1.evaluate(AbstractBeforeAfterRule.java:45)
	at org.apache.lucene.util.TestRuleThreadAndTestName$1.evaluate(TestRuleThreadAndTestName.java:48)
	at org.apache.lucene.util.TestRuleIgnoreAfterMaxFailures$1.evaluate(TestRuleIgnoreAfterMaxFailures.java:64)
	at org.apache.lucene.util.TestRuleMarkFailure$1.evaluate(TestRuleMarkFailure.java:47)
	at com.carrotsearch.randomizedtesting.rules.StatementAdapter.evaluate(StatementAdapter.java:36)
	at com.carrotsearch.randomizedtesting.ThreadLeakControl$StatementRunner.run(ThreadLeakControl.java:368)
	at com.carrotsearch.randomizedtesting.ThreadLeakControl.forkTimeoutingTask(ThreadLeakControl.java:817)
	at com.carrotsearch.randomizedtesting.ThreadLeakControl$3.evaluate(ThreadLeakControl.java:468)
	at com.carrotsearch.randomizedtesting.RandomizedRunner.runSingleTest(RandomizedRunner.java:916)
	at com.carrotsearch.randomizedtesting.RandomizedRunner$5.evaluate(RandomizedRunner.java:802)
	at com.carrotsearch.randomizedtesting.RandomizedRunner$6.evaluate(RandomizedRunner.java:852)
	at com.carrotsearch.randomizedtesting.RandomizedRunner$7.evaluate(RandomizedRunner.java:863)
	at org.apache.lucene.util.AbstractBeforeAfterRule$1.evaluate(AbstractBeforeAfterRule.java:45)
	at com.carrotsearch.randomizedtesting.rules.StatementAdapter.evaluate(StatementAdapter.java:36)
	at org.apache.lucene.util.TestRuleStoreClassName$1.evaluate(TestRuleStoreClassName.java:41)
	at com.carrotsearch.randomizedtesting.rules.NoShadowingOrOverridesOnMethodsRule$1.evaluate(NoShadowingOrOverridesOnMethodsRule.java:40)
	at com.carrotsearch.randomizedtesting.rules.NoShadowingOrOverridesOnMethodsRule$1.evaluate(NoShadowingOrOverridesOnMethodsRule.java:40)
	at com.carrotsearch.randomizedtesting.rules.StatementAdapter.evaluate(StatementAdapter.java:36)
	at com.carrotsearch.randomizedtesting.rules.StatementAdapter.evaluate(StatementAdapter.java:36)
	at com.carrotsearch.randomizedtesting.rules.StatementAdapter.evaluate(StatementAdapter.java:36)
	at org.apache.lucene.util.TestRuleAssertionsRequired$1.evaluate(TestRuleAssertionsRequired.java:53)
	at org.apache.lucene.util.TestRuleMarkFailure$1.evaluate(TestRuleMarkFailure.java:47)
	at org.apache.lucene.util.TestRuleIgnoreAfterMaxFailures$1.evaluate(TestRuleIgnoreAfterMaxFailures.java:64)
	at org.apache.lucene.util.TestRuleIgnoreTestSuites$1.evaluate(TestRuleIgnoreTestSuites.java:54)
	at com.carrotsearch.randomizedtesting.rules.StatementAdapter.evaluate(StatementAdapter.java:36)
	at com.carrotsearch.randomizedtesting.ThreadLeakControl$StatementRunner.run(ThreadLeakControl.java:368)
	at java.lang.Thread.run(Thread.java:748)




Build Log:
[...truncated 372 lines...]
   [junit4] Suite: org.apache.lucene.index.TestMixedDocValuesUpdates
   [junit4]   2> NOTE: reproduce with: ant test  -Dtestcase=TestMixedDocValuesUpdates -Dtests.method=testManyReopensAndFields
-Dtests.seed=482E0B60E01B5A8E -Dtests.slow=true -Dtests.locale=ru-RU -Dtests.timezone=Asia/Ust-Nera
-Dtests.asserts=true -Dtests.file.encoding=UTF-8
   [junit4] FAILURE 0.25s J1 | TestMixedDocValuesUpdates.testManyReopensAndFields <<<
   [junit4]    > Throwable #1: java.lang.AssertionError: invalid numeric value for doc=0,
field=f0, reader=_g(7.1.0):c51:fieldInfosGen=1:dvGen=1 expected:<3> but was:<2>
   [junit4]    > 	at __randomizedtesting.SeedInfo.seed([482E0B60E01B5A8E:7ED2694F61EE3992]:0)
   [junit4]    > 	at org.apache.lucene.index.TestMixedDocValuesUpdates.testManyReopensAndFields(TestMixedDocValuesUpdates.java:138)
   [junit4]    > 	at java.lang.Thread.run(Thread.java:748)
   [junit4] IGNOR/A 0.00s J1 | TestMixedDocValuesUpdates.testTonsOfUpdates
   [junit4]    > Assumption #1: 'nightly' test group is disabled (@Nightly())
   [junit4]   2> NOTE: test params are: codec=Asserting(Lucene70): {updKey=PostingsFormat(name=Asserting),
id=PostingsFormat(name=Memory), key=PostingsFormat(name=Memory)}, docValues:{cf=DocValuesFormat(name=Lucene70),
f=DocValuesFormat(name=Memory), f0=DocValuesFormat(name=Memory), f1=DocValuesFormat(name=Lucene70),
f2=DocValuesFormat(name=Direct), cf0=DocValuesFormat(name=Asserting), f3=DocValuesFormat(name=Asserting),
f4=DocValuesFormat(name=Memory), cf2=DocValuesFormat(name=Lucene70), cf1=DocValuesFormat(name=Memory),
cf3=DocValuesFormat(name=Direct), id=DocValuesFormat(name=Lucene70), key=DocValuesFormat(name=Lucene70)},
maxPointsInLeafNode=1645, maxMBSortInHeap=7.436082269146197, sim=RandomSimilarity(queryNorm=false):
{}, locale=ru-RU, timezone=Asia/Ust-Nera
   [junit4]   2> NOTE: SunOS 5.11 amd64/Oracle Corporation 1.8.0_131 (64-bit)/cpus=3,threads=1,free=294384544,total=437256192
   [junit4]   2> NOTE: All tests run in this JVM: [TestStressAdvance, LimitedFiniteStringsIteratorTest,
TestMultiCollector, TestIndexWriterCommit, TestIndexWriterDeleteByQuery, TestIndexedDISI,
TestMultiTermQueryRewrites, TestDeletionPolicy, TestSpanContainQuery, TestIntsRef, TestSparseFixedBitSet,
TestByteBlockPool, TestMultiFields, TestReaderClosed, TestIndexWriterNRTIsCurrent, TestPackedInts,
Test2BNumericDocValues, TestMixedDocValuesUpdates]
   [junit4] Completed [48/454 (1!)] on J1 in 0.71s, 4 tests, 1 failure, 1 skipped <<<
FAILURES!

[...truncated 56144 lines...]

Mime
View raw message