lucene-dev mailing list archives

Site index · List index
Message view « Date » · « Thread »
Top « Date » · « Thread »
From Apache Jenkins Server <jenk...@builds.apache.org>
Subject [JENKINS] Lucene-Solr-Tests-master - Build # 1963 - Still Unstable
Date Tue, 11 Jul 2017 09:31:34 GMT
Build: https://builds.apache.org/job/Lucene-Solr-Tests-master/1963/

4 tests failed.
FAILED:  org.apache.solr.schema.TestPointFields.testFloatPointStats

Error Message:
Exception during query

Stack Trace:
java.lang.RuntimeException: Exception during query
	at __randomizedtesting.SeedInfo.seed([C207507C2F49A635:780D285B975864D7]:0)
	at org.apache.solr.SolrTestCaseJ4.assertQ(SolrTestCaseJ4.java:878)
	at org.apache.solr.SolrTestCaseJ4.assertQ(SolrTestCaseJ4.java:845)
	at org.apache.solr.schema.TestPointFields.testPointStats(TestPointFields.java:2197)
	at org.apache.solr.schema.TestPointFields.testFloatPointStats(TestPointFields.java:989)
	at sun.reflect.NativeMethodAccessorImpl.invoke0(Native Method)
	at sun.reflect.NativeMethodAccessorImpl.invoke(NativeMethodAccessorImpl.java:62)
	at sun.reflect.DelegatingMethodAccessorImpl.invoke(DelegatingMethodAccessorImpl.java:43)
	at java.lang.reflect.Method.invoke(Method.java:498)
	at com.carrotsearch.randomizedtesting.RandomizedRunner.invoke(RandomizedRunner.java:1713)
	at com.carrotsearch.randomizedtesting.RandomizedRunner$8.evaluate(RandomizedRunner.java:907)
	at com.carrotsearch.randomizedtesting.RandomizedRunner$9.evaluate(RandomizedRunner.java:943)
	at com.carrotsearch.randomizedtesting.RandomizedRunner$10.evaluate(RandomizedRunner.java:957)
	at com.carrotsearch.randomizedtesting.rules.SystemPropertiesRestoreRule$1.evaluate(SystemPropertiesRestoreRule.java:57)
	at org.apache.lucene.util.TestRuleSetupTeardownChained$1.evaluate(TestRuleSetupTeardownChained.java:49)
	at org.apache.lucene.util.AbstractBeforeAfterRule$1.evaluate(AbstractBeforeAfterRule.java:45)
	at org.apache.lucene.util.TestRuleThreadAndTestName$1.evaluate(TestRuleThreadAndTestName.java:48)
	at org.apache.lucene.util.TestRuleIgnoreAfterMaxFailures$1.evaluate(TestRuleIgnoreAfterMaxFailures.java:64)
	at org.apache.lucene.util.TestRuleMarkFailure$1.evaluate(TestRuleMarkFailure.java:47)
	at com.carrotsearch.randomizedtesting.rules.StatementAdapter.evaluate(StatementAdapter.java:36)
	at com.carrotsearch.randomizedtesting.ThreadLeakControl$StatementRunner.run(ThreadLeakControl.java:368)
	at com.carrotsearch.randomizedtesting.ThreadLeakControl.forkTimeoutingTask(ThreadLeakControl.java:817)
	at com.carrotsearch.randomizedtesting.ThreadLeakControl$3.evaluate(ThreadLeakControl.java:468)
	at com.carrotsearch.randomizedtesting.RandomizedRunner.runSingleTest(RandomizedRunner.java:916)
	at com.carrotsearch.randomizedtesting.RandomizedRunner$5.evaluate(RandomizedRunner.java:802)
	at com.carrotsearch.randomizedtesting.RandomizedRunner$6.evaluate(RandomizedRunner.java:852)
	at com.carrotsearch.randomizedtesting.RandomizedRunner$7.evaluate(RandomizedRunner.java:863)
	at com.carrotsearch.randomizedtesting.rules.StatementAdapter.evaluate(StatementAdapter.java:36)
	at com.carrotsearch.randomizedtesting.rules.SystemPropertiesRestoreRule$1.evaluate(SystemPropertiesRestoreRule.java:57)
	at org.apache.lucene.util.AbstractBeforeAfterRule$1.evaluate(AbstractBeforeAfterRule.java:45)
	at com.carrotsearch.randomizedtesting.rules.StatementAdapter.evaluate(StatementAdapter.java:36)
	at org.apache.lucene.util.TestRuleStoreClassName$1.evaluate(TestRuleStoreClassName.java:41)
	at com.carrotsearch.randomizedtesting.rules.NoShadowingOrOverridesOnMethodsRule$1.evaluate(NoShadowingOrOverridesOnMethodsRule.java:40)
	at com.carrotsearch.randomizedtesting.rules.NoShadowingOrOverridesOnMethodsRule$1.evaluate(NoShadowingOrOverridesOnMethodsRule.java:40)
	at com.carrotsearch.randomizedtesting.rules.StatementAdapter.evaluate(StatementAdapter.java:36)
	at com.carrotsearch.randomizedtesting.rules.StatementAdapter.evaluate(StatementAdapter.java:36)
	at com.carrotsearch.randomizedtesting.rules.StatementAdapter.evaluate(StatementAdapter.java:36)
	at org.apache.lucene.util.TestRuleAssertionsRequired$1.evaluate(TestRuleAssertionsRequired.java:53)
	at org.apache.lucene.util.TestRuleMarkFailure$1.evaluate(TestRuleMarkFailure.java:47)
	at org.apache.lucene.util.TestRuleIgnoreAfterMaxFailures$1.evaluate(TestRuleIgnoreAfterMaxFailures.java:64)
	at org.apache.lucene.util.TestRuleIgnoreTestSuites$1.evaluate(TestRuleIgnoreTestSuites.java:54)
	at com.carrotsearch.randomizedtesting.rules.StatementAdapter.evaluate(StatementAdapter.java:36)
	at com.carrotsearch.randomizedtesting.ThreadLeakControl$StatementRunner.run(ThreadLeakControl.java:368)
	at java.lang.Thread.run(Thread.java:748)
Caused by: java.lang.RuntimeException: REQUEST FAILED: xpath=//*[@numFound='11']
	xml response was: <?xml version="1.0" encoding="UTF-8"?>
<response>
<lst name="responseHeader"><int name="status">0</int><int name="QTime">10</int></lst><result name="response" numFound="21" start="0"><doc><str name="id">0</str><float name="number_p_f_dv">-55492.79</float></doc><doc><str name="id">1</str><float name="number_p_f_dv">-106.2721</float></doc><doc><str name="id">2</str><float name="number_p_f_dv">0.7366151</float></doc><doc><str name="id">3</str><float name="number_p_f_dv">58.19961</float></doc><doc><str name="id">4</str><float name="number_p_f_dv">808379.8</float></doc><doc><str name="id">5</str><float name="number_p_f_dv">845294.0</float></doc><doc><str name="id">6</str><float name="number_p_f_dv">0.3692773</float></doc><doc><str name="id">7</str><float name="number_p_f_dv">-72.29867</float></doc><doc><str name="id">8</str><float name="number_p_f_dv">0.6928944</float></doc><doc><str name="id">9</str><float name="number_p_f_dv">2.701032</float></doc></result><lst name="stats"><lst name="stats_fields"><lst name="number_p_f_dv"><double name="min">-9544631.0</double><double name="max">845294.0</double><long name="count">20</long><long name="missing">1</long><double name="sum">-9044431.469177634</double><double name="sumOfSquares">9.308412447640739E13</double><double name="mean">-452221.5734588817</double><double name="stddev">2164231.2047708626</double></lst></lst></lst>
</response>

	request was:q=*:*&stats=true&fl=id,+number_p_f_dv&wt=xml&stats.field=number_p_f_dv
	at org.apache.solr.SolrTestCaseJ4.assertQ(SolrTestCaseJ4.java:871)
	... 42 more


FAILED:  org.apache.solr.schema.TestPointFields.testIntPointStats

Error Message:
Exception during query

Stack Trace:
java.lang.RuntimeException: Exception during query
	at __randomizedtesting.SeedInfo.seed([C207507C2F49A635:A982A977B1EFB8EC]:0)
	at org.apache.solr.SolrTestCaseJ4.assertQ(SolrTestCaseJ4.java:878)
	at org.apache.solr.SolrTestCaseJ4.assertQ(SolrTestCaseJ4.java:845)
	at org.apache.solr.schema.TestPointFields.testPointStats(TestPointFields.java:2197)
	at org.apache.solr.schema.TestPointFields.testIntPointStats(TestPointFields.java:278)
	at sun.reflect.NativeMethodAccessorImpl.invoke0(Native Method)
	at sun.reflect.NativeMethodAccessorImpl.invoke(NativeMethodAccessorImpl.java:62)
	at sun.reflect.DelegatingMethodAccessorImpl.invoke(DelegatingMethodAccessorImpl.java:43)
	at java.lang.reflect.Method.invoke(Method.java:498)
	at com.carrotsearch.randomizedtesting.RandomizedRunner.invoke(RandomizedRunner.java:1713)
	at com.carrotsearch.randomizedtesting.RandomizedRunner$8.evaluate(RandomizedRunner.java:907)
	at com.carrotsearch.randomizedtesting.RandomizedRunner$9.evaluate(RandomizedRunner.java:943)
	at com.carrotsearch.randomizedtesting.RandomizedRunner$10.evaluate(RandomizedRunner.java:957)
	at com.carrotsearch.randomizedtesting.rules.SystemPropertiesRestoreRule$1.evaluate(SystemPropertiesRestoreRule.java:57)
	at org.apache.lucene.util.TestRuleSetupTeardownChained$1.evaluate(TestRuleSetupTeardownChained.java:49)
	at org.apache.lucene.util.AbstractBeforeAfterRule$1.evaluate(AbstractBeforeAfterRule.java:45)
	at org.apache.lucene.util.TestRuleThreadAndTestName$1.evaluate(TestRuleThreadAndTestName.java:48)
	at org.apache.lucene.util.TestRuleIgnoreAfterMaxFailures$1.evaluate(TestRuleIgnoreAfterMaxFailures.java:64)
	at org.apache.lucene.util.TestRuleMarkFailure$1.evaluate(TestRuleMarkFailure.java:47)
	at com.carrotsearch.randomizedtesting.rules.StatementAdapter.evaluate(StatementAdapter.java:36)
	at com.carrotsearch.randomizedtesting.ThreadLeakControl$StatementRunner.run(ThreadLeakControl.java:368)
	at com.carrotsearch.randomizedtesting.ThreadLeakControl.forkTimeoutingTask(ThreadLeakControl.java:817)
	at com.carrotsearch.randomizedtesting.ThreadLeakControl$3.evaluate(ThreadLeakControl.java:468)
	at com.carrotsearch.randomizedtesting.RandomizedRunner.runSingleTest(RandomizedRunner.java:916)
	at com.carrotsearch.randomizedtesting.RandomizedRunner$5.evaluate(RandomizedRunner.java:802)
	at com.carrotsearch.randomizedtesting.RandomizedRunner$6.evaluate(RandomizedRunner.java:852)
	at com.carrotsearch.randomizedtesting.RandomizedRunner$7.evaluate(RandomizedRunner.java:863)
	at com.carrotsearch.randomizedtesting.rules.StatementAdapter.evaluate(StatementAdapter.java:36)
	at com.carrotsearch.randomizedtesting.rules.SystemPropertiesRestoreRule$1.evaluate(SystemPropertiesRestoreRule.java:57)
	at org.apache.lucene.util.AbstractBeforeAfterRule$1.evaluate(AbstractBeforeAfterRule.java:45)
	at com.carrotsearch.randomizedtesting.rules.StatementAdapter.evaluate(StatementAdapter.java:36)
	at org.apache.lucene.util.TestRuleStoreClassName$1.evaluate(TestRuleStoreClassName.java:41)
	at com.carrotsearch.randomizedtesting.rules.NoShadowingOrOverridesOnMethodsRule$1.evaluate(NoShadowingOrOverridesOnMethodsRule.java:40)
	at com.carrotsearch.randomizedtesting.rules.NoShadowingOrOverridesOnMethodsRule$1.evaluate(NoShadowingOrOverridesOnMethodsRule.java:40)
	at com.carrotsearch.randomizedtesting.rules.StatementAdapter.evaluate(StatementAdapter.java:36)
	at com.carrotsearch.randomizedtesting.rules.StatementAdapter.evaluate(StatementAdapter.java:36)
	at com.carrotsearch.randomizedtesting.rules.StatementAdapter.evaluate(StatementAdapter.java:36)
	at org.apache.lucene.util.TestRuleAssertionsRequired$1.evaluate(TestRuleAssertionsRequired.java:53)
	at org.apache.lucene.util.TestRuleMarkFailure$1.evaluate(TestRuleMarkFailure.java:47)
	at org.apache.lucene.util.TestRuleIgnoreAfterMaxFailures$1.evaluate(TestRuleIgnoreAfterMaxFailures.java:64)
	at org.apache.lucene.util.TestRuleIgnoreTestSuites$1.evaluate(TestRuleIgnoreTestSuites.java:54)
	at com.carrotsearch.randomizedtesting.rules.StatementAdapter.evaluate(StatementAdapter.java:36)
	at com.carrotsearch.randomizedtesting.ThreadLeakControl$StatementRunner.run(ThreadLeakControl.java:368)
	at java.lang.Thread.run(Thread.java:748)
Caused by: java.lang.RuntimeException: REQUEST FAILED: xpath=//*[@numFound='11']
	xml response was: <?xml version="1.0" encoding="UTF-8"?>
<response>
<lst name="responseHeader"><int name="status">0</int><int name="QTime">0</int></lst><result name="response" numFound="21" start="0"><doc><str name="id">0</str><int name="number_p_i_dv">-7608124</int></doc><doc><str name="id">1</str><int name="number_p_i_dv">-6679711</int></doc><doc><str name="id">2</str><int name="number_p_i_dv">-9873652</int></doc><doc><str name="id">3</str><int name="number_p_i_dv">1238736</int></doc><doc><str name="id">4</str><int name="number_p_i_dv">6990111</int></doc><doc><str name="id">5</str><int name="number_p_i_dv">-1370664</int></doc><doc><str name="id">6</str><int name="number_p_i_dv">-902802</int></doc><doc><str name="id">7</str><int name="number_p_i_dv">3741121</int></doc><doc><str name="id">8</str><int name="number_p_i_dv">-3404100</int></doc><doc><str name="id">9</str><int name="number_p_i_dv">1621992</int></doc></result><lst name="stats"><lst name="stats_fields"><lst name="number_p_i_dv"><double name="min">-9873652.0</double><double name="max">7841428.0</double><long name="count">20</long><long name="missing">1</long><double name="sum">-2.4033495E7</double><double name="sumOfSquares">5.55348924818335E14</double><double name="mean">-1201674.75</double><double name="stddev">5263921.295617154</double></lst></lst></lst>
</response>

	request was:q=*:*&stats=true&fl=id,+number_p_i_dv&wt=xml&stats.field=number_p_i_dv
	at org.apache.solr.SolrTestCaseJ4.assertQ(SolrTestCaseJ4.java:871)
	... 42 more


FAILED:  org.apache.solr.schema.TestPointFields.testLongPointStats

Error Message:
Exception during query

Stack Trace:
java.lang.RuntimeException: Exception during query
	at __randomizedtesting.SeedInfo.seed([C207507C2F49A635:75FAC6A9041C5250]:0)
	at org.apache.solr.SolrTestCaseJ4.assertQ(SolrTestCaseJ4.java:878)
	at org.apache.solr.SolrTestCaseJ4.assertQ(SolrTestCaseJ4.java:845)
	at org.apache.solr.schema.TestPointFields.testPointStats(TestPointFields.java:2197)
	at org.apache.solr.schema.TestPointFields.testLongPointStats(TestPointFields.java:1251)
	at sun.reflect.NativeMethodAccessorImpl.invoke0(Native Method)
	at sun.reflect.NativeMethodAccessorImpl.invoke(NativeMethodAccessorImpl.java:62)
	at sun.reflect.DelegatingMethodAccessorImpl.invoke(DelegatingMethodAccessorImpl.java:43)
	at java.lang.reflect.Method.invoke(Method.java:498)
	at com.carrotsearch.randomizedtesting.RandomizedRunner.invoke(RandomizedRunner.java:1713)
	at com.carrotsearch.randomizedtesting.RandomizedRunner$8.evaluate(RandomizedRunner.java:907)
	at com.carrotsearch.randomizedtesting.RandomizedRunner$9.evaluate(RandomizedRunner.java:943)
	at com.carrotsearch.randomizedtesting.RandomizedRunner$10.evaluate(RandomizedRunner.java:957)
	at com.carrotsearch.randomizedtesting.rules.SystemPropertiesRestoreRule$1.evaluate(SystemPropertiesRestoreRule.java:57)
	at org.apache.lucene.util.TestRuleSetupTeardownChained$1.evaluate(TestRuleSetupTeardownChained.java:49)
	at org.apache.lucene.util.AbstractBeforeAfterRule$1.evaluate(AbstractBeforeAfterRule.java:45)
	at org.apache.lucene.util.TestRuleThreadAndTestName$1.evaluate(TestRuleThreadAndTestName.java:48)
	at org.apache.lucene.util.TestRuleIgnoreAfterMaxFailures$1.evaluate(TestRuleIgnoreAfterMaxFailures.java:64)
	at org.apache.lucene.util.TestRuleMarkFailure$1.evaluate(TestRuleMarkFailure.java:47)
	at com.carrotsearch.randomizedtesting.rules.StatementAdapter.evaluate(StatementAdapter.java:36)
	at com.carrotsearch.randomizedtesting.ThreadLeakControl$StatementRunner.run(ThreadLeakControl.java:368)
	at com.carrotsearch.randomizedtesting.ThreadLeakControl.forkTimeoutingTask(ThreadLeakControl.java:817)
	at com.carrotsearch.randomizedtesting.ThreadLeakControl$3.evaluate(ThreadLeakControl.java:468)
	at com.carrotsearch.randomizedtesting.RandomizedRunner.runSingleTest(RandomizedRunner.java:916)
	at com.carrotsearch.randomizedtesting.RandomizedRunner$5.evaluate(RandomizedRunner.java:802)
	at com.carrotsearch.randomizedtesting.RandomizedRunner$6.evaluate(RandomizedRunner.java:852)
	at com.carrotsearch.randomizedtesting.RandomizedRunner$7.evaluate(RandomizedRunner.java:863)
	at com.carrotsearch.randomizedtesting.rules.StatementAdapter.evaluate(StatementAdapter.java:36)
	at com.carrotsearch.randomizedtesting.rules.SystemPropertiesRestoreRule$1.evaluate(SystemPropertiesRestoreRule.java:57)
	at org.apache.lucene.util.AbstractBeforeAfterRule$1.evaluate(AbstractBeforeAfterRule.java:45)
	at com.carrotsearch.randomizedtesting.rules.StatementAdapter.evaluate(StatementAdapter.java:36)
	at org.apache.lucene.util.TestRuleStoreClassName$1.evaluate(TestRuleStoreClassName.java:41)
	at com.carrotsearch.randomizedtesting.rules.NoShadowingOrOverridesOnMethodsRule$1.evaluate(NoShadowingOrOverridesOnMethodsRule.java:40)
	at com.carrotsearch.randomizedtesting.rules.NoShadowingOrOverridesOnMethodsRule$1.evaluate(NoShadowingOrOverridesOnMethodsRule.java:40)
	at com.carrotsearch.randomizedtesting.rules.StatementAdapter.evaluate(StatementAdapter.java:36)
	at com.carrotsearch.randomizedtesting.rules.StatementAdapter.evaluate(StatementAdapter.java:36)
	at com.carrotsearch.randomizedtesting.rules.StatementAdapter.evaluate(StatementAdapter.java:36)
	at org.apache.lucene.util.TestRuleAssertionsRequired$1.evaluate(TestRuleAssertionsRequired.java:53)
	at org.apache.lucene.util.TestRuleMarkFailure$1.evaluate(TestRuleMarkFailure.java:47)
	at org.apache.lucene.util.TestRuleIgnoreAfterMaxFailures$1.evaluate(TestRuleIgnoreAfterMaxFailures.java:64)
	at org.apache.lucene.util.TestRuleIgnoreTestSuites$1.evaluate(TestRuleIgnoreTestSuites.java:54)
	at com.carrotsearch.randomizedtesting.rules.StatementAdapter.evaluate(StatementAdapter.java:36)
	at com.carrotsearch.randomizedtesting.ThreadLeakControl$StatementRunner.run(ThreadLeakControl.java:368)
	at java.lang.Thread.run(Thread.java:748)
Caused by: java.lang.RuntimeException: REQUEST FAILED: xpath=//*[@numFound='11']
	xml response was: <?xml version="1.0" encoding="UTF-8"?>
<response>
<lst name="responseHeader"><int name="status">0</int><int name="QTime">0</int></lst><result name="response" numFound="21" start="0"><doc><str name="id">0</str><long name="number_p_l_dv">-3250665</long></doc><doc><str name="id">1</str><long name="number_p_l_dv">6419057</long></doc><doc><str name="id">2</str><long name="number_p_l_dv">7214141</long></doc><doc><str name="id">3</str><long name="number_p_l_dv">9224211</long></doc><doc><str name="id">4</str><long name="number_p_l_dv">9805784</long></doc><doc><str name="id">5</str><long name="number_p_l_dv">-1167345</long></doc><doc><str name="id">6</str><long name="number_p_l_dv">-160942</long></doc><doc><str name="id">7</str><long name="number_p_l_dv">4297260</long></doc><doc><str name="id">8</str><long name="number_p_l_dv">-7957778</long></doc><doc><str name="id">9</str><long name="number_p_l_dv">-4248486</long></doc></result><lst name="stats"><lst name="stats_fields"><lst name="number_p_l_dv"><double name="min">-9677660.0</double><double name="max">9816051.0</double><long name="count">20</long><long name="missing">1</long><double name="sum">2.0865638E7</double><double name="sumOfSquares">7.8607082421771E14</double><double name="mean">1043281.9</double><double name="stddev">6342430.555852252</double></lst></lst></lst>
</response>

	request was:q=*:*&stats=true&fl=id,+number_p_l_dv&wt=xml&stats.field=number_p_l_dv
	at org.apache.solr.SolrTestCaseJ4.assertQ(SolrTestCaseJ4.java:871)
	... 42 more


FAILED:  org.apache.solr.schema.TestPointFields.testDoublePointStats

Error Message:
Exception during query

Stack Trace:
java.lang.RuntimeException: Exception during query
	at __randomizedtesting.SeedInfo.seed([C207507C2F49A635:ED1D9E2ADBE4BA91]:0)
	at org.apache.solr.SolrTestCaseJ4.assertQ(SolrTestCaseJ4.java:878)
	at org.apache.solr.SolrTestCaseJ4.assertQ(SolrTestCaseJ4.java:845)
	at org.apache.solr.schema.TestPointFields.testPointStats(TestPointFields.java:2197)
	at org.apache.solr.schema.TestPointFields.testDoublePointStats(TestPointFields.java:689)
	at sun.reflect.NativeMethodAccessorImpl.invoke0(Native Method)
	at sun.reflect.NativeMethodAccessorImpl.invoke(NativeMethodAccessorImpl.java:62)
	at sun.reflect.DelegatingMethodAccessorImpl.invoke(DelegatingMethodAccessorImpl.java:43)
	at java.lang.reflect.Method.invoke(Method.java:498)
	at com.carrotsearch.randomizedtesting.RandomizedRunner.invoke(RandomizedRunner.java:1713)
	at com.carrotsearch.randomizedtesting.RandomizedRunner$8.evaluate(RandomizedRunner.java:907)
	at com.carrotsearch.randomizedtesting.RandomizedRunner$9.evaluate(RandomizedRunner.java:943)
	at com.carrotsearch.randomizedtesting.RandomizedRunner$10.evaluate(RandomizedRunner.java:957)
	at com.carrotsearch.randomizedtesting.rules.SystemPropertiesRestoreRule$1.evaluate(SystemPropertiesRestoreRule.java:57)
	at org.apache.lucene.util.TestRuleSetupTeardownChained$1.evaluate(TestRuleSetupTeardownChained.java:49)
	at org.apache.lucene.util.AbstractBeforeAfterRule$1.evaluate(AbstractBeforeAfterRule.java:45)
	at org.apache.lucene.util.TestRuleThreadAndTestName$1.evaluate(TestRuleThreadAndTestName.java:48)
	at org.apache.lucene.util.TestRuleIgnoreAfterMaxFailures$1.evaluate(TestRuleIgnoreAfterMaxFailures.java:64)
	at org.apache.lucene.util.TestRuleMarkFailure$1.evaluate(TestRuleMarkFailure.java:47)
	at com.carrotsearch.randomizedtesting.rules.StatementAdapter.evaluate(StatementAdapter.java:36)
	at com.carrotsearch.randomizedtesting.ThreadLeakControl$StatementRunner.run(ThreadLeakControl.java:368)
	at com.carrotsearch.randomizedtesting.ThreadLeakControl.forkTimeoutingTask(ThreadLeakControl.java:817)
	at com.carrotsearch.randomizedtesting.ThreadLeakControl$3.evaluate(ThreadLeakControl.java:468)
	at com.carrotsearch.randomizedtesting.RandomizedRunner.runSingleTest(RandomizedRunner.java:916)
	at com.carrotsearch.randomizedtesting.RandomizedRunner$5.evaluate(RandomizedRunner.java:802)
	at com.carrotsearch.randomizedtesting.RandomizedRunner$6.evaluate(RandomizedRunner.java:852)
	at com.carrotsearch.randomizedtesting.RandomizedRunner$7.evaluate(RandomizedRunner.java:863)
	at com.carrotsearch.randomizedtesting.rules.StatementAdapter.evaluate(StatementAdapter.java:36)
	at com.carrotsearch.randomizedtesting.rules.SystemPropertiesRestoreRule$1.evaluate(SystemPropertiesRestoreRule.java:57)
	at org.apache.lucene.util.AbstractBeforeAfterRule$1.evaluate(AbstractBeforeAfterRule.java:45)
	at com.carrotsearch.randomizedtesting.rules.StatementAdapter.evaluate(StatementAdapter.java:36)
	at org.apache.lucene.util.TestRuleStoreClassName$1.evaluate(TestRuleStoreClassName.java:41)
	at com.carrotsearch.randomizedtesting.rules.NoShadowingOrOverridesOnMethodsRule$1.evaluate(NoShadowingOrOverridesOnMethodsRule.java:40)
	at com.carrotsearch.randomizedtesting.rules.NoShadowingOrOverridesOnMethodsRule$1.evaluate(NoShadowingOrOverridesOnMethodsRule.java:40)
	at com.carrotsearch.randomizedtesting.rules.StatementAdapter.evaluate(StatementAdapter.java:36)
	at com.carrotsearch.randomizedtesting.rules.StatementAdapter.evaluate(StatementAdapter.java:36)
	at com.carrotsearch.randomizedtesting.rules.StatementAdapter.evaluate(StatementAdapter.java:36)
	at org.apache.lucene.util.TestRuleAssertionsRequired$1.evaluate(TestRuleAssertionsRequired.java:53)
	at org.apache.lucene.util.TestRuleMarkFailure$1.evaluate(TestRuleMarkFailure.java:47)
	at org.apache.lucene.util.TestRuleIgnoreAfterMaxFailures$1.evaluate(TestRuleIgnoreAfterMaxFailures.java:64)
	at org.apache.lucene.util.TestRuleIgnoreTestSuites$1.evaluate(TestRuleIgnoreTestSuites.java:54)
	at com.carrotsearch.randomizedtesting.rules.StatementAdapter.evaluate(StatementAdapter.java:36)
	at com.carrotsearch.randomizedtesting.ThreadLeakControl$StatementRunner.run(ThreadLeakControl.java:368)
	at java.lang.Thread.run(Thread.java:748)
Caused by: java.lang.RuntimeException: REQUEST FAILED: xpath=//*[@numFound='11']
	xml response was: <?xml version="1.0" encoding="UTF-8"?>
<response>
<lst name="responseHeader"><int name="status">0</int><int name="QTime">0</int></lst><result name="response" numFound="21" start="0"><doc><str name="id">0</str><double name="number_p_d_dv">-68.62215</double></doc><doc><str name="id">1</str><double name="number_p_d_dv">-395.244</double></doc><doc><str name="id">2</str><double name="number_p_d_dv">-51252.55</double></doc><doc><str name="id">3</str><double name="number_p_d_dv">-73.87759</double></doc><doc><str name="id">4</str><double name="number_p_d_dv">-419032.0</double></doc><doc><str name="id">5</str><double name="number_p_d_dv">-0.9905426</double></doc><doc><str name="id">6</str><double name="number_p_d_dv">44059.21</double></doc><doc><str name="id">7</str><double name="number_p_d_dv">28157.01</double></doc><doc><str name="id">8</str><double name="number_p_d_dv">-73567.8</double></doc><doc><str name="id">9</str><double name="number_p_d_dv">38.14302</double></doc></result><lst name="stats"><lst name="stats_fields"><lst name="number_p_d_dv"><double name="min">-749648.1</double><double name="max">9425366.0</double><long name="count">20</long><long name="missing">1</long><double name="sum">1.5349057482022401E7</double><double name="sumOfSquares">1.3194489279993897E14</double><double name="mean">767452.87410112</double><double name="stddev">2514852.873384315</double></lst></lst></lst>
</response>

	request was:q=*:*&stats=true&fl=id,+number_p_d_dv&wt=xml&stats.field=number_p_d_dv
	at org.apache.solr.SolrTestCaseJ4.assertQ(SolrTestCaseJ4.java:871)
	... 42 more




Build Log:
[...truncated 10899 lines...]
   [junit4] Suite: org.apache.solr.schema.TestPointFields
   [junit4]   2> Creating dataDir: /home/jenkins/jenkins-slave/workspace/Lucene-Solr-Tests-master/solr/build/solr-core/test/J1/temp/solr.schema.TestPointFields_C207507C2F49A635-001/init-core-data-001
   [junit4]   2> 108886 WARN  (SUITE-TestPointFields-seed#[C207507C2F49A635]-worker) [    ] o.a.s.SolrTestCaseJ4 startTrackingSearchers: numOpens=1 numCloses=1
   [junit4]   2> 108886 INFO  (SUITE-TestPointFields-seed#[C207507C2F49A635]-worker) [    ] o.a.s.SolrTestCaseJ4 Using PointFields (NUMERIC_POINTS_SYSPROP=true) w/NUMERIC_DOCVALUES_SYSPROP=true
   [junit4]   2> 108887 INFO  (SUITE-TestPointFields-seed#[C207507C2F49A635]-worker) [    ] o.a.s.SolrTestCaseJ4 Randomized ssl (true) and clientAuth (true) via: @org.apache.solr.util.RandomizeSSL(reason=, value=NaN, ssl=NaN, clientAuth=NaN)
   [junit4]   2> 108888 INFO  (SUITE-TestPointFields-seed#[C207507C2F49A635]-worker) [    ] o.a.s.SolrTestCaseJ4 ####initCore
   [junit4]   2> 108889 INFO  (SUITE-TestPointFields-seed#[C207507C2F49A635]-worker) [    ] o.a.s.c.SolrResourceLoader [null] Added 2 libs to classloader, from paths: [/home/jenkins/jenkins-slave/workspace/Lucene-Solr-Tests-master/solr/core/src/test-files/solr/collection1/lib, /home/jenkins/jenkins-slave/workspace/Lucene-Solr-Tests-master/solr/core/src/test-files/solr/collection1/lib/classes]
   [junit4]   2> 108910 INFO  (SUITE-TestPointFields-seed#[C207507C2F49A635]-worker) [    ] o.a.s.c.SolrConfig Using Lucene MatchVersion: 8.0.0
   [junit4]   2> 108934 INFO  (SUITE-TestPointFields-seed#[C207507C2F49A635]-worker) [    ] o.a.s.s.IndexSchema [null] Schema name=schema-point
   [junit4]   2> 108962 INFO  (SUITE-TestPointFields-seed#[C207507C2F49A635]-worker) [    ] o.a.s.s.IndexSchema Loaded schema schema-point/1.6 with uniqueid field id
   [junit4]   2> 109006 INFO  (SUITE-TestPointFields-seed#[C207507C2F49A635]-worker) [    ] o.a.s.m.r.SolrJmxReporter JMX monitoring for 'solr.node' (registry 'solr.node') enabled at server: com.sun.jmx.mbeanserver.JmxMBeanServer@798d7f0c
   [junit4]   2> 109009 INFO  (SUITE-TestPointFields-seed#[C207507C2F49A635]-worker) [    ] o.a.s.m.r.SolrJmxReporter JMX monitoring for 'solr.jvm' (registry 'solr.jvm') enabled at server: com.sun.jmx.mbeanserver.JmxMBeanServer@798d7f0c
   [junit4]   2> 109009 INFO  (SUITE-TestPointFields-seed#[C207507C2F49A635]-worker) [    ] o.a.s.m.r.SolrJmxReporter JMX monitoring for 'solr.jetty' (registry 'solr.jetty') enabled at server: com.sun.jmx.mbeanserver.JmxMBeanServer@798d7f0c
   [junit4]   2> 109024 INFO  (coreLoadExecutor-484-thread-1) [    x:collection1] o.a.s.c.SolrResourceLoader [null] Added 2 libs to classloader, from paths: [/home/jenkins/jenkins-slave/workspace/Lucene-Solr-Tests-master/solr/core/src/test-files/solr/collection1/lib, /home/jenkins/jenkins-slave/workspace/Lucene-Solr-Tests-master/solr/core/src/test-files/solr/collection1/lib/classes]
   [junit4]   2> 109047 INFO  (coreLoadExecutor-484-thread-1) [    x:collection1] o.a.s.c.SolrConfig Using Lucene MatchVersion: 8.0.0
   [junit4]   2> 109065 INFO  (coreLoadExecutor-484-thread-1) [    x:collection1] o.a.s.s.IndexSchema [collection1] Schema name=schema-point
   [junit4]   2> 109071 INFO  (coreLoadExecutor-484-thread-1) [    x:collection1] o.a.s.s.IndexSchema Loaded schema schema-point/1.6 with uniqueid field id
   [junit4]   2> 109071 INFO  (coreLoadExecutor-484-thread-1) [    x:collection1] o.a.s.c.CoreContainer Creating SolrCore 'collection1' using configuration from instancedir /home/jenkins/jenkins-slave/workspace/Lucene-Solr-Tests-master/solr/core/src/test-files/solr/collection1, trusted=true
   [junit4]   2> 109071 INFO  (coreLoadExecutor-484-thread-1) [    x:collection1] o.a.s.m.r.SolrJmxReporter JMX monitoring for 'solr.core.collection1' (registry 'solr.core.collection1') enabled at server: com.sun.jmx.mbeanserver.JmxMBeanServer@798d7f0c
   [junit4]   2> 109071 INFO  (coreLoadExecutor-484-thread-1) [    x:collection1] o.a.s.c.SolrCore solr.RecoveryStrategy.Builder
   [junit4]   2> 109071 INFO  (coreLoadExecutor-484-thread-1) [    x:collection1] o.a.s.c.SolrCore [[collection1] ] Opening new SolrCore at [/home/jenkins/jenkins-slave/workspace/Lucene-Solr-Tests-master/solr/core/src/test-files/solr/collection1], dataDir=[/home/jenkins/jenkins-slave/workspace/Lucene-Solr-Tests-master/solr/build/solr-core/test/J1/temp/solr.schema.TestPointFields_C207507C2F49A635-001/init-core-data-001/]
   [junit4]   2> 109073 INFO  (coreLoadExecutor-484-thread-1) [    x:collection1] o.a.s.u.RandomMergePolicy RandomMergePolicy wrapping class org.apache.lucene.index.LogDocMergePolicy: [LogDocMergePolicy: minMergeSize=1000, mergeFactor=41, maxMergeSize=9223372036854775807, maxMergeSizeForForcedMerge=9223372036854775807, calibrateSizeByDeletes=true, maxMergeDocs=2147483647, maxCFSSegmentSizeMB=8.796093022207999E12, noCFSRatio=0.0]
   [junit4]   2> 109173 INFO  (coreLoadExecutor-484-thread-1) [    x:collection1] o.a.s.u.UpdateHandler Using UpdateLog implementation: org.apache.solr.update.UpdateLog
   [junit4]   2> 109173 INFO  (coreLoadExecutor-484-thread-1) [    x:collection1] o.a.s.u.UpdateLog Initializing UpdateLog: dataDir= defaultSyncLevel=FLUSH numRecordsToKeep=100 maxNumLogsToKeep=10 numVersionBuckets=65536
   [junit4]   2> 109174 INFO  (coreLoadExecutor-484-thread-1) [    x:collection1] o.a.s.u.CommitTracker Hard AutoCommit: disabled
   [junit4]   2> 109174 INFO  (coreLoadExecutor-484-thread-1) [    x:collection1] o.a.s.u.CommitTracker Soft AutoCommit: disabled
   [junit4]   2> 109175 INFO  (coreLoadExecutor-484-thread-1) [    x:collection1] o.a.s.u.RandomMergePolicy RandomMergePolicy wrapping class org.apache.lucene.index.TieredMergePolicy: [TieredMergePolicy: maxMergeAtOnce=26, maxMergeAtOnceExplicit=11, maxMergedSegmentMB=76.0849609375, floorSegmentMB=0.326171875, forceMergeDeletesPctAllowed=18.3260541892638, segmentsPerTier=11.0, maxCFSSegmentSizeMB=8.796093022207999E12, noCFSRatio=0.0
   [junit4]   2> 109175 INFO  (coreLoadExecutor-484-thread-1) [    x:collection1] o.a.s.s.SolrIndexSearcher Opening [Searcher@5ef465d1[collection1] main]
   [junit4]   2> 109176 INFO  (coreLoadExecutor-484-thread-1) [    x:collection1] o.a.s.h.c.SpellCheckComponent Initializing spell checkers
   [junit4]   2> 109192 INFO  (coreLoadExecutor-484-thread-1) [    x:collection1] o.a.s.s.DirectSolrSpellChecker init: {name=direct,classname=DirectSolrSpellChecker,field=lowerfilt,minQueryLength=3}
   [junit4]   2> 109224 INFO  (coreLoadExecutor-484-thread-1) [    x:collection1] o.a.s.h.ReplicationHandler Commits will be reserved for  10000
   [junit4]   2> 109224 INFO  (coreLoadExecutor-484-thread-1) [    x:collection1] o.a.s.u.UpdateLog Could not find max version in index or recent updates, using new clock 1572615431232946176
   [junit4]   2> 109225 INFO  (searcherExecutor-485-thread-1-processing-x:collection1) [    x:collection1] o.a.s.h.c.SpellCheckComponent Loading spell index for spellchecker: default
   [junit4]   2> 109226 INFO  (searcherExecutor-485-thread-1-processing-x:collection1) [    x:collection1] o.a.s.h.c.SpellCheckComponent Loading spell index for spellchecker: direct
   [junit4]   2> 109226 INFO  (searcherExecutor-485-thread-1-processing-x:collection1) [    x:collection1] o.a.s.h.c.SpellCheckComponent Loading spell index for spellchecker: wordbreak
   [junit4]   2> 109226 INFO  (searcherExecutor-485-thread-1-processing-x:collection1) [    x:collection1] o.a.s.h.c.SpellCheckComponent Loading spell index for spellchecker: multipleFields
   [junit4]   2> 109226 INFO  (searcherExecutor-485-thread-1-processing-x:collection1) [    x:collection1] o.a.s.h.c.SpellCheckComponent Loading spell index for spellchecker: jarowinkler
   [junit4]   2> 109226 INFO  (searcherExecutor-485-thread-1-processing-x:collection1) [    x:collection1] o.a.s.h.c.SpellCheckComponent Loading spell index for spellchecker: external
   [junit4]   2> 109227 INFO  (searcherExecutor-485-thread-1-processing-x:collection1) [    x:collection1] o.a.s.h.c.SpellCheckComponent Loading spell index for spellchecker: freq
   [junit4]   2> 109227 INFO  (SUITE-TestPointFields-seed#[C207507C2F49A635]-worker) [    ] o.a.s.SolrTestCaseJ4 ####initCore end
   [junit4]   2> 109227 INFO  (searcherExecutor-485-thread-1-processing-x:collection1) [    x:collection1] o.a.s.h.c.SpellCheckComponent Loading spell index for spellchecker: fqcn
   [junit4]   2> 109227 INFO  (searcherExecutor-485-thread-1-processing-x:collection1) [    x:collection1] o.a.s.h.c.SpellCheckComponent Loading spell index for spellchecker: perDict
   [junit4]   2> 109229 INFO  (searcherExecutor-485-thread-1-processing-x:collection1) [    x:collection1] o.a.s.c.SolrCore [collection1] Registered new searcher Searcher@5ef465d1[collection1] main{ExitableDirectoryReader(UninvertingDirectoryReader())}
   [junit4]   2> 109230 INFO  (TEST-TestPointFields.testLongPointSetQuery-seed#[C207507C2F49A635]) [    ] o.a.s.SolrTestCaseJ4 ###Starting testLongPointSetQuery
   [junit4]   2> 109234 INFO  (TEST-TestPointFields.testLongPointSetQuery-seed#[C207507C2F49A635]) [    ] o.a.s.u.p.LogUpdateProcessorFactory [collection1]  webapp=null path=null params={}{add=[0 (1572615431241334784)]} 0 1
   [junit4]   2> 109236 INFO  (TEST-TestPointFields.testLongPointSetQuery-seed#[C207507C2F49A635]) [    ] o.a.s.u.p.LogUpdateProcessorFactory [collection1]  webapp=null path=null params={}{add=[1 (1572615431245529088)]} 0 0
   [junit4]   2> 109236 INFO  (TEST-TestPointFields.testLongPointSetQuery-seed#[C207507C2F49A635]) [    ] o.a.s.u.p.LogUpdateProcessorFactory [collection1]  webapp=null path=null params={}{add=[2 (1572615431245529089)]} 0 0
   [junit4]   2> 109237 INFO  (TEST-TestPointFields.testLongPointSetQuery-seed#[C207507C2F49A635]) [    ] o.a.s.u.p.LogUpdateProcessorFactory [collection1]  webapp=null path=null params={}{add=[3 (1572615431245529090)]} 0 0
   [junit4]   2> 109237 INFO  (TEST-TestPointFields.testLongPointSetQuery-seed#[C207507C2F49A635]) [    ] o.a.s.u.p.LogUpdateProcessorFactory [collection1]  webapp=null path=null params={}{add=[4 (1572615431246577664)]} 0 0
   [junit4]   2> 109237 INFO  (TEST-TestPointFields.testLongPointSetQuery-seed#[C207507C2F49A635]) [    ] o.a.s.u.p.LogUpdateProcessorFactory [collection1]  webapp=null path=null params={}{add=[5 (1572615431246577665)]} 0 0
   [junit4]   2> 109238 INFO  (TEST-TestPointFields.testLongPointSetQuery-seed#[C207507C2F49A635]) [    ] o.a.s.u.p.LogUpdateProcessorFactory [collection1]  webapp=null path=null params={}{add=[6 (1572615431247626240)]} 0 0
   [junit4]   2> 109238 INFO  (TEST-TestPointFields.testLongPointSetQuery-seed#[C207507C2F49A635]) [    ] o.a.s.u.p.LogUpdateProcessorFactory [collection1]  webapp=null path=null params={}{add=[7 (1572615431247626241)]} 0 0
   [junit4]   2> 109238 INFO  (TEST-TestPointFields.testLongPointSetQuery-seed#[C207507C2F49A635]) [    ] o.a.s.u.p.LogUpdateProcessorFactory [collection1]  webapp=null path=null params={}{add=[8 (1572615431247626242)]} 0 0
   [junit4]   2> 109239 INFO  (TEST-TestPointFields.testLongPointSetQuery-seed#[C207507C2F49A635]) [    ] o.a.s.u.p.LogUpdateProcessorFactory [collection1]  webapp=null path=null params={}{add=[9 (1572615431248674816)]} 0 0
   [junit4]   2> 109239 INFO  (TEST-TestPointFields.testLongPointSetQuery-seed#[C207507C2F49A635]) [    ] o.a.s.u.p.LogUpdateProcessorFactory [collection1]  webapp=null path=null params={}{add=[10 (1572615431248674817)]} 0 0
   [junit4]   2> 109239 INFO  (TEST-TestPointFields.testLongPointSetQuery-seed#[C207507C2F49A635]) [    ] o.a.s.u.p.LogUpdateProcessorFactory [collection1]  webapp=null path=null params={}{add=[11 (1572615431248674818)]} 0 0
   [junit4]   2> 109240 INFO  (TEST-TestPointFields.testLongPointSetQuery-seed#[C207507C2F49A635]) [    ] o.a.s.u.p.LogUpdateProcessorFactory [collection1]  webapp=null path=null params={}{add=[12 (1572615431248674819)]} 0 0
   [junit4]   2> 109240 INFO  (TEST-TestPointFields.testLongPointSetQuery-seed#[C207507C2F49A635]) [    ] o.a.s.u.p.LogUpdateProcessorFactory [collection1]  webapp=null path=null params={}{add=[13 (1572615431249723392)]} 0 0
   [junit4]   2> 109240 INFO  (TEST-TestPointFields.testLongPointSetQuery-seed#[C207507C2F49A635]) [    ] o.a.s.u.p.LogUpdateProcessorFactory [collection1]  webapp=null path=null params={}{add=[14 (1572615431249723393)]} 0 0
   [junit4]   2> 109241 INFO  (TEST-TestPointFields.testLongPointSetQuery-seed#[C207507C2F49A635]) [    ] o.a.s.u.p.LogUpdateProcessorFactory [collection1]  webapp=null path=null params={}{add=[15 (1572615431249723394)]} 0 0
   [junit4]   2> 109241 INFO  (TEST-TestPointFields.testLongPointSetQuery-seed#[C207507C2F49A635]) [    ] o.a.s.u.p.LogUpdateProcessorFactory [collection1]  webapp=null path=null params={}{add=[16 (1572615431250771968)]} 0 0
   [junit4]   2> 109247 INFO  (TEST-TestPointFields.testLongPointSetQuery-seed#[C207507C2F49A635]) [    ] o.a.s.u.p.LogUpdateProcessorFactory [collection1]  webapp=null path=null params={}{add=[17 (1572615431250771969)]} 0 5
   [junit4]   2> 109247 INFO  (TEST-TestPointFields.testLongPointSetQuery-seed#[C207507C2F49A635]) [    ] o.a.s.u.p.LogUpdateProcessorFactory [collection1]  webapp=null path=null params={}{add=[18 (1572615431257063424)]} 0 0
   [junit4]   2> 109248 INFO  (TEST-TestPointFields.testLongPointSetQuery-seed#[C207507C2F49A635]) [    ] o.a.s.u.p.LogUpdateProcessorFactory [collection1]  webapp=null path=null params={}{add=[19 (1572615431258112000)]} 0 0
   [junit4]   2> 109248 INFO  (TEST-TestPointFields.testLongPointSetQuery-seed#[C207507C2F49A635]) [    ] o.a.s.u.DirectUpdateHandler2 start commit{_version_=1572615431258112001,optimize=false,openSearcher=true,waitSearcher=true,expungeDeletes=false,softCommit=false,prepareCommit=false}
   [junit4]   2> 109248 INFO  (TEST-TestPointFields.testLongPointSetQuery-seed#[C207507C2F49A635]) [    ] o.a.s.u.SolrIndexWriter Calling setCommitData with IW:org.apache.solr.update.SolrIndexWriter@6fbb4aa2 commitCommandVersion:1572615431258112001
   [junit4]   2> 109260 INFO  (TEST-TestPointFields.testLongPointSetQuery-seed#[C207507C2F49A635]) [    ] o.a.s.s.SolrIndexSearcher Opening [Searcher@62a02675[collection1] main]
   [junit4]   2> 109260 INFO  (TEST-TestPointFields.testLongPointSetQuery-seed#[C207507C2F49A635]) [    ] o.a.s.u.DirectUpdateHandler2 end_commit_flush
   [junit4]   2> 109261 INFO  (searcherExecutor-485-thread-1) [    ] o.a.s.c.SolrCore [collection1] Registered new searcher Searcher@62a02675[collection1] main{ExitableDirectoryReader(UninvertingDirectoryReader(Uninverting(_0(8.0.0):c20)))}
   [junit4]   2> 109261 INFO  (TEST-TestPointFields.testLongPointSetQuery-seed#[C207507C2F49A635]) [    ] o.a.s.u.p.LogUpdateProcessorFactory [collection1]  webapp=null path=null params={}{commit=} 0 13
   [junit4]   2> 109262 INFO  (TEST-TestPointFields.testLongPointSetQuery-seed#[C207507C2F49A635]) [    ] o.a.s.c.S.Request [collection1]  webapp=null path=null params={q={!term+f%3D'number_p_l'}6962663594022917449&fl=id,number_p_l&wt=xml} hits=1 status=0 QTime=0
   [junit4]   2> 109263 INFO  (TEST-TestPointFields.testLongPointSetQuery-seed#[C207507C2F49A635]) [    ] o.a.s.c.S.Request [collection1]  webapp=null path=null params={q={!term+f%3D'number_p_l'}-1557710711622737268&fl=id,number_p_l&wt=xml} hits=1 status=0 QTime=0
   [junit4]   2> 109263 INFO  (TEST-TestPointFields.testLongPointSetQuery-seed#[C207507C2F49A635]) [    ] o.a.s.c.S.Request [collection1]  webapp=null path=null params={q={!term+f%3D'number_p_l'}1449004948864937416&fl=id,number_p_l&wt=xml} hits=1 status=0 QTime=0
   [junit4]   2> 109264 INFO  (TEST-TestPointFields.testLongPointSetQuery-seed#[C207507C2F49A635]) [    ] o.a.s.c.S.Request [collection1]  webapp=null path=null params={q={!term+f%3D'number_p_l'}239951638569386183&fl=id,number_p_l&wt=xml} hits=1 status=0 QTime=0
   [junit4]   2> 109264 INFO  (TEST-TestPointFields.testLongPointSetQuery-seed#[C207507C2F49A635]) [    ] o.a.s.c.S.Request [collection1]  webapp=null path=null params={q={!term+f%3D'number_p_l'}-2198237654419470863&fl=id,number_p_l&wt=xml} hits=1 status=0 QTime=0
   [junit4]   2> 109264 INFO  (TEST-TestPointFields.testLongPointSetQuery-seed#[C207507C2F49A635]) [    ] o.a.s.c.S.Request [collection1]  webapp=null path=null params={q={!term+f%3D'number_p_l'}-1838371639182678065&fl=id,number_p_l&wt=xml} hits=1 status=0 QTime=0
   [junit4]   2> 109265 INFO  (TEST-TestPointFields.testLongPointSetQuery-seed#[C207507C2F49A635]) [    ] o.a.s.c.S.Request [collection1]  webapp=null path=null params={q={!term+f%3D'number_p_l'}8492164604379777151&fl=id,number_p_l&wt=xml} hits=1 status=0 QTime=0
   [junit4]   2> 109265 INFO  (TEST-TestPointFields.testLongPointSetQuery-seed#[C207507C2F49A635]) [    ] o.a.s.c.S.Request [collection1]  webapp=null path=null params={q={!term+f%3D'number_p_l'}-5545038980362201170&fl=id,number_p_l&wt=xml} hits=1 status=0 QTime=0
   [junit4]   2> 109266 INFO  (TEST-TestPointFields.testLongPointSetQuery-seed#[C207507C2F49A635]) [    ] o.a.s.c.S.Request [collection1]  webapp=null path=null params={q={!term+f%3D'number_p_l'}3787693747492782582&fl=id,number_p_l&wt=xml} hits=1 status=0 QTime=0
   [junit4]   2> 109266 INFO  (TEST-TestPointFields.testLongPointSetQuery-seed#[C207507C2F49A635]) [    ] o.a.s.c.S.Request [collection1]  webapp=null path=null params={q={!term+f%3D'number_p_l'}-5471049732402538382&fl=id,number_p_l&wt=xml} hits=1 status=0 QTime=0
   [junit4]   2> 109266 INFO  (TEST-TestPointFields.testLongPointSetQuery-seed#[C207507C2F49A635]) [    ] o.a.s.c.S.Request [collection1]  webapp=null path=null params={q={!term+f%3D'number_p_l'}8790445942273130492&fl=id,number_p_l&wt=xml} hits=1 status=0 QTime=0
   [junit4]   2> 109267 INFO  (TEST-TestPointFields.testLongPointSetQuery-seed#[C207507C2F49A635]) [    ] o.a.s.c.S.Request [collection1]  webapp=null path=null params={q={!term+f%3D'number_p_l'}-7938399630800917788&fl=id,number_p_l&wt=xml} hits=1 status=0 QTime=0
   [junit4]   2> 109267 INFO  (TEST-TestPointFields.testLongPointSetQuery-seed#[C207507C2F49A635]) [    ] o.a.s.c.S.Request [collection1]  webapp=null path=null params={q={!term+f%3D'number_p_l'}4223212893357755254&fl=id,number_p_l&wt=xml} hits=1 status=0 QTime=0
   [junit4]   2> 109267 INFO  (TEST-TestPointFields.testLongPointSetQuery-seed#[C207507C2F49A635]) [    ] o.a.s.c.S.Request [collection1]  webapp=null path=null params={q={!term+f%3D'number_p_l'}6099442821926745650&fl=id,number_p_l&wt=xml} hits=1 status=0 QTime=0
   [junit4]   2> 109268 INFO  (TEST-TestPointFields.testLongPointSetQuery-seed#[C207507C2F49A635]) [    ] o.a.s.c.S.Request [collection1]  webapp=null path=null params={q={!term+f%3D'number_p_l'}6327824341555494613&fl=id,number_p_l&wt=xml} hits=1 status=0 QTime=0
   [junit4]   2> 109268 INFO  (TEST-TestPointFields.testLongPointSetQuery-seed#[C207507C2F49A635]) [    ] o.a.s.c.S.Request [collection1]  webapp=null path=null params={q={!term+f%3D'number_p_l'}2580369549312130606&fl=id,number_p_l&wt=xml} hits=1 status=0 QTime=0
   [junit4]   2> 109269 INFO  (TEST-TestPointFields.testLongPointSetQuery-seed#[C207507C2F49A635]) [    ] o.a.s.c.S.Request [collection1]  webapp=null path=null params={q={!term+f%3D'number_p_l'}8389331799404920490&fl=id,number_p_l&wt=xml} hits=1 status=0 QTime=0
   [junit4]   2> 109269 INFO  (TEST-TestPointFields.testLongPointSetQuery-seed#[C207507C2F49A635]) [    ] o.a.s.c.S.Request [collection1]  webapp=null path=null params={q={!term+f%3D'number_p_l'}-9005100585989433078&fl=id,number_p_l&wt=xml} hits=1 status=0 QTime=0
   [junit4]   2> 109269 INFO  (TEST-TestPointFields.testLongPointSetQuery-seed#[C207507C2F49A635]) [    ] o.a.s.c.S.Request [collection1]  webapp=null path=null params={q={!term+f%3D'number_p_l'}-5503382963918967910&fl=id,number_p_l&wt=xml} hits=1 status=0 QTime=0
   [junit4]   2> 109270 INFO  (TEST-TestPointFields.testLongPointSetQuery-seed#[C207507C2F49A635]) [    ] o.a.s.c.S.Request [collection1]  webapp=null path=null params={q={!term+f%3D'number_p_l'}3900622907797215828&fl=id,number_p_l&wt=xml} hits=1 status=0 QTime=0
   [junit4]   2> 109283 INFO  (TEST-TestPointFields.testLongPointSetQuery-seed#[C207507C2F49A635]) [    ] o.a.s.c.S.Request [collection1]  webapp=null path=null params={q={!terms+f%3D'number_p_l'}6962663594022917449,-1557710711622737268&fl=id,number_p_l&wt=xml} hits=2 status=0 QTime=12
   [junit4]   2> 109286 INFO  (TEST-TestPointFields.testLongPointSetQuery-seed#[C207507C2F49A635]) [    ] o.a.s.c.S.Request [collection1]  webapp=null path=null params={q={!terms+f%3D'number_p_l'}-1557710711622737268,1449004948864937416&fl=id,number_p_l&wt=xml} hits=2 status=0 QTime=0
   [junit4]   2> 109286 INFO  (TEST-TestPointFields.testLongPointSetQuery-seed#[C207507C2F49A635]) [    ] o.a.s.c.S.Request [collection1]  webapp=null path=null params={q={!terms+f%3D'number_p_l'}1449004948864937416,239951638569386183&fl=id,number_p_l&wt=xml} hits=2 status=0 QTime=0
   [junit4]   2> 109286 INFO  (TEST-TestPointFields.testLongPointSetQuery-seed#[C207507C2F49A635]) [    ] o.a.s.c.S.Request [collection1]  webapp=null path=null params={q={!terms+f%3D'number_p_l'}239951638569386183,-2198237654419470863&fl=id,number_p_l&wt=xml} hits=2 status=0 QTime=0
   [junit4]   2> 109287 INFO  (TEST-TestPointFields.testLongPointSetQuery-seed#[C207507C2F49A635]) [    ] o.a.s.c.S.Request [collection1]  webapp=null path=null params={q={!terms+f%3D'number_p_l'}-2198237654419470863,-1838371639182678065&fl=id,number_p_l&wt=xml} hits=2 status=0 QTime=0
   [junit4]   2> 109288 INFO  (TEST-TestPointFields.testLongPointSetQuery-seed#[C207507C2F49A635]) [    ] o.a.s.c.S.Request [collection1]  webapp=null path=null params={q={!terms+f%3D'number_p_l'}-1838371639182678065,8492164604379777151&fl=id,number_p_l&wt=xml} hits=2 status=0 QTime=0
   [junit4]   2> 109288 INFO  (TEST-TestPointFields.testLongPointSetQuery-seed#[C207507C2F49A635]) [    ] o.a.s.c.S.Request [collection1]  webapp=null path=null params={q={!terms+f%3D'number_p_l'}8492164604379777151,-5545038980362201170&fl=id,number_p_l&wt=xml} hits=2 status=0 QTime=0
   [junit4]   2> 109288 INFO  (TEST-TestPointFields.testLongPointSetQuery-seed#[C207507C2F49A635]) [    ] o.a.s.c.S.Request [collection1]  webapp=null path=null params={q={!terms+f%3D'number_p_l'}-5545038980362201170,3787693747492782582&fl=id,number_p_l&wt=xml} hits=2 status=0 QTime=0
   [junit4]   2> 109289 INFO  (TEST-TestPointFields.testLongPointSetQuery-seed#[C207507C2F49A635]) [    ] o.a.s.c.S.Request [collection1]  webapp=null path=null params={q={!terms+f%3D'number_p_l'}3787693747492782582,-5471049732402538382&fl=id,number_p_l&wt=xml} hits=2 status=0 QTime=0
   [junit4]   2> 109289 INFO  (TEST-TestPointFields.testLongPointSetQuery-seed#[C207507C2F49A635]) [    ] o.a.s.c.S.Request [collection1]  webapp=null path=null params={q={!terms+f%3D'number_p_l'}-5471049732402538382,8790445942273130492&fl=id,number_p_l&wt=xml} hits=2 status=0 QTime=0
   [junit4]   2> 109290 INFO  (TEST-TestPointFields.testLongPointSetQuery-seed#[C207507C2F49A635]) [    ] o.a.s.c.S.Request [collection1]  webapp=null path=null params={q={!terms+f%3D'number_p_l'}8790445942273130492,-7938399630800917788&fl=id,number_p_l&wt=xml} hits=2 status=0 QTime=0
   [junit4]   2> 109290 INFO  (TEST-TestPointFields.testLongPointSetQuery-seed#[C207507C2F49A635]) [    ] o.a.s.c.S.Request [collection1]  webapp=null path=null params={q={!terms+f%3D'number_p_l'}-7938399630800917788,4223212893357755254&fl=id,number_p_l&wt=xml} hits=2 status=0 QTime=0
   [junit4]   2> 109291 INFO  (TEST-TestPointFields.testLongPointSetQuery-seed#[C207507C2F49A635]) [    ] o.a.s.c.S.Request [collection1]  webapp=null path=null params={q={!terms+f%3D'number_p_l'}4223212893357755254,6099442821926745650&fl=id,number_p_l&wt=xml} hits=2 status=0 QTime=0
   [junit4]   2> 109291 INFO  (TEST-TestPointFields.testLongPointSetQuery-seed#[C207507C2F49A635]) [    ] o.a.s.c.S.Request [collection1]  webapp=null path=null params={q={!terms+f%3D'number_p_l'}6099442821926745650,6327824341555494613&fl=id,number_p_l&wt=xml} hits=2 status=0 QTime=0
   [junit4]   2> 109292 INFO  (TEST-TestPointFields.testLongPointSetQuery-seed#[C207507C2F49A635]) [    ] o.a.s.c.S.Request [collection1]  webapp=null path=null params={q={!terms+f%3D'number_p_l'}6327824341555494613,2580369549312130606&fl=id,number_p_l&wt=xml} hits=2 status=0 QTime=0
   [junit4]   2> 109292 INFO  (TEST-TestPointFields.testLongPointSetQuery-seed#[C207507C2F49A635]) [    ] o.a.s.c.S.Request [collection1]  webapp=null path=null params={q={!terms+f%3D'number_p_l'}2580369549312130606,8389331799404920490&fl=id,number_p_l&wt=xml} hits=2 status=0 QTime=0
   [junit4]   2> 109292 INFO  (TEST-TestPointFields.testLongPointSetQuery-seed#[C207507C2F49A635]) [    ] o.a.s.c.S.Request [collection1]  webapp=null path=null params={q={!terms+f%3D'number_p_l'}8389331799404920490,-9005100585989433078&fl=id,number_p_l&wt=xml} hits=2 status=0 QTime=0
   [junit4]   2> 109293 INFO  (TEST-TestPointFields.testLongPointSetQuery-seed#[C207507C2F49A635]) [    ] o.a.s.c.S.Request [collection1]  webapp=null path=null params={q={!terms+f%3D'number_p_l'}-9005100585989433078,-5503382963918967910&fl=id,number_p_l&wt=xml} hits=2 status=0 QTime=0
   [junit4]   2> 109294 INFO  (TEST-TestPointFields.testLongPointSetQuery-seed#[C207507C2F49A635]) [    ] o.a.s.c.S.Request [collection1]  webapp=null path=null params={q={!terms+f%3D'number_p_l'}-5503382963918967910,3900622907797215828&fl=id,number_p_l&wt=xml} hits=2 status=0 QTime=1
   [junit4]   2> 109295 INFO  (TEST-TestPointFields.testLongPointSetQuery-seed#[C207507C2F49A635]) [    ] o.a.s.c.S.Request [collection1]  webapp=null path=null params={q={!terms+f%3D'number_p_l'}3900622907797215828,6962663594022917449&fl=id,number_p_l&wt=xml} hits=2 status=0 QTime=0
   [junit4]   2> 109301 INFO  (TEST-TestPointFields.testLongPointSetQuery-seed#[C207507C2F49A635]) [    ] o.a.s.c.S.Request [collection1]  webapp=null path=null params={q=*:*&debug=query&fl=id,number_p_l&fq=number_p_l:(6962663594022917449+\-1557710711622737268+1449004948864937416+239951638569386183+\-2198237654419470863+\-1838371639182678065+8492164604379777151+\-5545038980362201170+3787693747492782582+\-5471049732402538382+8790445942273130492+\-7938399630800917788+4223212893357755254+6099442821926745650+6327824341555494613+2580369549312130606+8389331799404920490+)&wt=xml} hits=17 status=0 QTime=5
   [junit4]   2> 109303 INFO  (TEST-TestPointFields.testLongPointSetQuery-seed#[C207507C2F49A635]) [    ] o.a.s.u.p.LogUpdateProcessorFactory [collection1]  webapp=null path=null params={}{add=[0 (1572615431314735104)]} 0 1
   [junit4]   2> 109303 INFO  (TEST-TestPointFields.testLongPointSetQuery-seed#[C207507C2F49A635]) [    ] o.a.s.u.p.LogUpdateProcessorFactory [collection1]  webapp=null path=null params={}{add=[1 (1572615431315783680)]} 0 0
   [junit4]   2> 109303 INFO  (TEST-TestPointFields.testLongPointSetQuery-seed#[C207507C2F49A635]) [    ] o.a.s.u.p.LogUpdateProcessorFactory [collection1]  webapp=null path=null params={}{add=[2 (1572615431315783681)]} 0 0
   [junit4]   2> 109304 INFO  (TEST-TestPointFields.testLongPointSetQuery-seed#[C207507C2F49A635]) [    ] o.a.s.u.p.LogUpdateProcessorFactory [collection1]  webapp=null path=null params={}{add=[3 (1572615431316832256)]} 0 0
   [junit4]   2> 109304 INFO  (TEST-TestPointFields.testLongPointSetQuery-seed#[C207507C2F49A635]) [    ] o.a.s.u.p.LogUpdateProcessorFactory [collection1]  webapp=null path=null params={}{add=[4 (1572615431316832257)]} 0 0
   [junit4]   2> 109304 INFO  (TEST-TestPointFields.testLongPointSetQuery-seed#[C207507C2F49A635]) [    ] o.a.s.u.p.LogUpdateProcessorFactory [collection1]  webapp=null path=null params={}{add=[5 (1572615431316832258)]} 0 0
   [junit4]   2> 109305 INFO  (TEST-TestPointFields.testLongPointSetQuery-seed#[C207507C2F49A635]) [    ] o.a.s.u.p.LogUpdateProcessorFactory [collection1]  webapp=null path=null params={}{add=[6 (1572615431317880832)]} 0 0
   [junit4]   2> 109305 INFO  (TEST-TestPointFields.testLongPointSetQuery-seed#[C207507C2F49A635]) [    ] o.a.s.u.p.LogUpdateProcessorFactory [collection1]  webapp=null path=null params={}{add=[7 (1572615431317880833)]} 0 0
   [junit4]   2> 109306 INFO  (TEST-TestPointFields.testLongPointSetQuery-seed#[C207507C2F49A635]) [    ] o.a.s.u.p.LogUpdateProcessorFactory [collection1]  webapp=null path=null params={}{add=[8 (1572615431317880834)]} 0 0
   [junit4]   2> 109306 INFO  (TEST-TestPointFields.testLongPointSetQuery-seed#[C207507C2F49A635]) [    ] o.a.s.u.p.LogUpdateProcessorFactory [collection1]  webapp=null path=null params={}{add=[9 (1572615431318929408)]} 0 0
   [junit4]   2> 109306 INFO  (TEST-TestPointFields.testLongPointSetQuery-seed#[C207507C2F49A635]) [    ] o.a.s.u.p.LogUpdateProcessorFactory [collection1]  webapp=null path=null params={}{add=[10 (1572615431318929409)]} 0 0
   [junit4]   2> 109307 INFO  (TEST-TestPointFields.testLongPointSetQuery-seed#[C207507C2F49A635]) [    ] o.a.s.u.p.LogUpdateProcessorFactory [collection1]  webapp=null path=null params={}{add=[11 (1572615431319977984)]} 0 0
   [junit4]   2> 109307 INFO  (TEST-TestPointFields.testLongPointSetQuery-seed#[C207507C2F49A635]) [    ] o.a.s.u.p.LogUpdateProcessorFactory [collection1]  webapp=null path=null params={}{add=[12 (1572615431319977985)]} 0 0
   [junit4]   2> 109307 INFO  (TEST-TestPointFields.testLongPointSetQuery-seed#[C207507C2F49A635]) [    ] o.a.s.u.p.LogUpdateProcessorFactory [collection1]  webapp=null path=null params={}{add=[13 (1572615431319977986)]} 0 0
   [junit4]   2> 109311 INFO  (TEST-TestPointFields.testLongPointSetQuery-seed#[C207507C2F49A635]) [    ] o.a.s.u.p.LogUpdateProcessorFactory [collection1]  webapp=null path=null params={}{add=[14 (1572615431321026560)]} 0 3
   [junit4]   2> 109311 INFO  (TEST-TestPointFields.testLongPointSetQuery-seed#[C207507C2F49A635]) [    ] o.a.s.u.p.LogUpdateProcessorFactory [collection1]  webapp=null path=null params={}{add=[15 (1572615431324172288)]} 0 0
   [junit4]   2> 109311 INFO  (TEST-TestPointFields.testLongPointSetQuery-seed#[C207507C2F49A635]) [    ] o.a.s.u.p.LogUpdateProcessorFactory [collection1]  webapp=null path=null params={}{add=[16 (1572615431324172289)]} 0 0
   [junit4]   2> 109312 INFO  (TEST-TestPointFields.testLongPointSetQuery-seed#[C207507C2F49A635]) [    ] o.a.s.u.p.LogUpdateProcessorFactory [collection1]  webapp=null path=null params={}{add=[17 (1572615431325220864)]} 0 0
   [junit4]   2> 109313 INFO  (TEST-TestPointFields.testLongPointSetQuery-seed#[C207507C2F49A635]) [    ] o.a.s.u.p.LogUpdateProcessorFactory [collection1]  webapp=null path=null params={}{add=[18 (1572615431325220865)]} 0 0
   [junit4]   2> 109313 INFO  (TEST-TestPointFields.testLongPointSetQuery-seed#[C207507C2F49A635]) [    ] o.a.s.u.p.LogUpdateProcessorFactory [collection1]  webapp=null path=null params={}{add=[19 (1572615431326269440)]} 0 0
   [junit4]   2> 109313 INFO  (TEST-TestPointFields.testLongPointSetQuery-seed#[C207507C2F49A635]) [    ] o.a.s.u.DirectUpdateHandler2 start commit{_version_=1572615431326269441,optimize=false,openSearcher=true,waitSearcher=true,expungeDeletes=false,softCommit=false,prepareCommit=false}
   [junit4]   2> 109313 INFO  (TEST-TestPointFields.testLongPointSetQuery-seed#[C207507C2F49A635]) [    ] o.a.s.u.SolrIndexWriter Calling setCommitData with IW:org.apache.solr.update.SolrIndexWriter@6fbb4aa2 commitCommandVersion:1572615431326269441
   [junit4]   2> 109317 INFO  (TEST-TestPointFields.testLongPointSetQuery-seed#[C207507C2F49A635]) [    ] o.a.s.s.SolrIndexSearcher Opening [Searcher@70ee887f[collection1] main]
   [junit4]   2> 109318 INFO  (TEST-TestPointFields.testLongPointSetQuery-seed#[C207507C2F49A635]) [    ] o.a.s.u.DirectUpdateHandler2 end_commit_flush
   [junit4]   2> 109319 INFO  (searcherExecutor-485-thread-1) [    ] o.a.s.c.SolrCore [collection1] Registered new searcher Searcher@70ee887f[collection1] main{ExitableDirectoryReader(UninvertingDirectoryReader(Uninverting(_1(8.0.0):c20)))}
   [junit4]   2> 109319 INFO  (TEST-TestPointFields.testLongPointSetQuery-seed#[C207507C2F49A635]) [    ] o.a.s.u.p.LogUpdateProcessorFactory [collection1]  webapp=null path=null params={}{commit=} 0 6
   [junit4]   2> 109320 INFO  (TEST-TestPointFields.testLongPointSetQuery-seed#[C207507C2F49A635]) [    ] o.a.s.c.S.Request [collection1]  webapp=null path=null params={q={!term+f%3D'number_p_l_mv'}742139659238183452&fl=id,number_p_l_mv&wt=xml} hits=1 status=0 QTime=0
   [junit4]   2> 109320 INFO  (TEST-TestPointFields.testLongPointSetQuery-seed#[C207507C2F49A635]) [    ] o.a.s.c.S.Request [collection1]  webapp=null path=null params={q={!term+f%3D'number_p_l_mv'}1927588619165934871&fl=id,number_p_l_mv&wt=xml} hits=1 status=0 QTime=0
   [junit4]   2> 109321 INFO  (TEST-TestPointFields.testLongPointSetQuery-seed#[C207507C2F49A635]) [    ] o.a.s.c.S.Request [collection1]  webapp=null path=null params={q={!term+f%3D'number_p_l_mv'}-3916154250426366396&fl=id,number_p_l_mv&wt=xml} hits=1 status=0 QTime=0
   [junit4]   2> 109321 INFO  (TEST-TestPointFields.testLongPointSetQuery-seed#[C207507C2F49A635]) [    ] o.a.s.c.S.Request [collection1]  webapp=null path=null params={q={!term+f%3D'number_p_l_mv'}6219518495334204541&fl=id,number_p_l_mv&wt=xml} hits=1 status=0 QTime=0
   [junit4]   2> 109322 INFO  (TEST-TestPointFields.testLongPointSetQuery-seed#[C207507C2F49A635]) [    ] o.a.s.c.S.Request [collection1]  webapp=null path=null params={q={!term+f%3D'number_p_l_mv'}905598075325058830&fl=id,number_p_l_mv&wt=xml} hits=1 status=0 QTime=0
   [junit4]   2> 109322 INFO  (TEST-TestPointFields.testLongPointSetQuery-seed#[C207507C2F49A635]) [    ] o.a.s.c.S.Request [collection1]  webapp=null path=null params={q={!term+f%3D'number_p_l_mv'}5515167430303101938&fl=id,number_p_l_mv&wt=xml} hits=1 status=0 QTime=0
   [junit4]   2> 109322 INFO  (TEST-TestPointFields.testLongPointSetQuery-seed#[C207507C2F49A635]) [    ] o.a.s.c.S.Request [collection1]  webapp=null path=null params={q={!term+f%3D'number_p_l_mv'}1093623385275705537&fl=id,number_p_l_mv&wt=xml} hits=1 status=0 QTime=0
   [junit4]   2> 109323 INFO  (TEST-TestPointFields.testLongPointSetQuery-seed#[C207507C2F49A635]) [    ] o.a.s.c.S.Request [collection1]  webapp=null path=null params={q={!term+f%3D'number_p_l_mv'}-5154550007805219760&fl=id,number_p_l_mv&wt=xml} hits=1 status=0 QTime=0
   [junit4]   2> 109323 INFO  (TEST-TestPointFields.testLongPointSetQuery-seed#[C207507C2F49A635]) [    ] o.a.s.c.S.Request [collection1]  webapp=null path=null params={q={!term+f%3D'number_p_l_mv'}4367495882968412348&fl=id,number_p_l_mv&wt=xml} hits=1 status=0 QTime=0
   [junit4]   2> 109323 INFO  (TEST-TestPointFields.testLongPointSetQuery-seed#[C207507C2F49A635]) [    ] o.a.s.c.S.Request [collection1]  webapp=null path=null params={q={!term+f%3D'number_p_l_mv'}3679767603196171788&fl=id,number_p_l_mv&wt=xml} hits=1 status=0 QTime=0
   [junit4]   2> 109324 INFO  (TEST-TestPointFields.testLongPointSetQuery-seed#[C207507C2F49A635]) [    ] o.a.s.c.S.Request [collection1]  webapp=null path=null params={q={!term+f%3D'number_p_l_mv'}3951779304401261354&fl=id,number_p_l_mv&wt=xml} hits=1 status=0 QTime=0
   [junit4]   2> 109324 INFO  (TEST-TestPointFields.testLongPointSetQuery-seed#[C207507C2F49A635]) [    ] o.a.s.c.S.Request [collection1]  webapp=null path=null params={q={!term+f%3D'number_p_l_mv'}-6484400317595506535&fl=id,number_p_l_mv&wt=xml} hits=1 status=0 QTime=0
   [junit4]   2> 109324 INFO  (TEST-TestPointFields.testLongPointSetQuery-seed#[C207507C2F49A635]) [    ] o.a.s.c.S.Request [collection1]  webapp=null path=null params={q={!term+f%3D'number_p_l_mv'}-6370582941522518175&fl=id,number_p_l_mv&wt=xml} hits=1 status=0 QTime=0
   [junit4]   2> 109325 INFO  (TEST-TestPointFields.testLongPointSetQuery-seed#[C207507C2F49A635]) [    ] o.a.s.c.S.Request [collection1]  webapp=null path=null params={q={!term+f%3D'number_p_l_mv'}-127922753149584455&fl=id,number_p_l_mv&wt=xml} hits=1 status=0 QTime=0
   [junit4]   2> 109325 INFO  (TEST-TestPointFields.testLongPointSetQuery-seed#[C207507C2F49A635]) [    ] o.a.s.c.S.Request [collection1]  webapp=null path=null params={q={!term+f%3D'number_p_l_mv'}3737015887755383725&fl=id,number_p_l_mv&wt=xml} hits=1 status=0 QTime=0
   [junit4]   2> 109326 INFO  (TEST-TestPointFields.testLongPointSetQuery-seed#[C207507C2F49A635]) [    ] o.a.s.c.S.Request [collection1]  webapp=null path=null params={q={!term+f%3D'number_p_l_mv'}7016157932162687945&fl=id,number_p_l_mv&wt=xml} hits=1 status=0 QTime=0
   [junit4]   2> 109326 INFO  (TEST-TestPointFields.testLongPointSetQuery-seed#[C207507C2F49A635]) [    ] o.a.s.c.S.Request [collection1]  webapp=null path=null params={q={!term+f%3D'number_p_l_mv'}3629071263165100482&fl=id,number_p_l_mv&wt=xml} hits=1 status=0 QTime=0
   [junit4]   2> 109326 INFO  (TEST-TestPointFields.testLongPointSetQuery-seed#[C207507C2F49A635]) [    ] o.a.s.c.S.Request [collection1]  webapp=null path=null params={q={!term+f%3D'number_p_l_mv'}-9080159519937528465&fl=id,number_p_l_mv&wt=xml} hits=1 status=0 QTime=0
   [junit4]   2> 109327 INFO  (TEST-TestPointFields.testLongPointSetQuery-seed#[C207507C2F49A635]) [    ] o.a.s.c.S.Request [collection1]  webapp=null path=null params={q={!term+f%3D'number_p_l_mv'}9126401885810681676&fl=id,number_p_l_mv&wt=xml} hits=1 status=0 QTime=0
   [junit4]   2> 109327 INFO  (TEST-TestPointFields.testLongPointSetQuery-seed#[C207507C2F49A635]) [    ] o.a.s.c.S.Request [collection1]  webapp=null path=null params={q={!term+f%3D'number_p_l_mv'}-119064161628310679&fl=id,number_p_l_mv&wt=xml} hits=1 status=0 QTime=0
   [junit4]   2> 109327 INFO  (TEST-TestPointFields.testLongPointSetQuery-seed#[C207507C2F49A635]) [    ] o.a.s.c.S.Request [collection1]  webapp=null path=null params={q={!terms+f%3D'number_p_l_mv'}742139659238183452,1927588619165934871&fl=id,number_p_l_mv&wt=xml} hits=2 status=0 QTime=0
   [junit4]   2> 109328 INFO  (TEST-TestPointFields.testLongPointSetQuery-seed#[C207507C2F49A635]) [    ] o.a.s.c.S.Request [collection1]  webapp=null path=null params={q={!terms+f%3D'number_p_l_mv'}1927588619165934871,-3916154250426366396&fl=id,number_p_l_mv&wt=xml} hits=2 status=0 QTime=0
   [junit4]   2> 109328 INFO  (TEST-TestPointFields.testLongPointSetQuery-seed#[C207507C2F49A635]) [    ] o.a.s.c.S.Request [collection1]  webapp=null path=null params={q={!terms+f%3D'number_p_l_mv'}-3916154250426366396,6219518495334204541&fl=id,number_p_l_mv&wt=xml} hits=2 status=0 QTime=0
   [junit4]   2> 109328 INFO  (TEST-TestPointFields.testLongPointSetQuery-seed#[C207507C2F49A635]) [    ] o.a.s.c.S.Request [collection1]  webapp=null path=null params={q={!terms+f%3D'number_p_l_mv'}6219518495334204541,905598075325058830&fl=id,number_p_l_mv&wt=xml} hits=2 status=0 QTime=0
   [junit4]   2> 109329 INFO  (TEST-TestPointFields.testLongPointSetQuery-seed#[C207507C2F49A635]) [    ] o.a.s.c.S.Request [collection1]  webapp=null path=null params={q={!terms+f%3D'number_p_l_mv'}905598075325058830,5515167430303101938&fl=id,number_p_l_mv&wt=xml} hits=2 status=0 QTime=0
   [junit4]   2> 109329 INFO  (TEST-TestPointFields.testLongPointSetQuery-seed#[C207507C2F49A635]) [    ] o.a.s.c.S.Request [collection1]  webapp=null path=null params={q={!terms+f%3D'number_p_l_mv'}5515167430303101938,1093623385275705537&fl=id,number_p_l_mv&wt=xml} hits=2 status=0 QTime=0
   [junit4]   2> 109330 INFO  (TEST-TestPointFields.testLongPointSetQuery-seed#[C207507C2F49A635]) [    ] o.a.s.c.S.Request [collection1]  webapp=null path=null params={q={!terms+f%3D'number_p_l_mv'}1093623385275705537,-5154550007805219760&fl=id,number_p_l_mv&wt=xml} hits=2 status=0 QTime=0
   [junit4]   2> 109330 INFO  (TEST-TestPointFields.testLongPointSetQuery-seed#[C207507C2F49A635]) [    ] o.a.s.c.S.Request [collection1]  webapp=null path=null params={q={!terms+f%3D'number_p_l_mv'}-5154550007805219760,4367495882968412348&fl=id,number_p_l_mv&wt=xml} hits=2 status=0 QTime=0
   [junit4]   2> 109330 INFO  (TEST-TestPointFields.testLongPointSetQuery-seed#[C207507C2F49A635]) [    ] o.a.s.c.S.Request [collection1]  webapp=null path=null params={q={!terms+f%3D'number_p_l_mv'}4367495882968412348,3679767603196171788&fl=id,number_p_l_mv&wt=xml} hits=2 status=0 QTime=0
   [junit4]   2> 109331 INFO  (TEST-TestPointFields.testLongPointSetQuery-seed#[C207507C2F49A635]) [    ] o.a.s.c.S.Request [collection1]  webapp=null path=null params={q={!terms+f%3D'number_p_l_mv'}3679767603196171788,3951779304401261354&fl=id,number_p_l_mv&wt=xml} hits=2 status=0 QTime=0
   [junit4]   2> 109362 INFO  (TEST-TestPointFields.testLongPointSetQuery-seed#[C207507C2F49A635]) [    ] o.a.s.c.S.Request [collection1]  webapp=null path=null params={q={!terms+f%3D'number_p_l_mv'}3951779304401261354,-6484400317595506535&fl=id,number_p_l_mv&wt=xml} hits=2 status=0 QTime=0
   [junit4]   2> 109363 INFO  (TEST-TestPointFields.testLongPointSetQuery-seed#[C207507C2F49A635]) [    ] o.a.s.c.S.Request [collection1]  webapp=null path=null params={q={!terms+f%3D'number_p_l_mv'}-6484400317595506535,-6370582941522518175&fl=id,number_p_l_mv&wt=xml} hits=2 status=0 QTime=0
   [junit4]   2> 109363 INFO  (TEST-TestPointFields.testLongPointSetQuery-seed#[C207507C2F49A635]) [    ] o.a.s.c.S.Request [collection1]  webapp=null path=null params={q={!terms+f%3D'number_p_l_mv'}-6370582941522518175,-127922753149584455&fl=id,number_p_l_mv&wt=xml} hits=2 status=0 QTime=0
   [junit4]   2> 109363 INFO  (TEST-TestPointFields.testLongPointSetQuery-seed#[C207507C2F49A635]) [    ] o.a.s.c.S.Request [collection1]  webapp=null path=null params={q={!terms+f%3D'number_p_l_mv'}-127922753149584455,3737015887755383725&fl=id,number_p_l_mv&wt=xml} hits=2 status=0 QTime=0
   [junit4]   2> 109364 INFO  (TEST-TestPointFields.testLongPointSetQuery-seed#[C207507C2F49A635]) [    ] o.a.s.c.S.Request [collection1]  webapp=null path=null params={q={!terms+f%3D'number_p_l_mv'}3737015887755383725,7016157932162687945&fl=id,number_p_l_mv&wt=xml} hits=2 status=0 QTime=0
   [junit4]   2> 109364 INFO  (TEST-TestPointFields.testLongPointSetQuery-seed#[C207507C2F49A635]) [    ] o.a.s.c.S.Request [collection1]  webapp=null path=null params={q={!terms+f%3D'number_p_l_mv'}7016157932162687945,3629071263165100482&fl=id,number_p_l_mv&wt=xml} hits=2 status=0 QTime=0
   [junit4]   2> 109365 INFO  (TEST-TestPointFields.testLongPointSetQuery-seed#[C207507C2F49A635]) [    ] o.a.s.c.S.Request [collection1]  webapp=null path=null params={q={!terms+f%3D'number_p_l_mv'}3629071263165100482,-9080159519937528465&fl=id,number_p_l_mv&wt=xml} hits=2 status=0 QTime=0
   [junit4]   2> 109365 INFO  (TEST-TestPointFields.testLongPointSetQuery-seed#[C207507C2F49A635]) [    ] o.a.s.c.S.Request [collection1]  webapp=null path=null params={q={!terms+f%3D'number_p_l_mv'}-9080159519937528465,9126401885810681676&fl=id,number_p_l_mv&wt=xml} hits=2 status=0 QTime=0
   [junit4]   2> 109365 INFO  (TEST-TestPointFields.testLongPointSetQuery-seed#[C207507C2F49A635]) [    ] o.a.s.c.S.Request [collection1]  webapp=null path=null params={q={!terms+f%3D'number_p_l_mv'}9126401885810681676,-119064161628310679&fl=id,number_p_l_mv&wt=xml} hits=2 status=0 QTime=0
   [junit4]   2> 109366 INFO  (TEST-TestPointFields.testLongPointSetQuery-seed#[C207507C2F49A635]) [    ] o.a.s.c.S.Request [collection1]  webapp=null path=null params={q={!terms+f%3D'number_p_l_mv'}-119064161628310679,742139659238183452&fl=id,number_p_l_mv&wt=xml} hits=2 status=0 QTime=0
   [junit4]   2> 109367 INFO  (TEST-TestPointFields.testLongPointSetQuery-seed#[C207507C2F49A635]) [    ] o.a.s.c.S.Request [collection1]  webapp=null path=null params={q=*:*&debug=query&fl=id,number_p_l_mv&fq=number_p_l_mv:(742139659238183452+1927588619165934871+\-3916154250426366396+6219518495334204541+905598075325058830+5515167430303101938+1093623385275705537+\-5154550007805219760+4367495882968412348+3679767603196171788+3951779304401261354+\-6484400317595506535+\-6370582941522518175+\-127922753149584455+3737015887755383725+7016157932162687945+3629071263165100482+)&wt=xml} hits=17 status=0 QTime=0
   [junit4]   2> 109367 INFO  (TEST-TestPointFields.testLongPointSetQuery-seed#[C207507C2F49A635]) [    ] o.a.s.u.DirectUpdateHandler2 [collection1] REMOVING ALL DOCUMENTS FROM INDEX
   [junit4]   2> 109368 INFO  (TEST-TestPointFields.testLongPointSetQuery-seed#[C207507C2F49A635]) [    ] o.a.s.s.SolrIndexSearcher Opening [Searcher@2cb27ed1[collection1] realtime]
   [junit4]   2> 109368 INFO  (TEST-TestPointFields.testLongPointSetQuery-seed#[C207507C2F49A635]) [    ] o.a.s.u.p.LogUpdateProcessorFactory [collection1]  webapp=null path=null params={_version_=-9223372036854775807&update.distrib=FROMLEADER&versions=true&wt=json&indent=true}{deleteByQuery=*:* (-9223372036854775807)} 0 0
   [junit4]   2> 109368 INFO  (TEST-TestPointFields.testLongPointSetQuery-seed#[C207507C2F49A635]) [    ] o.a.s.u.DirectUpdateHandler2 start commit{_version_=1572615431383941120,optimize=false,openSearcher=true,waitSearcher=true,expungeDeletes=false,softCommit=false,prepareCommit=false}
   [junit4]   2> 109368 INFO  (TEST-TestPointFields.testLongPointSetQuery-seed#[C207507C2F49A635]) [    ] o.a.s.u.SolrIndexWriter Calling setCommitData with IW:org.apache.solr.update.SolrIndexWriter@6fbb4aa2 commitCommandVersion:1572615431383941120
   [junit4]   2> 109375 INFO  (TEST-TestPointFields.testLongPointSetQuery-seed#[C207507C2F49A635]) [    ] o.a.s.s.SolrIndexSearcher Opening [Searcher@32fe83e0[collection1] main]
   [junit4]   2> 109377 INFO  (searcherExecutor-485-thread-1) [    ] o.a.s.c.SolrCore [collection1] Registered new searcher Searcher@32fe83e0[collection1] main{ExitableDirectoryReader(UninvertingDirectoryReader())}
   [junit4]   2> 109377 INFO  (TEST-TestPointFields.testLongPointSetQuery-seed#[C207507C2F49A635]) [    ] o.a.s.u.DirectUpdateHandler2 end_commit_flush
   [junit4]   2> 109377 INFO  (TEST-TestPointFields.testLongPointSetQuery-seed#[C207507C2F49A635]) [    ] o.a.s.u.p.LogUpdateProcessorFactory [collection1]  webapp=null path=null params={}{commit=} 0 9
   [junit4]   2> 109378 INFO  (TEST-TestPointFields.testLongPointSetQuery-seed#[C207507C2F49A635]) [    ] o.a.s.u.p.LogUpdateProcessorFactory [collection1]  webapp=null path=null params={}{add=[0 (1572615431393378304)]} 0 0
   [junit4]   2> 109379 INFO  (TEST-TestPointFields.testLongPointSetQuery-seed#[C207507C2F49A635]) [    ] o.a.s.u.p.LogUpdateProcessorFactory [collection1]  webapp=null path=null params={}{add=[1 (1572615431395475456)]} 0 0
   [junit4]   2> 109379 INFO  (TEST-TestPointFields.testLongPointSetQuery-seed#[C207507C2F49A635]) [    ] o.a.s.u.p.LogUpdateProcessorFactory [collection1]  webapp=null path=null params={}{add=[2 (1572615431395475457)]} 0 0
   [junit4]   2> 109379 INFO  (TEST-TestPointFields.testLongPointSetQuery-seed#[C207507C2F49A635]) [    ] o.a.s.u.p.LogUpdateProcessorFactory [collection1]  webapp=null path=null params={}{add=[3 (1572615431395475458)]} 0 0
   [junit4]   2> 109380 INFO  (TEST-TestPointFields.testLongPointSetQuery-seed#[C207507C2F49A635]) [    ] o.a.s.u.p.LogUpdateProcessorFactory [collection1]  webapp=null path=null params={}{add=[4 (1572615431396524032)]} 0 0
   [junit4]   2> 109380 INFO  (TEST-TestPointFields.testLongPointSetQuery-seed#[C207507C2F49A635]) [    ] o.a.s.u.p.LogUpdateProcessorFactory [collection1]  webapp=null path=null params={}{add=[5 (1572615431396524033)]} 0 0
   [junit4]   2> 109380 INFO  (TEST-TestPointFields.testLongPointSetQuery-seed#[C207507C2F49A635]) [    ] o.a.s.u.p.LogUpdateProcessorFactory [collection1]  webapp=null path=null params={}{add=[6 (1572615431396524034)]} 0 0
   [junit4]   2> 109381 INFO  (TEST-TestPointFields.testLongPointSetQuery-seed#[C207507C2F49A635]) [    ] o.a.s.u.p.LogUpdateProcessorFactory [collection1]  webapp=null path=null params={}{add=[7 (1572615431397572608)]} 0 0
   [junit4]   2> 109381 INFO  (TEST-TestPointFields.testLongPointSetQuery-seed#[C207507C2F49A635]) [    ] o.a.s.u.p.LogUpdateProcessorFactory [collection1]  webapp=null path=null params={}{add=[8 (1572615431397572609)]} 0 0
   [junit4]   2> 109381 INFO  (TEST-TestPointFields.testLongPointSetQuery-seed#[C207507C2F49A635]) [    ] o.a.s.u.p.LogUpdateProcessorFactory [collection1]  webapp=null path=null params={}{add=[9 (1572615431397572610)]} 0 0
   [junit4]   2> 109382 INFO  (TEST-TestPointFields.testLongPointSetQuery-seed#[C207507C2F49A635]) [    ] o.a.s.u.p.LogUpdateProcessorFactory [collection1]  webapp=null path=null params={}{add=[10 (1572615431398621184)]} 0 0
   [junit4]   2> 109382 INFO  (TEST-TestPointFields.testLongPointSetQuery-seed#[C207507C2F49A635]) [    ] o.a.s.u.p.LogUpdateProcessorFactory [collection1]  webapp=null path=null params={}{add=[11 (1572615431398621185)]} 0 0
   [junit4]   2> 109382 INFO  (TEST-TestPointFields.testLongPointSetQuery-seed#[C207507C2F49A635]) [    ] o.a.s.u.p.LogUpdateProcessorFactory [collection1]  webapp=null path=null params={}{add=[12 (1572615431398621186)]} 0 0
   [junit4]   2> 109383 INFO  (TEST-TestPointFields.testLongPointSetQuery-seed#[C207507C2F49A635]) [    ] o.a.s.u.p.LogUpdateProcessorFactory [collection1]  webapp=null path=null params={}{add=[13 (1572615431399669760)]} 0 0
   [junit4]   2> 109383 INFO  (TEST-TestPointFields.testLongPointSetQuery-seed#[C207507C2F49A635]) [    ] o.a.s.u.p.LogUpdateProcessorFactory [collection1]  webapp=null path=null params={}{add=[14 (1572615431399669761)]} 0 0
   [junit4]   2> 109383 INFO  (TEST-TestPointFields.testLongPointSetQuery-seed#[C207507C2F49A635]) [    ] o.a.s.u.p.LogUpdateProcessorFactory [collection1]  webapp=null path=null params={}{add=[15 (1572615431399669762)]} 0 0
   [junit4]   2> 109384 INFO  (TEST-TestPointFields.testLongPointSetQuery-seed#[C207507C2F49A635]) [    ] o.a.s.u.p.LogUpdateProcessorFactory [collection1]  webapp=null path=null params={}{add=[16 (1572615431400718336)]} 0 0
   [junit4]   2> 109384 INFO  (TEST-TestPointFields.testLongPointSetQuery-seed#[C207507C2F49A635]) [    ] o.a.s.u.p.LogUpdateProcessorFactory [collection1]  webapp=null path=null params={}{add=[17 (1572615431400718337)]} 0 0
   [junit4]   2> 109384 INFO  (TEST-TestPointFields.testLongPointSetQuery-seed#[C207507C2F49A635]) [    ] o.a.s.u.p.LogUpdateProcessorFactory [collection1]  webapp=null path=null params={}{add=[18 (1572615431400718338)]} 0 0
   [junit4]   2> 109385 INFO  (TEST-TestPointFields.testLongPointSetQuery-seed#[C207507C2F49A635]) [    ] o.a.s.u.p.LogUpdateProcessorFactory [collection1]  webapp=null path=null params={}{add=[19 (1572615431401766912)]} 0 0
   [junit4]   2> 109385 INFO  (TEST-TestPointFields.testLongPointSetQuery-seed#[C207507C2F49A635]) [    ] o.a.s.u.DirectUpdateHandler2 start commit{_version_=1572615431401766913,optimize=false,openSearcher=true,waitSearcher=true,expungeDeletes=false,softCommit=false,prepareCommit=false}
   [junit4]   2> 109385 INFO  (TEST-TestPointFields.testLongPointSetQuery-seed#[C207507C2F49A635]) [    ] o.a.s.u.SolrIndexWriter Calling setCommitData with IW:org.apache.solr.update.SolrIndexWriter@6fbb4aa2 commitCommandVersion:1572615431401766913
   [junit4]   2> 109397 INFO  (TEST-TestPointFields.testLongPointSetQuery-seed#[C207507C2F49A635]) [    ] o.a.s.s.SolrIndexSearcher Opening [Searcher@29d66ea7[collection1] main]
   [junit4]   2> 109398 INFO  (TEST-TestPointFields.testLongPointSetQuery-seed#[C207507C2F49A635]) [    ] o.a.s.u.DirectUpdateHandler2 end_commit_flush
   [junit4]   2> 109399 INFO  (searcherExecutor-485-thread-1) [    ] o.a.s.c.SolrCore [collection1] Registered new searcher Searcher@29d66ea7[collection1] main{ExitableDirectoryReader(UninvertingDirectoryReader(Uninverting(_2(8.0.0):c20)))}
   [junit4]   2> 109400 INFO  (TEST-TestPointFields.testLongPointSetQuery-seed#[C207507C2F49A635]) [    ] o.a.s.u.p.LogUpdateProcessorFactory [collection1]  webapp=null path=null params={}{commit=} 0 14
   [junit4]   2> 109400 INFO  (TEST-TestPointFields.testLongPointSetQuery-seed#[C207507C2F49A635]) [    ] o.a.s.c.S.Request [collection1]  webapp=null path=null params={q={!term+f%3D'number_p_l_mv'}742139659238183452&fl=id,number_p_l_mv&wt=xml} hits=2 status=0 QTime=0
   [junit4]   2> 109401 INFO  (TEST-TestPointFields.testLongPointSetQuery-seed#[C207507C2F49A635]) [    ] o.a.s.c.S.Request [collection1]  webapp=null path=null params={q={!term+f%3D'number_p_l_mv'}1927588619165934871&fl=id,number_p_l_mv&wt=xml} hits=2 status=0 QTime=0
   [junit4]   2> 109401 INFO  (TEST-TestPointFields.testLongPointSetQuery-seed#[C207507C2F49A635]) [    ] o.a.s.c.S.Request [collection1]  webapp=null path=null params={q={!term+f%3D'number_p_l_mv'}-3916154250426366396&fl=id,number_p_l_mv&wt=xml} hits=2 status=0 QTime=0
   [junit4]   2> 109401 INFO  (TEST-TestPointFields.testLongPointSetQuery-seed#[C207507C2F49A635]) [    ] o.a.s.c.S.Request [collection1]  webapp=null path=null params={q={!term+f%3D'number_p_l_mv'}6219518495334204541&fl=id,number_p_l_mv&wt=xml} hits=2 status=0 QTime=0
   [junit4]   2> 109402 INFO  (TEST-TestPointFields.testLongPointSetQuery-seed#[C207507C2F49A635]) [    ] o.a.s.c.S.Request [collection1]  webapp=null path=null params={q={!term+f%3D'number_p_l_mv'}905598075325058830&fl=id,number_p_l_mv&wt=xml} hits=2 status=0 QTime=0
   [junit4]   2> 109402 INFO  (TEST-TestPointFields.testLongPointSetQuery-seed#[C207507C2F49A635]) [    ] o.a.s.c.S.Request [collection1]  webapp=null path=null params={q={!term+f%3D'number_p_l_mv'}5515167430303101938&fl=id,number_p_l_mv&wt=xml} hits=2 status=0 QTime=0
   [junit4]   2> 109403 INFO  (TEST-TestPointFields.testLongPointSetQuery-seed#[C207507C2F49A635]) [    ] o.a.s.c.S.Request [collection1]  webapp=null path=null params={q={!term+f%3D'number_p_l_mv'}1093623385275705537&fl=id,number_p_l_mv&wt=xml} hits=2 status=0 QTime=0
   [junit4]   2> 109403 INFO  (TEST-TestPointFields.testLongPointSetQuery-seed#[C207507C2F49A635]) [    ] o.a.s.c.S.Request [collection1]  webapp=null path=null params={q={!term+f%3D'number_p_l_mv'}-5154550007805219760&fl=id,number_p_l_mv&wt=xml} hits=2 status=0 QTime=0
   [junit4]   2> 109403 INFO  (TEST-TestPointFields.testLongPointSetQuery-seed#[C207507C2F49A635]) [    ] o.a.s.c.S.Request [collection1]  webapp=null path=null params={q={!term+f%3D'number_p_l_mv'}4367495882968412348&fl=id,number_p_l_mv&wt=xml} hits=2 status=0 QTime=0
   [junit4]   2> 109404 INFO  (TEST-TestPointFields.testLongPointSetQuery-seed#[C207507C2F49A635]) [    ] o.a.s.c.S.Request [collection1]  webapp=null path=null params={q={!term+f%3D'number_p_l_mv'}3679767603196171788&fl=id,number_p_l_mv&wt=xml} hits=2 status=0 QTime=0
   [junit4]   2> 109404 INFO  (TEST-TestPointFields.testLongPointSetQuery-seed#[C207507C2F49A635]) [    ] o.a.s.c.S.Request [collection1]  webapp=null path=null params={q={!term+f%3D'number_p_l_mv'}3951779304401261354&fl=id,number_p_l_mv&wt=xml} hits=2 status=0 QTime=0
   [junit4]   2> 109405 INFO  (TEST-TestPointFields.testLongPointSetQuery-seed#[C207507C2F49A635]) [    ] o.a.s.c.S.Request [collection1]  webapp=null path=null params={q={!term+f%3D'number_p_l_mv'}-6484400317595506535&fl=id,number_p_l_mv&wt=xml} hits=2 status=0 QTime=0
   [junit4]   2> 109405 INFO  (TEST-TestPointFields.testLongPointSetQuery-seed#[C207507C2F49A635]) [    ] o.a.s.c.S.Request [collection1]  webapp=null path=null params={q={!term+f%3D'number_p_l_mv'}-6370582941522518175&fl=id,number_p_l_mv&wt=xml} hits=2 status=0 QTime=0
   [junit4]   2> 109405 INFO  (TEST-TestPointFields.testLongPointSetQuery-seed#[C207507C2F49A635]) [    ] o.a.s.c.S.Request [collection1]  webapp=null path=null params={q={!term+f%3D'number_p_l_mv'}-127922753149584455&fl=id,number_p_l_mv&wt=xml} hits=2 status=0 QTime=0
   [junit4]   2> 109406 INFO  (TEST-TestPointFields.testLongPointSetQuery-seed#[C207507C2F49A635]) [    ] o.a.s.c.S.Request [collection1]  webapp=null path=null params={q={!term+f%3D'number_p_l_mv'}3737015887755383725&fl=id,number_p_l_mv&wt=xml} hits=2 status=0 QTime=0
   [junit4]   2> 109406 INFO  (TEST-TestPointFields.testLongPointSetQuery-seed#[C207507C2F49A635]) [    ] o.a.s.c.S.Request [collection1]  webapp=null path=null params={q={!term+f%3D'number_p_l_mv'}7016157932162687945&fl=id,number_p_l_mv&wt=xml} hits=2 status=0 QTime=0
   [junit4]   2> 109406 INFO  (TEST-TestPointFields.testLongPointSetQuery-seed#[C207507C2F49A635]) [    ] o.a.s.c.S.Request [collection1]  webapp=null path=null params={q={!term+f%3D'number_p_l_mv'}3629071263165100482&fl=id,number_p_l_mv&wt=xml} hits=2 status=0 QTime=0
   [junit4]   2> 109407 INFO  (TEST-TestPointFields.testLongPointSetQuery-seed#[C207507C2F49A635]) [    ] o.a.s.c.S.Request [collection1]  webapp=null path=null params={q={!term+f%3D'number_p_l_mv'}-9080159519937528465&fl=id,number_p_l_mv&wt=xml} hits=2 status=0 QTime=0
   [junit4]   2> 109407 INFO  (TEST-TestPointFields.testLongPointSetQuery-seed#[C207507C2F49A635]) [    ] o.a.s.c.S.Request [collection1]  webapp=null path=null params={q={!term+f%3D'number_p_l_mv'}9126401885810681676&fl=id,number_p_l_mv&wt=xml} hits=2 status=0 QTime=0
   [junit4]   2> 109407 INFO  (TEST-TestPointFields.testLongPointSetQuery-seed#[C207507C2F49A635]) [    ] o.a.s.c.S.Request [collection1]  webapp=null path=null params={q={!term+f%3D'number_p_l_mv'}-119064161628310679&fl=id,number_p_l_mv&wt=xml} hits=2 status=0 QTime=0
   [junit4]   2> 109408 INFO  (TEST-TestPointFields.testLongPointSetQuery-seed#[C207507C2F49A635]) [    ] o.a.s.c.S.Request [collection1]  webapp=null path=null params={q={!terms+f%3D'number_p_l_mv'}742139659238183452,1927588619165934871&fl=id,number_p_l_mv&wt=xml} hits=3 status=0 QTime=0
   [junit4]   2> 109408 INFO  (TEST-TestPointFields.testLongPointSetQuery-seed#[C207507C2F49A635]) [    ] o.a.s.c.S.Request [collection1]  webapp=null path=null params={q={!terms+f%3D'number_p_l_mv'}1927588619165934871,-3916154250426366396&fl=id,number_p_l_mv&wt=xml} hits=3 status=0 QTime=0
   [junit4]   2> 109409 INFO  (TEST-TestPointFields.testLongPointSetQuery-seed#[C207507C2F49A635]) [    ] o.a.s.c.S.Request [collection1]  webapp=null path=null params={q={!terms+f%3D'number_p_l_mv'}-3916154250426366396,6219518495334204541&fl=id,number_p_l_mv&wt=xml} hits=3 status=0 QTime=0
   [junit4]   2> 109409 INFO  (TEST-TestPointFields.testLongPointSetQuery-seed#[C207507C2F49A635]) [    ] o.a.s.c.S.Request [collection1]  webapp=null path=null params={q={!terms+f%3D'number_p_l_mv'}6219518495334204541,905598075325058830&fl=id,number_p_l_mv&wt=xml} hits=3 status=0 QTime=0
   [junit4]   2> 109409 INFO  (TEST-TestPointFields.testLongPointSetQuery-seed#[C207507C2F49A635]) [    ] o.a.s.c.S.Request [collection1]  webapp=null path=null params={q={!terms+f%3D'number_p_l_mv'}905598075325058830,5515167430303101938&fl=id,number_p_l_mv&wt=xml} hits=3 status=0 QTime=0
   [junit4]   2> 109410 INFO  (TEST-TestPointFields.testLongPointSetQuery-seed#[C207507C2F49A635]) [    ] o.a.s.c.S.Request [collection1]  webapp=null path=null params={q={!terms+f%3D'number_p_l_mv'}5515167430303101938,1093623385275705537&fl=id,number_p_l_mv&wt=xml} hits=3 status=0 QTime=0
   [junit4]   2> 109410 INFO  (TEST-TestPointFields.testLongPointSetQuery-seed#[C207507C2F49A635]) [    ] o.a.s.c.S.Request [collection1]  webapp=null path=null params={q={!terms+f%3D'number_p_l_mv'}1093623385275705537,-5154550007805219760&fl=id,number_p_l_mv&wt=xml} hits=3 status=0 QTime=0
   [junit4]   2> 109410 INFO  (TEST-TestPointFields.testLongPointSetQuery-seed#[C207507C2F49A635]) [    ] o.a.s.c.S.Request [collection1]  webapp=null path=null params={q={!terms+f%3D'number_p_l_mv'}-5154550007805219760,4367495882968412348&fl=id,number_p_l_mv&wt=xml} hits=3 status=0 QTime=0
   [junit4]   2> 109411 INFO  (TEST-TestPointFields.testLongPointSetQuery-seed#[C207507C2F49A635]) [    ] o.a.s.c.S.Request [collection1]  webapp=null path=null params={q={!terms+f%3D'number_p_l_mv'}4367495882968412348,3679767603196171788&fl=id,number_p_l_mv&wt=xml} hits=3 status=0 QTime=0
   [junit4]   2> 109411 INFO  (TEST-TestPointFields.testLongPointSetQuery-seed#[C207507C2F49A635]) [    ] o.a.s.c.S.Request [collection1]  webapp=null path=null params={q={!terms+f%3D'number_p_l_mv'}3679767603196171788,3951779304401261354&fl=id,number_p_l_mv&wt=xml} hits=3 status=0 QTime=0
   [junit4]   2> 109412 INFO  (TEST-TestPointFields.testLongPointSetQuery-seed#[C207507C2F49A635]) [    ] o.a.s.c.S.Request [collection1]  webapp=null path=null params={q={!terms+f%3D'number_p_l_mv'}3951779304401261354,-6484400317595506535&fl=id,number_p_l_mv&wt=xml} hits=3 status=0 QTime=0
   [junit4]   2> 109412 INFO  (TEST-TestPointFields.testLongPointSetQuery-seed#[C207507C2F49A635]) [    ] o.a.s.c.S.Request [collection1]  webapp=null path=null params={q={!terms+f%3D'number_p_l_mv'}-6484400317595506535,-6370582941522518175&fl=id,number_p_l_mv&wt=xml} hits=3 status=0 QTime=0
   [junit4]   2> 109412 INFO  (TEST-TestPointFields.testLongPointSetQuery-seed#[C207507C2F49A635]) [    ] o.a.s.c.S.Request [collection1]  webapp=null path=null params={q={!terms+f%3D'number_p_l_mv'}-6370582941522518175,-127922753149584455&fl=id,number_p_l_mv&wt=xml} hits=3 status=0 QTime=0
   [junit4]   2> 109413 INFO  (TEST-TestPointFields.testLongPointSetQuery-seed#[C207507C2F49A635]) [    ] o.a.s.c.S.Request [collection1]  webapp=null path=null params={q={!terms+f%3D'number_p_l_mv'}-127922753149584455,3737015887755383725&fl=id,number_p_l_mv&wt=xml} hits=3 status=0 QTime=0
   [junit4]   2> 109413 INFO  (TEST-TestPointFields.testLongPointSetQuery-seed#[C207507C2F49A635]) [    ] o.a.s.c.S.Request [collection1]  webapp=null path=null params={q={!terms+f%3D'number_p_l_mv'}3737015887755383725,7016157932162687945&fl=id,number_p_l_mv&wt=xml} hits=3 status=0 QTime=0
   [junit4]   2> 109414 INFO  (TEST-TestPointFields.testLongPointSetQuery-seed#[C207507C2F49A635]) [    ] o.a.s.c.S.Request [collection1]  webapp=null path=null params={q={!terms+f%3D'number_p_l_mv'}7016157932162687945,3629071263165100482&fl=id,number_p_l_mv&wt=xml} hits=3 status=0 QTime=0
   [junit4]   2> 109414 INFO  (TEST-TestPointFields.testLongPointSetQuery-seed#[C207507C2F49A635]) [    ] o.a.s.c.S.Request [collection1]  webapp=null path=null params={q={!terms+f%3D'number_p_l_mv'}3629071263165100482,-9080159519937528465&fl=id,number_p_l_mv&wt=xml} hits=3 status=0 QTime=0
   [junit4]   2> 109414 INFO  (TEST-TestPointFields.testLongPointSetQuery-seed#[C207507C2F49A635]) [    ] o.a.s.c.S.Request [collection1]  webapp=null path=null params={q={!terms+f%3D'number_p_l_mv'}-9080159519937528465,9126401885810681676&fl=id,number_p_l_mv&wt=xml} hits=3 status=0 QTime=0
   [junit4]   2> 109415 INFO  (TEST-TestPointFields.testLongPointSetQuery-seed#[C207507C2F49A635]) [    ] o.a.s.c.S.Request [collection1]  webapp=null path=null params={q={!terms+f%3D'number_p_l_mv'}9126401885810681676,-119064161628310679&fl=id,number_p_l_mv&wt=xml} hits=3 status=0 QTime=0
   [junit4]   2> 109428 INFO  (TEST-TestPointFields.testLongPointSetQuery-seed#[C207507C2F49A635]) [    ] o.a.s.c.S.Request [collection1]  webapp=null path=null params={q={!terms+f%3D'number_p_l_mv'}-119064161628310679,742139659238183452&fl=id,number_p_l_mv&wt=xml} hits=3 status=0 QTime=0
   [junit4]   2> 109429 INFO  (TEST-TestPointFields.testLongPointSetQuery-seed#[C207507C2F49A635]) [    ] o.a.s.u.p.LogUpdateProcessorFactory [collection1]  webapp=null path=null params={}{add=[0 (1572615431446855680)]} 0 1
   [junit4]   2> 109430 INFO  (TEST-TestPointFields.testLongPointSetQuery-seed#[C207507C2F49A635]) [    ] o.a.s.u.p.LogUpdateProcessorFactory [collection1]  webapp=null path=null params={}{add=[1 (1572615431447904256)]} 0 0
   [junit4]   2> 109430 INFO  (TEST-TestPointFields.testLongPointSetQuery-seed#[C207507C2F49A635]) [    ] o.a.s.u.p.LogUpdateProcessorFactory [collection1]  webapp=null path=null params={}{add=[2 (1572615431448952832)]} 0 0
   [junit4]   2> 109430 INFO  (TEST-TestPointFields.testLongPointSetQuery-seed#[C207507C2F49A635]) [    ] o.a.s.u.p.LogUpdateProcessorFactory [collection1]  webapp=null path=null params={}{add=[3 (1572615431448952833)]} 0 0
   [junit4]   2> 109431 INFO  (TEST-TestPointFields.testLongPointSetQuery-seed#[C207507C2F49A635]) [    ] o.a.s.u.p.LogUpdateProcessorFactory [collection1]  webapp=null path=null params={}{add=[4 (1572615431448952834)]} 0 0
   [junit4]   2> 109431 INFO  (TEST-TestPointFields.testLongPointSetQuery-seed#[C207507C2F49A635]) [    ] o.a.s.u.p.LogUpdateProcessorFactory [collection1]  webapp=null path=null params={}{add=[5 (1572615431450001408)]} 0 0
   [junit4]   2> 109431 INFO  (TEST-TestPointFields.testLongPointSetQuery-seed#[C207507C2F49A635]) [    ] o.a.s.u.p.LogUpdateProcessorFactory [collection1]  webapp=null path=null params={}{add=[6 (1572615431450001409)]} 0 0
   [junit4]   2> 109431 INFO  (TEST-TestPointFields.testLongPointSetQuery-seed#[C207507C2F49A635]) [    ] o.a.s.u.p.LogUpdateProcessorFactory [collection1]  webapp=null path=null params={}{add=[7 (1572615431450001410)]} 0 0
   [junit4]   2> 109432 INFO  (TEST-TestPointFields.testLongPointSetQuery-seed#[C207507C2F49A635]) [    ] o.a.s.u.p.LogUpdateProcessorFactory [collection1]  webapp=null path=null params={}{add=[8 (1572615431451049984)]} 0 0
   [junit4]   2> 109432 INFO  (TEST-TestPointFields.testLongPointSetQuery-seed#[C207507C2F49A635]) [    ] o.a.s.u.p.LogUpdateProcessorFactory [collection1]  webapp=null path=null params={}{add=[9 (1572615431451049985)]} 0 0
   [junit4]   2> 109432 INFO  (TEST-TestPointFields.testLongPointSetQuery-seed#[C207507C2F49A635]) [    ] o.a.s.u.p.LogUpdateProcessorFactory [collection1]  webapp=null path=null params={}{add=[10 (1572615431451049986)]} 0 0
   [junit4]   2> 109433 INFO  (TEST-TestPointFields.testLongPointSetQuery-seed#[C207507C2F49A635]) [    ] o.a.s.u.p.LogUpdateProcessorFactory [collection1]  webapp=null path=null params={}{add=[11 (1572615431452098560)]} 0 0
   [junit4]   2> 109443 INFO  (TEST-TestPointFields.testLongPointSetQuery-seed#[C207507C2F49A635]) [    ] o.a.s.u.p.LogUpdateProcessorFactory [collection1]  webapp=null path=null params={}{add=[12 (1572615431452098561)]} 0 10
   [junit4]   2> 109443 INFO  (TEST-T

[...truncated too long message...]

rtingDirectoryReader())}
   [junit4]   2> 137329 INFO  (TEST-TestPointFields.testDatePointFieldReturn-seed#[C207507C2F49A635]) [    ] o.a.s.u.DirectUpdateHandler2 end_commit_flush
   [junit4]   2> 137329 INFO  (TEST-TestPointFields.testDatePointFieldReturn-seed#[C207507C2F49A635]) [    ] o.a.s.u.p.LogUpdateProcessorFactory [collection1]  webapp=null path=null params={}{commit=} 0 1
   [junit4]   2> 137329 INFO  (TEST-TestPointFields.testDatePointFieldReturn-seed#[C207507C2F49A635]) [    ] o.a.s.u.DirectUpdateHandler2 [collection1] REMOVING ALL DOCUMENTS FROM INDEX
   [junit4]   2> 137329 INFO  (TEST-TestPointFields.testDatePointFieldReturn-seed#[C207507C2F49A635]) [    ] o.a.s.s.SolrIndexSearcher Opening [Searcher@5de4f34d[collection1] realtime]
   [junit4]   2> 137329 INFO  (TEST-TestPointFields.testDatePointFieldReturn-seed#[C207507C2F49A635]) [    ] o.a.s.u.p.LogUpdateProcessorFactory [collection1]  webapp=null path=null params={_version_=-9223372036854775807&update.distrib=FROMLEADER&versions=true&wt=json&indent=true}{deleteByQuery=*:* (-9223372036854775807)} 0 0
   [junit4]   2> 137330 INFO  (TEST-TestPointFields.testDatePointFieldReturn-seed#[C207507C2F49A635]) [    ] o.a.s.u.DirectUpdateHandler2 start commit{_version_=1572615460704223232,optimize=false,openSearcher=true,waitSearcher=true,expungeDeletes=false,softCommit=false,prepareCommit=false}
   [junit4]   2> 137330 INFO  (TEST-TestPointFields.testDatePointFieldReturn-seed#[C207507C2F49A635]) [    ] o.a.s.u.SolrIndexWriter Calling setCommitData with IW:org.apache.solr.update.SolrIndexWriter@6fbb4aa2 commitCommandVersion:1572615460704223232
   [junit4]   2> 137330 INFO  (TEST-TestPointFields.testDatePointFieldReturn-seed#[C207507C2F49A635]) [    ] o.a.s.s.SolrIndexSearcher Opening [Searcher@77d087fc[collection1] main]
   [junit4]   2> 137331 INFO  (searcherExecutor-485-thread-1) [    ] o.a.s.c.SolrCore [collection1] Registered new searcher Searcher@77d087fc[collection1] main{ExitableDirectoryReader(UninvertingDirectoryReader())}
   [junit4]   2> 137331 INFO  (TEST-TestPointFields.testDatePointFieldReturn-seed#[C207507C2F49A635]) [    ] o.a.s.u.DirectUpdateHandler2 end_commit_flush
   [junit4]   2> 137331 INFO  (TEST-TestPointFields.testDatePointFieldReturn-seed#[C207507C2F49A635]) [    ] o.a.s.u.p.LogUpdateProcessorFactory [collection1]  webapp=null path=null params={}{commit=} 0 1
   [junit4]   2> 137331 INFO  (TEST-TestPointFields.testDatePointFieldReturn-seed#[C207507C2F49A635]) [    ] o.a.s.SolrTestCaseJ4 ###Ending testDatePointFieldReturn
   [junit4]   2> 137332 INFO  (SUITE-TestPointFields-seed#[C207507C2F49A635]-worker) [    ] o.a.s.SolrTestCaseJ4 ###deleteCore
   [junit4]   2> 137332 INFO  (SUITE-TestPointFields-seed#[C207507C2F49A635]-worker) [    ] o.a.s.c.CoreContainer Shutting down CoreContainer instance=572575950
   [junit4]   2> 137332 INFO  (SUITE-TestPointFields-seed#[C207507C2F49A635]-worker) [    ] o.a.s.m.SolrMetricManager Closing metric reporters for registry=solr.node, tag=null
   [junit4]   2> 137333 INFO  (SUITE-TestPointFields-seed#[C207507C2F49A635]-worker) [    ] o.a.s.m.SolrMetricManager Closing metric reporters for registry=solr.jvm, tag=null
   [junit4]   2> 137334 INFO  (SUITE-TestPointFields-seed#[C207507C2F49A635]-worker) [    ] o.a.s.m.SolrMetricManager Closing metric reporters for registry=solr.jetty, tag=null
   [junit4]   2> 137334 INFO  (SUITE-TestPointFields-seed#[C207507C2F49A635]-worker) [    ] o.a.s.c.TransientSolrCoreCacheDefault Allocating transient cache for 2147483647 transient cores
   [junit4]   2> 137334 INFO  (coreCloseExecutor-490-thread-1) [    x:collection1] o.a.s.c.SolrCore [collection1]  CLOSING SolrCore org.apache.solr.core.SolrCore@666327c2
   [junit4]   2> 137337 INFO  (coreCloseExecutor-490-thread-1) [    x:collection1] o.a.s.m.SolrMetricManager Closing metric reporters for registry=solr.core.collection1, tag=1717774274
   [junit4]   2> NOTE: leaving temporary files on disk at: /home/jenkins/jenkins-slave/workspace/Lucene-Solr-Tests-master/solr/build/solr-core/test/J1/temp/solr.schema.TestPointFields_C207507C2F49A635-001
   [junit4]   2> NOTE: test params are: codec=Asserting(Lucene70): {number_d=PostingsFormat(name=MockRandom), _version_=PostingsFormat(name=MockRandom), id=FST50}, docValues:{foo_p_f_ni_dv_ns=DocValuesFormat(name=Direct), foo_p_f_ni_dv_ns_mv=DocValuesFormat(name=Lucene70), number_p_dt_dv_ns=DocValuesFormat(name=Asserting), foo_p_d_ni_dv_ns_mv=DocValuesFormat(name=Direct), foo_p_i_ni_dv_ns=DocValuesFormat(name=Asserting), number_p_f_ni_mv_dv_smf=DocValuesFormat(name=Direct), number_p_dt_ni_mv_dv_sml=DocValuesFormat(name=Lucene70), number_p_l_ni_dv=DocValuesFormat(name=Asserting), number_p_f_dv=DocValuesFormat(name=Asserting), number_p_i_dv_ns=DocValuesFormat(name=Direct), number_p_l_dv_ns=DocValuesFormat(name=Asserting), foo_p_l_ni_dv_ns=DocValuesFormat(name=Lucene70), number_p_dt_ni_mv_dv=DocValuesFormat(name=Asserting), number_p_l_dv_sml=DocValuesFormat(name=Lucene70), number_p_i_dv_smf=DocValuesFormat(name=Memory), number_p_d_ni_ns_dv=DocValuesFormat(name=Memory), number_p_dt_ni_dv_ns_mv=DocValuesFormat(name=Asserting), number_p_i_ni_dv_ns_mv=DocValuesFormat(name=Direct), number_p_f_dv_smf=DocValuesFormat(name=Lucene70), number_p_l_ni_dv_ns=DocValuesFormat(name=Memory), number_p_l_dv_smf=DocValuesFormat(name=Direct), number_p_d_ni_mv_dv_sml=DocValuesFormat(name=Direct), number_p_f_ni_dv_ns_mv=DocValuesFormat(name=Memory), number_p_d_dv_smf=DocValuesFormat(name=Direct), number_p_dt_ni_dv=DocValuesFormat(name=Asserting), number_p_f_ni_mv_dv_sml=DocValuesFormat(name=Lucene70), number_p_d_ni_mv_dv_smf=DocValuesFormat(name=Lucene70), number_p_f_dv_ns_mv=DocValuesFormat(name=Asserting), number_p_l_dv_ns_mv=DocValuesFormat(name=Asserting), number_p_dt_mv_dv_sml=DocValuesFormat(name=Lucene70), number_p_l_ni_ns_dv=DocValuesFormat(name=Asserting), number_p_f_ni_ns_dv=DocValuesFormat(name=Memory), number_p_i_ni_dv_ns=DocValuesFormat(name=Lucene70), number_p_i_dv_sml=DocValuesFormat(name=Asserting), foo_p_d_ni_dv_ns=DocValuesFormat(name=Lucene70), number_p_dt_dv_sml=DocValuesFormat(name=Direct), number_p_dt_dv_smf=DocValuesFormat(name=Lucene70), number_p_i_mv_dv=DocValuesFormat(name=Lucene70), number_p_l_ni_dv_ns_mv=DocValuesFormat(name=Asserting), number_p_d_ni_dv=DocValuesFormat(name=Memory), number_p_dt_ni_dv_sml=DocValuesFormat(name=Direct), number_p_d_mv_dv_smf=DocValuesFormat(name=Lucene70), foo_p_l_ni_dv_ns_mv=DocValuesFormat(name=Direct), number_p_d_ni_dv_smf=DocValuesFormat(name=Direct), number_p_dt_ni_dv_smf=DocValuesFormat(name=Lucene70), number_p_d_mv_dv_sml=DocValuesFormat(name=Direct), number_p_dt_ni_ns_dv=DocValuesFormat(name=Asserting), foo_p_i_ni_dv_ns_mv=DocValuesFormat(name=Asserting), number_p_dt_mv_dv_smf=DocValuesFormat(name=Direct), number_p_l_mv_dv=DocValuesFormat(name=Memory), number_p_d_ni_dv_sml=DocValuesFormat(name=Lucene70), number_p_i_ni_mv_dv=DocValuesFormat(name=Direct), number_p_f_mv_dv=DocValuesFormat(name=Asserting), number_p_f_ni_mv_dv=DocValuesFormat(name=Memory), number_p_i_mv_dv_smf=DocValuesFormat(name=Memory), foo_p_dt_ni_dv_ns_mv=DocValuesFormat(name=Direct), number_p_l_ni_mv_dv=DocValuesFormat(name=Asserting), number_p_d_dv=DocValuesFormat(name=Memory), number_p_l_ni_dv_sml=DocValuesFormat(name=Lucene70), number_p_i_ni_mv_dv_smf=DocValuesFormat(name=Memory), number_p_d_dv_ns=DocValuesFormat(name=Memory), number_p_l_ni_dv_smf=DocValuesFormat(name=Direct), number_p_dt_dv_ns_mv=DocValuesFormat(name=Memory), number_p_i_ni_mv_dv_sml=DocValuesFormat(name=Asserting), number_p_l_dv=DocValuesFormat(name=Memory), number_p_dt_mv_dv=DocValuesFormat(name=Memory), number_p_l_mv_dv_smf=DocValuesFormat(name=Lucene70), number_p_d_ni_dv_ns=DocValuesFormat(name=Asserting), number_p_i_dv_ns_mv=DocValuesFormat(name=Lucene70), number_p_d_ni_dv_ns_mv=DocValuesFormat(name=Memory), number_p_i_ni_dv_sml=DocValuesFormat(name=Memory), number_p_i_ni_dv_smf=DocValuesFormat(name=Asserting), number_p_l_mv_dv_sml=DocValuesFormat(name=Direct), number_p_f_dv_sml=DocValuesFormat(name=Direct), number_p_d_dv_sml=DocValuesFormat(name=Lucene70), number_p_f_ni_dv_ns=DocValuesFormat(name=Asserting), number_p_i_ni_ns_dv=DocValuesFormat(name=Direct), number_p_f_ni_dv=DocValuesFormat(name=Memory), foo_p_dt_ni_dv_ns=DocValuesFormat(name=Lucene70), number_p_dt_dv=DocValuesFormat(name=Asserting), number_p_l_ni_mv_dv_smf=DocValuesFormat(name=Lucene70), number_p_dt_ni_mv_dv_smf=DocValuesFormat(name=Direct), number_p_f_ni_dv_sml=DocValuesFormat(name=Direct), number_p_d_ni_mv_dv=DocValuesFormat(name=Memory), number_p_d_dv_ns_mv=DocValuesFormat(name=Memory), number_p_l_ni_mv_dv_sml=DocValuesFormat(name=Direct), number_p_d_mv_dv=DocValuesFormat(name=Asserting), number_p_i_dv=DocValuesFormat(name=Lucene70), number_p_f_mv_dv_sml=DocValuesFormat(name=Lucene70), number_p_i_mv_dv_sml=DocValuesFormat(name=Asserting), number_p_f_ni_dv_smf=DocValuesFormat(name=Lucene70), number_p_dt_ni_dv_ns=DocValuesFormat(name=Memory), number_p_f_mv_dv_smf=DocValuesFormat(name=Direct), number_p_i_ni_dv=DocValuesFormat(name=Direct), number_p_f_dv_ns=DocValuesFormat(name=Memory)}, maxPointsInLeafNode=1651, maxMBSortInHeap=5.2797809512425955, sim=RandomSimilarity(queryNorm=false): {}, locale=en-NZ, timezone=Europe/Andorra
   [junit4]   2> NOTE: Linux 4.4.0-83-generic amd64/Oracle Corporation 1.8.0_131 (64-bit)/cpus=4,threads=1,free=76401080,total=430440448
   [junit4]   2> NOTE: All tests run in this JVM: [PreAnalyzedFieldManagedSchemaCloudTest, TestSolrCloudWithKerberosAlt, BasicFunctionalityTest, TestCloudPseudoReturnFields, TestMissingGroups, IndexSchemaRuntimeFieldTest, DocValuesMissingTest, AsyncCallRequestStatusResponseTest, ReplaceNodeTest, TestPivotHelperCode, TestQueryWrapperFilter, TestNRTOpen, CdcrVersionReplicationTest, TestCorePropertiesReload, SolrSlf4jReporterTest, TestPointFields]
   [junit4] Completed [50/727 (1!)] on J1 in 28.51s, 104 tests, 4 errors, 1 skipped <<< FAILURES!

[...truncated 45500 lines...]

Mime
View raw message