lucene-dev mailing list archives

Site index · List index
Message view « Date » · « Thread »
Top « Date » · « Thread »
From Apache Jenkins Server <jenk...@builds.apache.org>
Subject [JENKINS] Lucene-Solr-Tests-7.x - Build # 24 - Unstable
Date Tue, 11 Jul 2017 06:35:38 GMT
Build: https://builds.apache.org/job/Lucene-Solr-Tests-7.x/24/

4 tests failed.
FAILED:  org.apache.solr.schema.TestPointFields.testDoublePointStats

Error Message:
Exception during query

Stack Trace:
java.lang.RuntimeException: Exception during query
	at __randomizedtesting.SeedInfo.seed([127C1875A23278A1:3D66D623569F6405]:0)
	at org.apache.solr.SolrTestCaseJ4.assertQ(SolrTestCaseJ4.java:878)
	at org.apache.solr.SolrTestCaseJ4.assertQ(SolrTestCaseJ4.java:845)
	at org.apache.solr.schema.TestPointFields.testPointStats(TestPointFields.java:2197)
	at org.apache.solr.schema.TestPointFields.testDoublePointStats(TestPointFields.java:689)
	at sun.reflect.NativeMethodAccessorImpl.invoke0(Native Method)
	at sun.reflect.NativeMethodAccessorImpl.invoke(NativeMethodAccessorImpl.java:62)
	at sun.reflect.DelegatingMethodAccessorImpl.invoke(DelegatingMethodAccessorImpl.java:43)
	at java.lang.reflect.Method.invoke(Method.java:498)
	at com.carrotsearch.randomizedtesting.RandomizedRunner.invoke(RandomizedRunner.java:1713)
	at com.carrotsearch.randomizedtesting.RandomizedRunner$8.evaluate(RandomizedRunner.java:907)
	at com.carrotsearch.randomizedtesting.RandomizedRunner$9.evaluate(RandomizedRunner.java:943)
	at com.carrotsearch.randomizedtesting.RandomizedRunner$10.evaluate(RandomizedRunner.java:957)
	at com.carrotsearch.randomizedtesting.rules.SystemPropertiesRestoreRule$1.evaluate(SystemPropertiesRestoreRule.java:57)
	at org.apache.lucene.util.TestRuleSetupTeardownChained$1.evaluate(TestRuleSetupTeardownChained.java:49)
	at org.apache.lucene.util.AbstractBeforeAfterRule$1.evaluate(AbstractBeforeAfterRule.java:45)
	at org.apache.lucene.util.TestRuleThreadAndTestName$1.evaluate(TestRuleThreadAndTestName.java:48)
	at org.apache.lucene.util.TestRuleIgnoreAfterMaxFailures$1.evaluate(TestRuleIgnoreAfterMaxFailures.java:64)
	at org.apache.lucene.util.TestRuleMarkFailure$1.evaluate(TestRuleMarkFailure.java:47)
	at com.carrotsearch.randomizedtesting.rules.StatementAdapter.evaluate(StatementAdapter.java:36)
	at com.carrotsearch.randomizedtesting.ThreadLeakControl$StatementRunner.run(ThreadLeakControl.java:368)
	at com.carrotsearch.randomizedtesting.ThreadLeakControl.forkTimeoutingTask(ThreadLeakControl.java:817)
	at com.carrotsearch.randomizedtesting.ThreadLeakControl$3.evaluate(ThreadLeakControl.java:468)
	at com.carrotsearch.randomizedtesting.RandomizedRunner.runSingleTest(RandomizedRunner.java:916)
	at com.carrotsearch.randomizedtesting.RandomizedRunner$5.evaluate(RandomizedRunner.java:802)
	at com.carrotsearch.randomizedtesting.RandomizedRunner$6.evaluate(RandomizedRunner.java:852)
	at com.carrotsearch.randomizedtesting.RandomizedRunner$7.evaluate(RandomizedRunner.java:863)
	at com.carrotsearch.randomizedtesting.rules.StatementAdapter.evaluate(StatementAdapter.java:36)
	at com.carrotsearch.randomizedtesting.rules.SystemPropertiesRestoreRule$1.evaluate(SystemPropertiesRestoreRule.java:57)
	at org.apache.lucene.util.AbstractBeforeAfterRule$1.evaluate(AbstractBeforeAfterRule.java:45)
	at com.carrotsearch.randomizedtesting.rules.StatementAdapter.evaluate(StatementAdapter.java:36)
	at org.apache.lucene.util.TestRuleStoreClassName$1.evaluate(TestRuleStoreClassName.java:41)
	at com.carrotsearch.randomizedtesting.rules.NoShadowingOrOverridesOnMethodsRule$1.evaluate(NoShadowingOrOverridesOnMethodsRule.java:40)
	at com.carrotsearch.randomizedtesting.rules.NoShadowingOrOverridesOnMethodsRule$1.evaluate(NoShadowingOrOverridesOnMethodsRule.java:40)
	at com.carrotsearch.randomizedtesting.rules.StatementAdapter.evaluate(StatementAdapter.java:36)
	at com.carrotsearch.randomizedtesting.rules.StatementAdapter.evaluate(StatementAdapter.java:36)
	at com.carrotsearch.randomizedtesting.rules.StatementAdapter.evaluate(StatementAdapter.java:36)
	at org.apache.lucene.util.TestRuleAssertionsRequired$1.evaluate(TestRuleAssertionsRequired.java:53)
	at org.apache.lucene.util.TestRuleMarkFailure$1.evaluate(TestRuleMarkFailure.java:47)
	at org.apache.lucene.util.TestRuleIgnoreAfterMaxFailures$1.evaluate(TestRuleIgnoreAfterMaxFailures.java:64)
	at org.apache.lucene.util.TestRuleIgnoreTestSuites$1.evaluate(TestRuleIgnoreTestSuites.java:54)
	at com.carrotsearch.randomizedtesting.rules.StatementAdapter.evaluate(StatementAdapter.java:36)
	at com.carrotsearch.randomizedtesting.ThreadLeakControl$StatementRunner.run(ThreadLeakControl.java:368)
	at java.lang.Thread.run(Thread.java:748)
Caused by: java.lang.RuntimeException: REQUEST FAILED: xpath=//*[@numFound='11']
	xml response was: <?xml version="1.0" encoding="UTF-8"?>
<response>
<lst name="responseHeader"><int name="status">0</int><int name="QTime">17</int></lst><result name="response" numFound="21" start="0"><doc><str name="id">0</str><double name="number_p_d_dv">59945.93</double></doc><doc><str name="id">1</str><double name="number_p_d_dv">-4137058.0</double></doc><doc><str name="id">2</str><double name="number_p_d_dv">-0.9376726</double></doc><doc><str name="id">3</str><double name="number_p_d_dv">-0.0602886</double></doc><doc><str name="id">4</str><double name="number_p_d_dv">632053.1</double></doc><doc><str name="id">5</str><double name="number_p_d_dv">817.9425</double></doc><doc><str name="id">6</str><double name="number_p_d_dv">1581063.0</double></doc><doc><str name="id">7</str><double name="number_p_d_dv">-295181.2</double></doc><doc><str name="id">8</str><double name="number_p_d_dv">-1661.36</double></doc><doc><str name="id">9</str><double name="number_p_d_dv">-92.61549</double></doc></result><lst name="stats"><lst name="stats_fields"><lst name="number_p_d_dv"><double name="min">-4137058.0</double><double name="max">5173127.0</double><long name="count">20</long><long name="missing">1</long><double name="sum">3114202.009159299</double><double name="sumOfSquares">4.82649616476457E13</double><double name="mean">155710.10045796496</double><double name="stddev">1585792.9933923497</double></lst></lst></lst>
</response>

	request was:q=*:*&stats=true&fl=id,+number_p_d_dv&wt=xml&stats.field=number_p_d_dv
	at org.apache.solr.SolrTestCaseJ4.assertQ(SolrTestCaseJ4.java:871)
	... 42 more


FAILED:  org.apache.solr.schema.TestPointFields.testIntPointStats

Error Message:
Exception during query

Stack Trace:
java.lang.RuntimeException: Exception during query
	at __randomizedtesting.SeedInfo.seed([127C1875A23278A1:79F9E17E3C946678]:0)
	at org.apache.solr.SolrTestCaseJ4.assertQ(SolrTestCaseJ4.java:878)
	at org.apache.solr.SolrTestCaseJ4.assertQ(SolrTestCaseJ4.java:845)
	at org.apache.solr.schema.TestPointFields.testPointStats(TestPointFields.java:2197)
	at org.apache.solr.schema.TestPointFields.testIntPointStats(TestPointFields.java:278)
	at sun.reflect.NativeMethodAccessorImpl.invoke0(Native Method)
	at sun.reflect.NativeMethodAccessorImpl.invoke(NativeMethodAccessorImpl.java:62)
	at sun.reflect.DelegatingMethodAccessorImpl.invoke(DelegatingMethodAccessorImpl.java:43)
	at java.lang.reflect.Method.invoke(Method.java:498)
	at com.carrotsearch.randomizedtesting.RandomizedRunner.invoke(RandomizedRunner.java:1713)
	at com.carrotsearch.randomizedtesting.RandomizedRunner$8.evaluate(RandomizedRunner.java:907)
	at com.carrotsearch.randomizedtesting.RandomizedRunner$9.evaluate(RandomizedRunner.java:943)
	at com.carrotsearch.randomizedtesting.RandomizedRunner$10.evaluate(RandomizedRunner.java:957)
	at com.carrotsearch.randomizedtesting.rules.SystemPropertiesRestoreRule$1.evaluate(SystemPropertiesRestoreRule.java:57)
	at org.apache.lucene.util.TestRuleSetupTeardownChained$1.evaluate(TestRuleSetupTeardownChained.java:49)
	at org.apache.lucene.util.AbstractBeforeAfterRule$1.evaluate(AbstractBeforeAfterRule.java:45)
	at org.apache.lucene.util.TestRuleThreadAndTestName$1.evaluate(TestRuleThreadAndTestName.java:48)
	at org.apache.lucene.util.TestRuleIgnoreAfterMaxFailures$1.evaluate(TestRuleIgnoreAfterMaxFailures.java:64)
	at org.apache.lucene.util.TestRuleMarkFailure$1.evaluate(TestRuleMarkFailure.java:47)
	at com.carrotsearch.randomizedtesting.rules.StatementAdapter.evaluate(StatementAdapter.java:36)
	at com.carrotsearch.randomizedtesting.ThreadLeakControl$StatementRunner.run(ThreadLeakControl.java:368)
	at com.carrotsearch.randomizedtesting.ThreadLeakControl.forkTimeoutingTask(ThreadLeakControl.java:817)
	at com.carrotsearch.randomizedtesting.ThreadLeakControl$3.evaluate(ThreadLeakControl.java:468)
	at com.carrotsearch.randomizedtesting.RandomizedRunner.runSingleTest(RandomizedRunner.java:916)
	at com.carrotsearch.randomizedtesting.RandomizedRunner$5.evaluate(RandomizedRunner.java:802)
	at com.carrotsearch.randomizedtesting.RandomizedRunner$6.evaluate(RandomizedRunner.java:852)
	at com.carrotsearch.randomizedtesting.RandomizedRunner$7.evaluate(RandomizedRunner.java:863)
	at com.carrotsearch.randomizedtesting.rules.StatementAdapter.evaluate(StatementAdapter.java:36)
	at com.carrotsearch.randomizedtesting.rules.SystemPropertiesRestoreRule$1.evaluate(SystemPropertiesRestoreRule.java:57)
	at org.apache.lucene.util.AbstractBeforeAfterRule$1.evaluate(AbstractBeforeAfterRule.java:45)
	at com.carrotsearch.randomizedtesting.rules.StatementAdapter.evaluate(StatementAdapter.java:36)
	at org.apache.lucene.util.TestRuleStoreClassName$1.evaluate(TestRuleStoreClassName.java:41)
	at com.carrotsearch.randomizedtesting.rules.NoShadowingOrOverridesOnMethodsRule$1.evaluate(NoShadowingOrOverridesOnMethodsRule.java:40)
	at com.carrotsearch.randomizedtesting.rules.NoShadowingOrOverridesOnMethodsRule$1.evaluate(NoShadowingOrOverridesOnMethodsRule.java:40)
	at com.carrotsearch.randomizedtesting.rules.StatementAdapter.evaluate(StatementAdapter.java:36)
	at com.carrotsearch.randomizedtesting.rules.StatementAdapter.evaluate(StatementAdapter.java:36)
	at com.carrotsearch.randomizedtesting.rules.StatementAdapter.evaluate(StatementAdapter.java:36)
	at org.apache.lucene.util.TestRuleAssertionsRequired$1.evaluate(TestRuleAssertionsRequired.java:53)
	at org.apache.lucene.util.TestRuleMarkFailure$1.evaluate(TestRuleMarkFailure.java:47)
	at org.apache.lucene.util.TestRuleIgnoreAfterMaxFailures$1.evaluate(TestRuleIgnoreAfterMaxFailures.java:64)
	at org.apache.lucene.util.TestRuleIgnoreTestSuites$1.evaluate(TestRuleIgnoreTestSuites.java:54)
	at com.carrotsearch.randomizedtesting.rules.StatementAdapter.evaluate(StatementAdapter.java:36)
	at com.carrotsearch.randomizedtesting.ThreadLeakControl$StatementRunner.run(ThreadLeakControl.java:368)
	at java.lang.Thread.run(Thread.java:748)
Caused by: java.lang.RuntimeException: REQUEST FAILED: xpath=//*[@numFound='11']
	xml response was: <?xml version="1.0" encoding="UTF-8"?>
<response>
<lst name="responseHeader"><int name="status">0</int><int name="QTime">3</int></lst><result name="response" numFound="21" start="0"><doc><str name="id">0</str><int name="number_p_i_dv">-4363299</int></doc><doc><str name="id">1</str><int name="number_p_i_dv">7765855</int></doc><doc><str name="id">2</str><int name="number_p_i_dv">-9220465</int></doc><doc><str name="id">3</str><int name="number_p_i_dv">-5768923</int></doc><doc><str name="id">4</str><int name="number_p_i_dv">6692465</int></doc><doc><str name="id">5</str><int name="number_p_i_dv">4747930</int></doc><doc><str name="id">6</str><int name="number_p_i_dv">-4722385</int></doc><doc><str name="id">7</str><int name="number_p_i_dv">-3795233</int></doc><doc><str name="id">8</str><int name="number_p_i_dv">-5175819</int></doc><doc><str name="id">9</str><int name="number_p_i_dv">-1434095</int></doc></result><lst name="stats"><lst name="stats_fields"><lst name="number_p_i_dv"><double name="min">-9578594.0</double><double name="max">9154621.0</double><long name="count">20</long><long name="missing">1</long><double name="sum">-289568.0</double><double name="sumOfSquares">6.21176411509174E14</double><double name="mean">-14478.4</double><double name="stddev">5717803.309460368</double></lst></lst></lst>
</response>

	request was:q=*:*&stats=true&fl=id,+number_p_i_dv&wt=xml&stats.field=number_p_i_dv
	at org.apache.solr.SolrTestCaseJ4.assertQ(SolrTestCaseJ4.java:871)
	... 42 more


FAILED:  org.apache.solr.schema.TestPointFields.testFloatPointStats

Error Message:
Exception during query

Stack Trace:
java.lang.RuntimeException: Exception during query
	at __randomizedtesting.SeedInfo.seed([127C1875A23278A1:A87660521A23BA43]:0)
	at org.apache.solr.SolrTestCaseJ4.assertQ(SolrTestCaseJ4.java:878)
	at org.apache.solr.SolrTestCaseJ4.assertQ(SolrTestCaseJ4.java:845)
	at org.apache.solr.schema.TestPointFields.testPointStats(TestPointFields.java:2197)
	at org.apache.solr.schema.TestPointFields.testFloatPointStats(TestPointFields.java:989)
	at sun.reflect.NativeMethodAccessorImpl.invoke0(Native Method)
	at sun.reflect.NativeMethodAccessorImpl.invoke(NativeMethodAccessorImpl.java:62)
	at sun.reflect.DelegatingMethodAccessorImpl.invoke(DelegatingMethodAccessorImpl.java:43)
	at java.lang.reflect.Method.invoke(Method.java:498)
	at com.carrotsearch.randomizedtesting.RandomizedRunner.invoke(RandomizedRunner.java:1713)
	at com.carrotsearch.randomizedtesting.RandomizedRunner$8.evaluate(RandomizedRunner.java:907)
	at com.carrotsearch.randomizedtesting.RandomizedRunner$9.evaluate(RandomizedRunner.java:943)
	at com.carrotsearch.randomizedtesting.RandomizedRunner$10.evaluate(RandomizedRunner.java:957)
	at com.carrotsearch.randomizedtesting.rules.SystemPropertiesRestoreRule$1.evaluate(SystemPropertiesRestoreRule.java:57)
	at org.apache.lucene.util.TestRuleSetupTeardownChained$1.evaluate(TestRuleSetupTeardownChained.java:49)
	at org.apache.lucene.util.AbstractBeforeAfterRule$1.evaluate(AbstractBeforeAfterRule.java:45)
	at org.apache.lucene.util.TestRuleThreadAndTestName$1.evaluate(TestRuleThreadAndTestName.java:48)
	at org.apache.lucene.util.TestRuleIgnoreAfterMaxFailures$1.evaluate(TestRuleIgnoreAfterMaxFailures.java:64)
	at org.apache.lucene.util.TestRuleMarkFailure$1.evaluate(TestRuleMarkFailure.java:47)
	at com.carrotsearch.randomizedtesting.rules.StatementAdapter.evaluate(StatementAdapter.java:36)
	at com.carrotsearch.randomizedtesting.ThreadLeakControl$StatementRunner.run(ThreadLeakControl.java:368)
	at com.carrotsearch.randomizedtesting.ThreadLeakControl.forkTimeoutingTask(ThreadLeakControl.java:817)
	at com.carrotsearch.randomizedtesting.ThreadLeakControl$3.evaluate(ThreadLeakControl.java:468)
	at com.carrotsearch.randomizedtesting.RandomizedRunner.runSingleTest(RandomizedRunner.java:916)
	at com.carrotsearch.randomizedtesting.RandomizedRunner$5.evaluate(RandomizedRunner.java:802)
	at com.carrotsearch.randomizedtesting.RandomizedRunner$6.evaluate(RandomizedRunner.java:852)
	at com.carrotsearch.randomizedtesting.RandomizedRunner$7.evaluate(RandomizedRunner.java:863)
	at com.carrotsearch.randomizedtesting.rules.StatementAdapter.evaluate(StatementAdapter.java:36)
	at com.carrotsearch.randomizedtesting.rules.SystemPropertiesRestoreRule$1.evaluate(SystemPropertiesRestoreRule.java:57)
	at org.apache.lucene.util.AbstractBeforeAfterRule$1.evaluate(AbstractBeforeAfterRule.java:45)
	at com.carrotsearch.randomizedtesting.rules.StatementAdapter.evaluate(StatementAdapter.java:36)
	at org.apache.lucene.util.TestRuleStoreClassName$1.evaluate(TestRuleStoreClassName.java:41)
	at com.carrotsearch.randomizedtesting.rules.NoShadowingOrOverridesOnMethodsRule$1.evaluate(NoShadowingOrOverridesOnMethodsRule.java:40)
	at com.carrotsearch.randomizedtesting.rules.NoShadowingOrOverridesOnMethodsRule$1.evaluate(NoShadowingOrOverridesOnMethodsRule.java:40)
	at com.carrotsearch.randomizedtesting.rules.StatementAdapter.evaluate(StatementAdapter.java:36)
	at com.carrotsearch.randomizedtesting.rules.StatementAdapter.evaluate(StatementAdapter.java:36)
	at com.carrotsearch.randomizedtesting.rules.StatementAdapter.evaluate(StatementAdapter.java:36)
	at org.apache.lucene.util.TestRuleAssertionsRequired$1.evaluate(TestRuleAssertionsRequired.java:53)
	at org.apache.lucene.util.TestRuleMarkFailure$1.evaluate(TestRuleMarkFailure.java:47)
	at org.apache.lucene.util.TestRuleIgnoreAfterMaxFailures$1.evaluate(TestRuleIgnoreAfterMaxFailures.java:64)
	at org.apache.lucene.util.TestRuleIgnoreTestSuites$1.evaluate(TestRuleIgnoreTestSuites.java:54)
	at com.carrotsearch.randomizedtesting.rules.StatementAdapter.evaluate(StatementAdapter.java:36)
	at com.carrotsearch.randomizedtesting.ThreadLeakControl$StatementRunner.run(ThreadLeakControl.java:368)
	at java.lang.Thread.run(Thread.java:748)
Caused by: java.lang.RuntimeException: REQUEST FAILED: xpath=//*[@numFound='11']
	xml response was: <?xml version="1.0" encoding="UTF-8"?>
<response>
<lst name="responseHeader"><int name="status">0</int><int name="QTime">1</int></lst><result name="response" numFound="21" start="0"><doc><str name="id">0</str><float name="number_p_f_dv">-888884.1</float></doc><doc><str name="id">1</str><float name="number_p_f_dv">-396154.5</float></doc><doc><str name="id">2</str><float name="number_p_f_dv">27844.74</float></doc><doc><str name="id">3</str><float name="number_p_f_dv">99568.33</float></doc><doc><str name="id">4</str><float name="number_p_f_dv">-0.5181233</float></doc><doc><str name="id">5</str><float name="number_p_f_dv">-64.28127</float></doc><doc><str name="id">6</str><float name="number_p_f_dv">776.8501</float></doc><doc><str name="id">7</str><float name="number_p_f_dv">-231626.3</float></doc><doc><str name="id">8</str><float name="number_p_f_dv">-280523.9</float></doc><doc><str name="id">9</str><float name="number_p_f_dv">0.2596316</float></doc></result><lst name="stats"><lst name="stats_fields"><lst name="number_p_f_dv"><double name="min">-888884.125</double><double name="max">812427.125</double><long name="count">20</long><long name="missing">1</long><double name="sum">-1550921.086037293</double><double name="sumOfSquares">2.2296665669200796E12</double><double name="mean">-77546.05430186466</double><double name="stddev">333198.1199925105</double></lst></lst></lst>
</response>

	request was:q=*:*&stats=true&fl=id,+number_p_f_dv&wt=xml&stats.field=number_p_f_dv
	at org.apache.solr.SolrTestCaseJ4.assertQ(SolrTestCaseJ4.java:871)
	... 42 more


FAILED:  org.apache.solr.schema.TestPointFields.testLongPointStats

Error Message:
Exception during query

Stack Trace:
java.lang.RuntimeException: Exception during query
	at __randomizedtesting.SeedInfo.seed([127C1875A23278A1:A5818EA089678CC4]:0)
	at org.apache.solr.SolrTestCaseJ4.assertQ(SolrTestCaseJ4.java:878)
	at org.apache.solr.SolrTestCaseJ4.assertQ(SolrTestCaseJ4.java:845)
	at org.apache.solr.schema.TestPointFields.testPointStats(TestPointFields.java:2197)
	at org.apache.solr.schema.TestPointFields.testLongPointStats(TestPointFields.java:1251)
	at sun.reflect.NativeMethodAccessorImpl.invoke0(Native Method)
	at sun.reflect.NativeMethodAccessorImpl.invoke(NativeMethodAccessorImpl.java:62)
	at sun.reflect.DelegatingMethodAccessorImpl.invoke(DelegatingMethodAccessorImpl.java:43)
	at java.lang.reflect.Method.invoke(Method.java:498)
	at com.carrotsearch.randomizedtesting.RandomizedRunner.invoke(RandomizedRunner.java:1713)
	at com.carrotsearch.randomizedtesting.RandomizedRunner$8.evaluate(RandomizedRunner.java:907)
	at com.carrotsearch.randomizedtesting.RandomizedRunner$9.evaluate(RandomizedRunner.java:943)
	at com.carrotsearch.randomizedtesting.RandomizedRunner$10.evaluate(RandomizedRunner.java:957)
	at com.carrotsearch.randomizedtesting.rules.SystemPropertiesRestoreRule$1.evaluate(SystemPropertiesRestoreRule.java:57)
	at org.apache.lucene.util.TestRuleSetupTeardownChained$1.evaluate(TestRuleSetupTeardownChained.java:49)
	at org.apache.lucene.util.AbstractBeforeAfterRule$1.evaluate(AbstractBeforeAfterRule.java:45)
	at org.apache.lucene.util.TestRuleThreadAndTestName$1.evaluate(TestRuleThreadAndTestName.java:48)
	at org.apache.lucene.util.TestRuleIgnoreAfterMaxFailures$1.evaluate(TestRuleIgnoreAfterMaxFailures.java:64)
	at org.apache.lucene.util.TestRuleMarkFailure$1.evaluate(TestRuleMarkFailure.java:47)
	at com.carrotsearch.randomizedtesting.rules.StatementAdapter.evaluate(StatementAdapter.java:36)
	at com.carrotsearch.randomizedtesting.ThreadLeakControl$StatementRunner.run(ThreadLeakControl.java:368)
	at com.carrotsearch.randomizedtesting.ThreadLeakControl.forkTimeoutingTask(ThreadLeakControl.java:817)
	at com.carrotsearch.randomizedtesting.ThreadLeakControl$3.evaluate(ThreadLeakControl.java:468)
	at com.carrotsearch.randomizedtesting.RandomizedRunner.runSingleTest(RandomizedRunner.java:916)
	at com.carrotsearch.randomizedtesting.RandomizedRunner$5.evaluate(RandomizedRunner.java:802)
	at com.carrotsearch.randomizedtesting.RandomizedRunner$6.evaluate(RandomizedRunner.java:852)
	at com.carrotsearch.randomizedtesting.RandomizedRunner$7.evaluate(RandomizedRunner.java:863)
	at com.carrotsearch.randomizedtesting.rules.StatementAdapter.evaluate(StatementAdapter.java:36)
	at com.carrotsearch.randomizedtesting.rules.SystemPropertiesRestoreRule$1.evaluate(SystemPropertiesRestoreRule.java:57)
	at org.apache.lucene.util.AbstractBeforeAfterRule$1.evaluate(AbstractBeforeAfterRule.java:45)
	at com.carrotsearch.randomizedtesting.rules.StatementAdapter.evaluate(StatementAdapter.java:36)
	at org.apache.lucene.util.TestRuleStoreClassName$1.evaluate(TestRuleStoreClassName.java:41)
	at com.carrotsearch.randomizedtesting.rules.NoShadowingOrOverridesOnMethodsRule$1.evaluate(NoShadowingOrOverridesOnMethodsRule.java:40)
	at com.carrotsearch.randomizedtesting.rules.NoShadowingOrOverridesOnMethodsRule$1.evaluate(NoShadowingOrOverridesOnMethodsRule.java:40)
	at com.carrotsearch.randomizedtesting.rules.StatementAdapter.evaluate(StatementAdapter.java:36)
	at com.carrotsearch.randomizedtesting.rules.StatementAdapter.evaluate(StatementAdapter.java:36)
	at com.carrotsearch.randomizedtesting.rules.StatementAdapter.evaluate(StatementAdapter.java:36)
	at org.apache.lucene.util.TestRuleAssertionsRequired$1.evaluate(TestRuleAssertionsRequired.java:53)
	at org.apache.lucene.util.TestRuleMarkFailure$1.evaluate(TestRuleMarkFailure.java:47)
	at org.apache.lucene.util.TestRuleIgnoreAfterMaxFailures$1.evaluate(TestRuleIgnoreAfterMaxFailures.java:64)
	at org.apache.lucene.util.TestRuleIgnoreTestSuites$1.evaluate(TestRuleIgnoreTestSuites.java:54)
	at com.carrotsearch.randomizedtesting.rules.StatementAdapter.evaluate(StatementAdapter.java:36)
	at com.carrotsearch.randomizedtesting.ThreadLeakControl$StatementRunner.run(ThreadLeakControl.java:368)
	at java.lang.Thread.run(Thread.java:748)
Caused by: java.lang.RuntimeException: REQUEST FAILED: xpath=//*[@numFound='11']
	xml response was: <?xml version="1.0" encoding="UTF-8"?>
<response>
<lst name="responseHeader"><int name="status">0</int><int name="QTime">0</int></lst><result name="response" numFound="21" start="0"><doc><str name="id">0</str><long name="number_p_l_dv">8097218</long></doc><doc><str name="id">1</str><long name="number_p_l_dv">-5032181</long></doc><doc><str name="id">2</str><long name="number_p_l_dv">3608124</long></doc><doc><str name="id">3</str><long name="number_p_l_dv">4414264</long></doc><doc><str name="id">4</str><long name="number_p_l_dv">-8485103</long></doc><doc><str name="id">5</str><long name="number_p_l_dv">1703965</long></doc><doc><str name="id">6</str><long name="number_p_l_dv">-2449820</long></doc><doc><str name="id">7</str><long name="number_p_l_dv">1383312</long></doc><doc><str name="id">8</str><long name="number_p_l_dv">-7607559</long></doc><doc><str name="id">9</str><long name="number_p_l_dv">782384</long></doc></result><lst name="stats"><lst name="stats_fields"><lst name="number_p_l_dv"><double name="min">-8754603.0</double><double name="max">9615849.0</double><long name="count">20</long><long name="missing">1</long><double name="sum">4082212.0</double><double name="sumOfSquares">5.60364385038128E14</double><double name="mean">204110.6</double><double name="stddev">5426694.071160883</double></lst></lst></lst>
</response>

	request was:q=*:*&stats=true&fl=id,+number_p_l_dv&wt=xml&stats.field=number_p_l_dv
	at org.apache.solr.SolrTestCaseJ4.assertQ(SolrTestCaseJ4.java:871)
	... 42 more




Build Log:
[...truncated 11660 lines...]
   [junit4] Suite: org.apache.solr.schema.TestPointFields
   [junit4]   2> Creating dataDir: /x1/jenkins/jenkins-slave/workspace/Lucene-Solr-Tests-7.x/solr/build/solr-core/test/J1/temp/solr.schema.TestPointFields_127C1875A23278A1-001/init-core-data-001
   [junit4]   2> 764432 WARN  (SUITE-TestPointFields-seed#[127C1875A23278A1]-worker) [    ] o.a.s.SolrTestCaseJ4 startTrackingSearchers: numOpens=1 numCloses=1
   [junit4]   2> 764433 INFO  (SUITE-TestPointFields-seed#[127C1875A23278A1]-worker) [    ] o.a.s.SolrTestCaseJ4 Using PointFields (NUMERIC_POINTS_SYSPROP=true) w/NUMERIC_DOCVALUES_SYSPROP=true
   [junit4]   2> 764434 INFO  (SUITE-TestPointFields-seed#[127C1875A23278A1]-worker) [    ] o.a.s.SolrTestCaseJ4 Randomized ssl (false) and clientAuth (false) via: @org.apache.solr.util.RandomizeSSL(reason=, ssl=NaN, value=NaN, clientAuth=NaN)
   [junit4]   2> 764434 INFO  (SUITE-TestPointFields-seed#[127C1875A23278A1]-worker) [    ] o.a.s.SolrTestCaseJ4 ####initCore
   [junit4]   2> 764434 INFO  (SUITE-TestPointFields-seed#[127C1875A23278A1]-worker) [    ] o.a.s.c.SolrResourceLoader [null] Added 2 libs to classloader, from paths: [/x1/jenkins/jenkins-slave/workspace/Lucene-Solr-Tests-7.x/solr/core/src/test-files/solr/collection1/lib, /x1/jenkins/jenkins-slave/workspace/Lucene-Solr-Tests-7.x/solr/core/src/test-files/solr/collection1/lib/classes]
   [junit4]   2> 764456 INFO  (SUITE-TestPointFields-seed#[127C1875A23278A1]-worker) [    ] o.a.s.c.SolrConfig Using Lucene MatchVersion: 7.1.0
   [junit4]   2> 764481 INFO  (SUITE-TestPointFields-seed#[127C1875A23278A1]-worker) [    ] o.a.s.s.IndexSchema [null] Schema name=schema-point
   [junit4]   2> 764486 INFO  (SUITE-TestPointFields-seed#[127C1875A23278A1]-worker) [    ] o.a.s.s.IndexSchema Loaded schema schema-point/1.6 with uniqueid field id
   [junit4]   2> 764507 INFO  (SUITE-TestPointFields-seed#[127C1875A23278A1]-worker) [    ] o.a.s.m.r.SolrJmxReporter JMX monitoring for 'solr.node' (registry 'solr.node') enabled at server: com.sun.jmx.mbeanserver.JmxMBeanServer@295d6b8d
   [junit4]   2> 764510 INFO  (SUITE-TestPointFields-seed#[127C1875A23278A1]-worker) [    ] o.a.s.m.r.SolrJmxReporter JMX monitoring for 'solr.jvm' (registry 'solr.jvm') enabled at server: com.sun.jmx.mbeanserver.JmxMBeanServer@295d6b8d
   [junit4]   2> 764510 INFO  (SUITE-TestPointFields-seed#[127C1875A23278A1]-worker) [    ] o.a.s.m.r.SolrJmxReporter JMX monitoring for 'solr.jetty' (registry 'solr.jetty') enabled at server: com.sun.jmx.mbeanserver.JmxMBeanServer@295d6b8d
   [junit4]   2> 764511 INFO  (coreLoadExecutor-3073-thread-1) [    x:collection1] o.a.s.c.SolrResourceLoader [null] Added 2 libs to classloader, from paths: [/x1/jenkins/jenkins-slave/workspace/Lucene-Solr-Tests-7.x/solr/core/src/test-files/solr/collection1/lib, /x1/jenkins/jenkins-slave/workspace/Lucene-Solr-Tests-7.x/solr/core/src/test-files/solr/collection1/lib/classes]
   [junit4]   2> 764533 INFO  (coreLoadExecutor-3073-thread-1) [    x:collection1] o.a.s.c.SolrConfig Using Lucene MatchVersion: 7.1.0
   [junit4]   2> 764550 INFO  (coreLoadExecutor-3073-thread-1) [    x:collection1] o.a.s.s.IndexSchema [collection1] Schema name=schema-point
   [junit4]   2> 764556 INFO  (coreLoadExecutor-3073-thread-1) [    x:collection1] o.a.s.s.IndexSchema Loaded schema schema-point/1.6 with uniqueid field id
   [junit4]   2> 764556 INFO  (coreLoadExecutor-3073-thread-1) [    x:collection1] o.a.s.c.CoreContainer Creating SolrCore 'collection1' using configuration from instancedir /x1/jenkins/jenkins-slave/workspace/Lucene-Solr-Tests-7.x/solr/core/src/test-files/solr/collection1, trusted=true
   [junit4]   2> 764556 INFO  (coreLoadExecutor-3073-thread-1) [    x:collection1] o.a.s.m.r.SolrJmxReporter JMX monitoring for 'solr.core.collection1' (registry 'solr.core.collection1') enabled at server: com.sun.jmx.mbeanserver.JmxMBeanServer@295d6b8d
   [junit4]   2> 764556 INFO  (coreLoadExecutor-3073-thread-1) [    x:collection1] o.a.s.c.SolrCore solr.RecoveryStrategy.Builder
   [junit4]   2> 764556 INFO  (coreLoadExecutor-3073-thread-1) [    x:collection1] o.a.s.c.SolrCore [[collection1] ] Opening new SolrCore at [/x1/jenkins/jenkins-slave/workspace/Lucene-Solr-Tests-7.x/solr/core/src/test-files/solr/collection1], dataDir=[/x1/jenkins/jenkins-slave/workspace/Lucene-Solr-Tests-7.x/solr/build/solr-core/test/J1/temp/solr.schema.TestPointFields_127C1875A23278A1-001/init-core-data-001/]
   [junit4]   2> 764557 INFO  (coreLoadExecutor-3073-thread-1) [    x:collection1] o.a.s.u.RandomMergePolicy RandomMergePolicy wrapping class org.apache.lucene.index.LogDocMergePolicy: [LogDocMergePolicy: minMergeSize=1000, mergeFactor=25, maxMergeSize=9223372036854775807, maxMergeSizeForForcedMerge=9223372036854775807, calibrateSizeByDeletes=false, maxMergeDocs=2147483647, maxCFSSegmentSizeMB=8.796093022207999E12, noCFSRatio=1.0]
   [junit4]   2> 764605 INFO  (coreLoadExecutor-3073-thread-1) [    x:collection1] o.a.s.u.UpdateHandler Using UpdateLog implementation: org.apache.solr.update.UpdateLog
   [junit4]   2> 764605 INFO  (coreLoadExecutor-3073-thread-1) [    x:collection1] o.a.s.u.UpdateLog Initializing UpdateLog: dataDir= defaultSyncLevel=FLUSH numRecordsToKeep=100 maxNumLogsToKeep=10 numVersionBuckets=65536
   [junit4]   2> 764606 INFO  (coreLoadExecutor-3073-thread-1) [    x:collection1] o.a.s.u.CommitTracker Hard AutoCommit: disabled
   [junit4]   2> 764606 INFO  (coreLoadExecutor-3073-thread-1) [    x:collection1] o.a.s.u.CommitTracker Soft AutoCommit: disabled
   [junit4]   2> 764607 INFO  (coreLoadExecutor-3073-thread-1) [    x:collection1] o.a.s.u.RandomMergePolicy RandomMergePolicy wrapping class org.apache.lucene.index.TieredMergePolicy: [TieredMergePolicy: maxMergeAtOnce=16, maxMergeAtOnceExplicit=16, maxMergedSegmentMB=38.5771484375, floorSegmentMB=0.7919921875, forceMergeDeletesPctAllowed=26.02189864699057, segmentsPerTier=27.0, maxCFSSegmentSizeMB=8.796093022207999E12, noCFSRatio=0.6973920405850892
   [junit4]   2> 764608 INFO  (coreLoadExecutor-3073-thread-1) [    x:collection1] o.a.s.s.SolrIndexSearcher Opening [Searcher@26af52bf[collection1] main]
   [junit4]   2> 764608 INFO  (coreLoadExecutor-3073-thread-1) [    x:collection1] o.a.s.h.c.SpellCheckComponent Initializing spell checkers
   [junit4]   2> 764615 INFO  (coreLoadExecutor-3073-thread-1) [    x:collection1] o.a.s.s.DirectSolrSpellChecker init: {name=direct,classname=DirectSolrSpellChecker,field=lowerfilt,minQueryLength=3}
   [junit4]   2> 764640 INFO  (coreLoadExecutor-3073-thread-1) [    x:collection1] o.a.s.h.ReplicationHandler Commits will be reserved for  10000
   [junit4]   2> 764640 INFO  (searcherExecutor-3074-thread-1-processing-x:collection1) [    x:collection1] o.a.s.h.c.SpellCheckComponent Loading spell index for spellchecker: default
   [junit4]   2> 764640 INFO  (coreLoadExecutor-3073-thread-1) [    x:collection1] o.a.s.u.UpdateLog Could not find max version in index or recent updates, using new clock 1572604532188250112
   [junit4]   2> 764640 INFO  (searcherExecutor-3074-thread-1-processing-x:collection1) [    x:collection1] o.a.s.h.c.SpellCheckComponent Loading spell index for spellchecker: direct
   [junit4]   2> 764640 INFO  (searcherExecutor-3074-thread-1-processing-x:collection1) [    x:collection1] o.a.s.h.c.SpellCheckComponent Loading spell index for spellchecker: wordbreak
   [junit4]   2> 764640 INFO  (searcherExecutor-3074-thread-1-processing-x:collection1) [    x:collection1] o.a.s.h.c.SpellCheckComponent Loading spell index for spellchecker: multipleFields
   [junit4]   2> 764640 INFO  (searcherExecutor-3074-thread-1-processing-x:collection1) [    x:collection1] o.a.s.h.c.SpellCheckComponent Loading spell index for spellchecker: jarowinkler
   [junit4]   2> 764640 INFO  (searcherExecutor-3074-thread-1-processing-x:collection1) [    x:collection1] o.a.s.h.c.SpellCheckComponent Loading spell index for spellchecker: external
   [junit4]   2> 764641 INFO  (searcherExecutor-3074-thread-1-processing-x:collection1) [    x:collection1] o.a.s.h.c.SpellCheckComponent Loading spell index for spellchecker: freq
   [junit4]   2> 764641 INFO  (searcherExecutor-3074-thread-1-processing-x:collection1) [    x:collection1] o.a.s.h.c.SpellCheckComponent Loading spell index for spellchecker: fqcn
   [junit4]   2> 764641 INFO  (searcherExecutor-3074-thread-1-processing-x:collection1) [    x:collection1] o.a.s.h.c.SpellCheckComponent Loading spell index for spellchecker: perDict
   [junit4]   2> 764642 INFO  (searcherExecutor-3074-thread-1-processing-x:collection1) [    x:collection1] o.a.s.c.SolrCore [collection1] Registered new searcher Searcher@26af52bf[collection1] main{ExitableDirectoryReader(UninvertingDirectoryReader())}
   [junit4]   2> 764643 INFO  (SUITE-TestPointFields-seed#[127C1875A23278A1]-worker) [    ] o.a.s.SolrTestCaseJ4 ####initCore end
   [junit4]   2> 764645 INFO  (TEST-TestPointFields.testDoublePointStats-seed#[127C1875A23278A1]) [    ] o.a.s.SolrTestCaseJ4 ###Starting testDoublePointStats
   [junit4]   2> [59945.93, -4137058.0, -0.9376726, -0.0602886, 632053.1, 817.9425, 1581063.0, -295181.2, -1661.36, -92.61549, 1248.616, 23854.0, 0.3925055, -75.39928, 688867.3, 2422.069, -913444.7, 298318.2, -1.268115, 5173127.0]
   [junit4]   2> 764651 INFO  (TEST-TestPointFields.testDoublePointStats-seed#[127C1875A23278A1]) [    ] o.a.s.u.p.LogUpdateProcessorFactory [collection1]  webapp=null path=null params={}{add=[0 (1572604532195590144)]} 0 4
   [junit4]   2> 764653 INFO  (TEST-TestPointFields.testDoublePointStats-seed#[127C1875A23278A1]) [    ] o.a.s.u.p.LogUpdateProcessorFactory [collection1]  webapp=null path=null params={}{add=[1 (1572604532201881600)]} 0 0
   [junit4]   2> 764653 INFO  (TEST-TestPointFields.testDoublePointStats-seed#[127C1875A23278A1]) [    ] o.a.s.u.p.LogUpdateProcessorFactory [collection1]  webapp=null path=null params={}{add=[2 (1572604532201881601)]} 0 0
   [junit4]   2> 764654 INFO  (TEST-TestPointFields.testDoublePointStats-seed#[127C1875A23278A1]) [    ] o.a.s.u.p.LogUpdateProcessorFactory [collection1]  webapp=null path=null params={}{add=[3 (1572604532202930176)]} 0 0
   [junit4]   2> 764654 INFO  (TEST-TestPointFields.testDoublePointStats-seed#[127C1875A23278A1]) [    ] o.a.s.u.p.LogUpdateProcessorFactory [collection1]  webapp=null path=null params={}{add=[4 (1572604532202930177)]} 0 0
   [junit4]   2> 764655 INFO  (TEST-TestPointFields.testDoublePointStats-seed#[127C1875A23278A1]) [    ] o.a.s.u.p.LogUpdateProcessorFactory [collection1]  webapp=null path=null params={}{add=[5 (1572604532203978752)]} 0 0
   [junit4]   2> 764662 INFO  (TEST-TestPointFields.testDoublePointStats-seed#[127C1875A23278A1]) [    ] o.a.s.u.p.LogUpdateProcessorFactory [collection1]  webapp=null path=null params={}{add=[6 (1572604532203978753)]} 0 6
   [junit4]   2> 764662 INFO  (TEST-TestPointFields.testDoublePointStats-seed#[127C1875A23278A1]) [    ] o.a.s.u.p.LogUpdateProcessorFactory [collection1]  webapp=null path=null params={}{add=[7 (1572604532211318784)]} 0 0
   [junit4]   2> 764663 INFO  (TEST-TestPointFields.testDoublePointStats-seed#[127C1875A23278A1]) [    ] o.a.s.u.p.LogUpdateProcessorFactory [collection1]  webapp=null path=null params={}{add=[8 (1572604532212367360)]} 0 0
   [junit4]   2> 764663 INFO  (TEST-TestPointFields.testDoublePointStats-seed#[127C1875A23278A1]) [    ] o.a.s.u.p.LogUpdateProcessorFactory [collection1]  webapp=null path=null params={}{add=[9 (1572604532212367361)]} 0 0
   [junit4]   2> 764663 INFO  (TEST-TestPointFields.testDoublePointStats-seed#[127C1875A23278A1]) [    ] o.a.s.u.p.LogUpdateProcessorFactory [collection1]  webapp=null path=null params={}{add=[10 (1572604532212367362)]} 0 0
   [junit4]   2> 764664 INFO  (TEST-TestPointFields.testDoublePointStats-seed#[127C1875A23278A1]) [    ] o.a.s.u.p.LogUpdateProcessorFactory [collection1]  webapp=null path=null params={}{add=[11 (1572604532213415936)]} 0 0
   [junit4]   2> 764664 INFO  (TEST-TestPointFields.testDoublePointStats-seed#[127C1875A23278A1]) [    ] o.a.s.u.p.LogUpdateProcessorFactory [collection1]  webapp=null path=null params={}{add=[12 (1572604532213415937)]} 0 0
   [junit4]   2> 764666 INFO  (TEST-TestPointFields.testDoublePointStats-seed#[127C1875A23278A1]) [    ] o.a.s.u.p.LogUpdateProcessorFactory [collection1]  webapp=null path=null params={}{add=[13 (1572604532214464512)]} 0 1
   [junit4]   2> 764667 INFO  (TEST-TestPointFields.testDoublePointStats-seed#[127C1875A23278A1]) [    ] o.a.s.u.p.LogUpdateProcessorFactory [collection1]  webapp=null path=null params={}{add=[14 (1572604532215513088)]} 0 0
   [junit4]   2> 764667 INFO  (TEST-TestPointFields.testDoublePointStats-seed#[127C1875A23278A1]) [    ] o.a.s.u.p.LogUpdateProcessorFactory [collection1]  webapp=null path=null params={}{add=[15 (1572604532216561664)]} 0 0
   [junit4]   2> 764667 INFO  (TEST-TestPointFields.testDoublePointStats-seed#[127C1875A23278A1]) [    ] o.a.s.u.p.LogUpdateProcessorFactory [collection1]  webapp=null path=null params={}{add=[16 (1572604532216561665)]} 0 0
   [junit4]   2> 764668 INFO  (TEST-TestPointFields.testDoublePointStats-seed#[127C1875A23278A1]) [    ] o.a.s.u.p.LogUpdateProcessorFactory [collection1]  webapp=null path=null params={}{add=[17 (1572604532217610240)]} 0 0
   [junit4]   2> 764668 INFO  (TEST-TestPointFields.testDoublePointStats-seed#[127C1875A23278A1]) [    ] o.a.s.u.p.LogUpdateProcessorFactory [collection1]  webapp=null path=null params={}{add=[18 (1572604532217610241)]} 0 0
   [junit4]   2> 764669 INFO  (TEST-TestPointFields.testDoublePointStats-seed#[127C1875A23278A1]) [    ] o.a.s.u.p.LogUpdateProcessorFactory [collection1]  webapp=null path=null params={}{add=[19 (1572604532217610242)]} 0 0
   [junit4]   2> 764670 INFO  (TEST-TestPointFields.testDoublePointStats-seed#[127C1875A23278A1]) [    ] o.a.s.u.p.LogUpdateProcessorFactory [collection1]  webapp=null path=null params={}{add=[20 (1572604532218658816)]} 0 1
   [junit4]   2> 764670 INFO  (TEST-TestPointFields.testDoublePointStats-seed#[127C1875A23278A1]) [    ] o.a.s.u.DirectUpdateHandler2 start commit{_version_=1572604532219707392,optimize=false,openSearcher=true,waitSearcher=true,expungeDeletes=false,softCommit=false,prepareCommit=false}
   [junit4]   2> 764670 INFO  (TEST-TestPointFields.testDoublePointStats-seed#[127C1875A23278A1]) [    ] o.a.s.u.SolrIndexWriter Calling setCommitData with IW:org.apache.solr.update.SolrIndexWriter@7812a3d7 commitCommandVersion:1572604532219707392
   [junit4]   2> 764672 INFO  (TEST-TestPointFields.testDoublePointStats-seed#[127C1875A23278A1]) [    ] o.a.s.s.SolrIndexSearcher Opening [Searcher@29ddd96c[collection1] main]
   [junit4]   2> 764672 INFO  (TEST-TestPointFields.testDoublePointStats-seed#[127C1875A23278A1]) [    ] o.a.s.u.DirectUpdateHandler2 end_commit_flush
   [junit4]   2> 764676 INFO  (searcherExecutor-3074-thread-1) [    ] o.a.s.c.SolrCore [collection1] Registered new searcher Searcher@29ddd96c[collection1] main{ExitableDirectoryReader(UninvertingDirectoryReader(Uninverting(_0(7.1.0):C7) Uninverting(_1(7.1.0):C7) Uninverting(_2(7.1.0):C7)))}
   [junit4]   2> 764676 INFO  (TEST-TestPointFields.testDoublePointStats-seed#[127C1875A23278A1]) [    ] o.a.s.u.p.LogUpdateProcessorFactory [collection1]  webapp=null path=null params={}{commit=} 0 6
   [junit4]   2> 764694 INFO  (TEST-TestPointFields.testDoublePointStats-seed#[127C1875A23278A1]) [    ] o.a.s.c.S.Request [collection1]  webapp=null path=null params={q=*:*&stats=true&fl=id,+number_p_d_dv&wt=xml&stats.field=number_p_d_dv} hits=21 status=0 QTime=17
   [junit4]   2> 764695 ERROR (TEST-TestPointFields.testDoublePointStats-seed#[127C1875A23278A1]) [    ] o.a.s.SolrTestCaseJ4 REQUEST FAILED: xpath=//*[@numFound='11']
   [junit4]   2> 	xml response was: <?xml version="1.0" encoding="UTF-8"?>
   [junit4]   2> <response>
   [junit4]   2> <lst name="responseHeader"><int name="status">0</int><int name="QTime">17</int></lst><result name="response" numFound="21" start="0"><doc><str name="id">0</str><double name="number_p_d_dv">59945.93</double></doc><doc><str name="id">1</str><double name="number_p_d_dv">-4137058.0</double></doc><doc><str name="id">2</str><double name="number_p_d_dv">-0.9376726</double></doc><doc><str name="id">3</str><double name="number_p_d_dv">-0.0602886</double></doc><doc><str name="id">4</str><double name="number_p_d_dv">632053.1</double></doc><doc><str name="id">5</str><double name="number_p_d_dv">817.9425</double></doc><doc><str name="id">6</str><double name="number_p_d_dv">1581063.0</double></doc><doc><str name="id">7</str><double name="number_p_d_dv">-295181.2</double></doc><doc><str name="id">8</str><double name="number_p_d_dv">-1661.36</double></doc><doc><str name="id">9</str><double name="number_p_d_dv">-92.61549</double></doc></result><lst name="stats"><lst name="stats_fields"><lst name="number_p_d_dv"><double name="min">-4137058.0</double><double name="max">5173127.0</double><long name="count">20</long><long name="missing">1</long><double name="sum">3114202.009159299</double><double name="sumOfSquares">4.82649616476457E13</double><double name="mean">155710.10045796496</double><double name="stddev">1585792.9933923497</double></lst></lst></lst>
   [junit4]   2> </response>
   [junit4]   2> 
   [junit4]   2> 	request was:q=*:*&stats=true&fl=id,+number_p_d_dv&wt=xml&stats.field=number_p_d_dv
   [junit4]   2> 764696 ERROR (TEST-TestPointFields.testDoublePointStats-seed#[127C1875A23278A1]) [    ] o.a.s.SolrTestCaseJ4 REQUEST FAILED: q=*:*&stats=true&fl=id,+number_p_d_dv&wt=xml&stats.field=number_p_d_dv:java.lang.RuntimeException: REQUEST FAILED: xpath=//*[@numFound='11']
   [junit4]   2> 	xml response was: <?xml version="1.0" encoding="UTF-8"?>
   [junit4]   2> <response>
   [junit4]   2> <lst name="responseHeader"><int name="status">0</int><int name="QTime">17</int></lst><result name="response" numFound="21" start="0"><doc><str name="id">0</str><double name="number_p_d_dv">59945.93</double></doc><doc><str name="id">1</str><double name="number_p_d_dv">-4137058.0</double></doc><doc><str name="id">2</str><double name="number_p_d_dv">-0.9376726</double></doc><doc><str name="id">3</str><double name="number_p_d_dv">-0.0602886</double></doc><doc><str name="id">4</str><double name="number_p_d_dv">632053.1</double></doc><doc><str name="id">5</str><double name="number_p_d_dv">817.9425</double></doc><doc><str name="id">6</str><double name="number_p_d_dv">1581063.0</double></doc><doc><str name="id">7</str><double name="number_p_d_dv">-295181.2</double></doc><doc><str name="id">8</str><double name="number_p_d_dv">-1661.36</double></doc><doc><str name="id">9</str><double name="number_p_d_dv">-92.61549</double></doc></result><lst name="stats"><lst name="stats_fields"><lst name="number_p_d_dv"><double name="min">-4137058.0</double><double name="max">5173127.0</double><long name="count">20</long><long name="missing">1</long><double name="sum">3114202.009159299</double><double name="sumOfSquares">4.82649616476457E13</double><double name="mean">155710.10045796496</double><double name="stddev">1585792.9933923497</double></lst></lst></lst>
   [junit4]   2> </response>
   [junit4]   2> 
   [junit4]   2> 	request was:q=*:*&stats=true&fl=id,+number_p_d_dv&wt=xml&stats.field=number_p_d_dv
   [junit4]   2> 	at org.apache.solr.SolrTestCaseJ4.assertQ(SolrTestCaseJ4.java:871)
   [junit4]   2> 	at org.apache.solr.SolrTestCaseJ4.assertQ(SolrTestCaseJ4.java:845)
   [junit4]   2> 	at org.apache.solr.schema.TestPointFields.testPointStats(TestPointFields.java:2197)
   [junit4]   2> 	at org.apache.solr.schema.TestPointFields.testDoublePointStats(TestPointFields.java:689)
   [junit4]   2> 	at sun.reflect.NativeMethodAccessorImpl.invoke0(Native Method)
   [junit4]   2> 	at sun.reflect.NativeMethodAccessorImpl.invoke(NativeMethodAccessorImpl.java:62)
   [junit4]   2> 	at sun.reflect.DelegatingMethodAccessorImpl.invoke(DelegatingMethodAccessorImpl.java:43)
   [junit4]   2> 	at java.lang.reflect.Method.invoke(Method.java:498)
   [junit4]   2> 	at com.carrotsearch.randomizedtesting.RandomizedRunner.invoke(RandomizedRunner.java:1713)
   [junit4]   2> 	at com.carrotsearch.randomizedtesting.RandomizedRunner$8.evaluate(RandomizedRunner.java:907)
   [junit4]   2> 	at com.carrotsearch.randomizedtesting.RandomizedRunner$9.evaluate(RandomizedRunner.java:943)
   [junit4]   2> 	at com.carrotsearch.randomizedtesting.RandomizedRunner$10.evaluate(RandomizedRunner.java:957)
   [junit4]   2> 	at com.carrotsearch.randomizedtesting.rules.SystemPropertiesRestoreRule$1.evaluate(SystemPropertiesRestoreRule.java:57)
   [junit4]   2> 	at org.apache.lucene.util.TestRuleSetupTeardownChained$1.evaluate(TestRuleSetupTeardownChained.java:49)
   [junit4]   2> 	at org.apache.lucene.util.AbstractBeforeAfterRule$1.evaluate(AbstractBeforeAfterRule.java:45)
   [junit4]   2> 	at org.apache.lucene.util.TestRuleThreadAndTestName$1.evaluate(TestRuleThreadAndTestName.java:48)
   [junit4]   2> 	at org.apache.lucene.util.TestRuleIgnoreAfterMaxFailures$1.evaluate(TestRuleIgnoreAfterMaxFailures.java:64)
   [junit4]   2> 	at org.apache.lucene.util.TestRuleMarkFailure$1.evaluate(TestRuleMarkFailure.java:47)
   [junit4]   2> 	at com.carrotsearch.randomizedtesting.rules.StatementAdapter.evaluate(StatementAdapter.java:36)
   [junit4]   2> 	at com.carrotsearch.randomizedtesting.ThreadLeakControl$StatementRunner.run(ThreadLeakControl.java:368)
   [junit4]   2> 	at com.carrotsearch.randomizedtesting.ThreadLeakControl.forkTimeoutingTask(ThreadLeakControl.java:817)
   [junit4]   2> 	at com.carrotsearch.randomizedtesting.ThreadLeakControl$3.evaluate(ThreadLeakControl.java:468)
   [junit4]   2> 	at com.carrotsearch.randomizedtesting.RandomizedRunner.runSingleTest(RandomizedRunner.java:916)
   [junit4]   2> 	at com.carrotsearch.randomizedtesting.RandomizedRunner$5.evaluate(RandomizedRunner.java:802)
   [junit4]   2> 	at com.carrotsearch.randomizedtesting.RandomizedRunner$6.evaluate(RandomizedRunner.java:852)
   [junit4]   2> 	at com.carrotsearch.randomizedtesting.RandomizedRunner$7.evaluate(RandomizedRunner.java:863)
   [junit4]   2> 	at com.carrotsearch.randomizedtesting.rules.StatementAdapter.evaluate(StatementAdapter.java:36)
   [junit4]   2> 	at com.carrotsearch.randomizedtesting.rules.SystemPropertiesRestoreRule$1.evaluate(SystemPropertiesRestoreRule.java:57)
   [junit4]   2> 	at org.apache.lucene.util.AbstractBeforeAfterRule$1.evaluate(AbstractBeforeAfterRule.java:45)
   [junit4]   2> 	at com.carrotsearch.randomizedtesting.rules.StatementAdapter.evaluate(StatementAdapter.java:36)
   [junit4]   2> 	at org.apache.lucene.util.TestRuleStoreClassName$1.evaluate(TestRuleStoreClassName.java:41)
   [junit4]   2> 	at com.carrotsearch.randomizedtesting.rules.NoShadowingOrOverridesOnMethodsRule$1.evaluate(NoShadowingOrOverridesOnMethodsRule.java:40)
   [junit4]   2> 	at com.carrotsearch.randomizedtesting.rules.NoShadowingOrOverridesOnMethodsRule$1.evaluate(NoShadowingOrOverridesOnMethodsRule.java:40)
   [junit4]   2> 	at com.carrotsearch.randomizedtesting.rules.StatementAdapter.evaluate(StatementAdapter.java:36)
   [junit4]   2> 	at com.carrotsearch.randomizedtesting.rules.StatementAdapter.evaluate(StatementAdapter.java:36)
   [junit4]   2> 	at com.carrotsearch.randomizedtesting.rules.StatementAdapter.evaluate(StatementAdapter.java:36)
   [junit4]   2> 	at org.apache.lucene.util.TestRuleAssertionsRequired$1.evaluate(TestRuleAssertionsRequired.java:53)
   [junit4]   2> 	at org.apache.lucene.util.TestRuleMarkFailure$1.evaluate(TestRuleMarkFailure.java:47)
   [junit4]   2> 	at org.apache.lucene.util.TestRuleIgnoreAfterMaxFailures$1.evaluate(TestRuleIgnoreAfterMaxFailures.java:64)
   [junit4]   2> 	at org.apache.lucene.util.TestRuleIgnoreTestSuites$1.evaluate(TestRuleIgnoreTestSuites.java:54)
   [junit4]   2> 	at com.carrotsearch.randomizedtesting.rules.StatementAdapter.evaluate(StatementAdapter.java:36)
   [junit4]   2> 	at com.carrotsearch.randomizedtesting.ThreadLeakControl$StatementRunner.run(ThreadLeakControl.java:368)
   [junit4]   2> 	at java.lang.Thread.run(Thread.java:748)
   [junit4]   2> 
   [junit4]   2> 764696 INFO  (TEST-TestPointFields.testDoublePointStats-seed#[127C1875A23278A1]) [    ] o.a.s.u.DirectUpdateHandler2 [collection1] REMOVING ALL DOCUMENTS FROM INDEX
   [junit4]   2> 764696 INFO  (TEST-TestPointFields.testDoublePointStats-seed#[127C1875A23278A1]) [    ] o.a.s.s.SolrIndexSearcher Opening [Searcher@6e001985[collection1] realtime]
   [junit4]   2> 764697 INFO  (TEST-TestPointFields.testDoublePointStats-seed#[127C1875A23278A1]) [    ] o.a.s.u.p.LogUpdateProcessorFactory [collection1]  webapp=null path=null params={_version_=-9223372036854775807&update.distrib=FROMLEADER&versions=true&wt=json&indent=true}{deleteByQuery=*:* (-9223372036854775807)} 0 0
   [junit4]   2> 764697 INFO  (TEST-TestPointFields.testDoublePointStats-seed#[127C1875A23278A1]) [    ] o.a.s.u.DirectUpdateHandler2 start commit{_version_=1572604532248018944,optimize=false,openSearcher=true,waitSearcher=true,expungeDeletes=false,softCommit=false,prepareCommit=false}
   [junit4]   2> 764697 INFO  (TEST-TestPointFields.testDoublePointStats-seed#[127C1875A23278A1]) [    ] o.a.s.u.SolrIndexWriter Calling setCommitData with IW:org.apache.solr.update.SolrIndexWriter@7812a3d7 commitCommandVersion:1572604532248018944
   [junit4]   2> 764697 INFO  (TEST-TestPointFields.testDoublePointStats-seed#[127C1875A23278A1]) [    ] o.a.s.s.SolrIndexSearcher Opening [Searcher@5654285a[collection1] main]
   [junit4]   2> 764698 INFO  (TEST-TestPointFields.testDoublePointStats-seed#[127C1875A23278A1]) [    ] o.a.s.u.DirectUpdateHandler2 end_commit_flush
   [junit4]   2> 764699 INFO  (searcherExecutor-3074-thread-1) [    ] o.a.s.c.SolrCore [collection1] Registered new searcher Searcher@5654285a[collection1] main{ExitableDirectoryReader(UninvertingDirectoryReader())}
   [junit4]   2> 764699 INFO  (TEST-TestPointFields.testDoublePointStats-seed#[127C1875A23278A1]) [    ] o.a.s.u.p.LogUpdateProcessorFactory [collection1]  webapp=null path=null params={}{commit=} 0 2
   [junit4]   2> 764700 INFO  (TEST-TestPointFields.testDoublePointStats-seed#[127C1875A23278A1]) [    ] o.a.s.SolrTestCaseJ4 ###Ending testDoublePointStats
   [junit4]   2> NOTE: reproduce with: ant test  -Dtestcase=TestPointFields -Dtests.method=testDoublePointStats -Dtests.seed=127C1875A23278A1 -Dtests.multiplier=2 -Dtests.slow=true -Dtests.locale=ar-SY -Dtests.timezone=Africa/Bangui -Dtests.asserts=true -Dtests.file.encoding=ISO-8859-1
   [junit4] ERROR   0.06s J1 | TestPointFields.testDoublePointStats <<<
   [junit4]    > Throwable #1: java.lang.RuntimeException: Exception during query
   [junit4]    > 	at __randomizedtesting.SeedInfo.seed([127C1875A23278A1:3D66D623569F6405]:0)
   [junit4]    > 	at org.apache.solr.SolrTestCaseJ4.assertQ(SolrTestCaseJ4.java:878)
   [junit4]    > 	at org.apache.solr.SolrTestCaseJ4.assertQ(SolrTestCaseJ4.java:845)
   [junit4]    > 	at org.apache.solr.schema.TestPointFields.testPointStats(TestPointFields.java:2197)
   [junit4]    > 	at org.apache.solr.schema.TestPointFields.testDoublePointStats(TestPointFields.java:689)
   [junit4]    > 	at java.lang.Thread.run(Thread.java:748)
   [junit4]    > Caused by: java.lang.RuntimeException: REQUEST FAILED: xpath=//*[@numFound='11']
   [junit4]    > 	xml response was: <?xml version="1.0" encoding="UTF-8"?>
   [junit4]    > <response>
   [junit4]    > <lst name="responseHeader"><int name="status">0</int><int name="QTime">17</int></lst><result name="response" numFound="21" start="0"><doc><str name="id">0</str><double name="number_p_d_dv">59945.93</double></doc><doc><str name="id">1</str><double name="number_p_d_dv">-4137058.0</double></doc><doc><str name="id">2</str><double name="number_p_d_dv">-0.9376726</double></doc><doc><str name="id">3</str><double name="number_p_d_dv">-0.0602886</double></doc><doc><str name="id">4</str><double name="number_p_d_dv">632053.1</double></doc><doc><str name="id">5</str><double name="number_p_d_dv">817.9425</double></doc><doc><str name="id">6</str><double name="number_p_d_dv">1581063.0</double></doc><doc><str name="id">7</str><double name="number_p_d_dv">-295181.2</double></doc><doc><str name="id">8</str><double name="number_p_d_dv">-1661.36</double></doc><doc><str name="id">9</str><double name="number_p_d_dv">-92.61549</double></doc></result><lst name="stats"><lst name="stats_fields"><lst name="number_p_d_dv"><double name="min">-4137058.0</double><double name="max">5173127.0</double><long name="count">20</long><long name="missing">1</long><double name="sum">3114202.009159299</double><double name="sumOfSquares">4.82649616476457E13</double><double name="mean">155710.10045796496</double><double name="stddev">1585792.9933923497</double></lst></lst></lst>
   [junit4]    > </response>
   [junit4]    > 	request was:q=*:*&stats=true&fl=id,+number_p_d_dv&wt=xml&stats.field=number_p_d_dv
   [junit4]    > 	at org.apache.solr.SolrTestCaseJ4.assertQ(SolrTestCaseJ4.java:871)
   [junit4]    > 	... 42 more
   [junit4]   2> 764703 INFO  (TEST-TestPointFields.testFloatPointFieldReturn-seed#[127C1875A23278A1]) [    ] o.a.s.SolrTestCaseJ4 ###Starting testFloatPointFieldReturn
   [junit4]   2> 764707 INFO  (TEST-TestPointFields.testFloatPointFieldReturn-seed#[127C1875A23278A1]) [    ] o.a.s.u.p.LogUpdateProcessorFactory [collection1]  webapp=null path=null params={}{add=[0 (1572604532255358976)]} 0 3
   [junit4]   2> 764708 INFO  (TEST-TestPointFields.testFloatPointFieldReturn-seed#[127C1875A23278A1]) [    ] o.a.s.u.p.LogUpdateProcessorFactory [collection1]  webapp=null path=null params={}{add=[1 (1572604532259553280)]} 0 0
   [junit4]   2> 764708 INFO  (TEST-TestPointFields.testFloatPointFieldReturn-seed#[127C1875A23278A1]) [    ] o.a.s.u.p.LogUpdateProcessorFactory [collection1]  webapp=null path=null params={}{add=[2 (1572604532259553281)]} 0 0
   [junit4]   2> 764709 INFO  (TEST-TestPointFields.testFloatPointFieldReturn-seed#[127C1875A23278A1]) [    ] o.a.s.u.p.LogUpdateProcessorFactory [collection1]  webapp=null path=null params={}{add=[3 (1572604532260601856)]} 0 0
   [junit4]   2> 764709 INFO  (TEST-TestPointFields.testFloatPointFieldReturn-seed#[127C1875A23278A1]) [    ] o.a.s.u.p.LogUpdateProcessorFactory [collection1]  webapp=null path=null params={}{add=[4 (1572604532260601857)]} 0 0
   [junit4]   2> 764709 INFO  (TEST-TestPointFields.testFloatPointFieldReturn-seed#[127C1875A23278A1]) [    ] o.a.s.u.p.LogUpdateProcessorFactory [collection1]  webapp=null path=null params={}{add=[5 (1572604532260601858)]} 0 0
   [junit4]   2> 764711 INFO  (TEST-TestPointFields.testFloatPointFieldReturn-seed#[127C1875A23278A1]) [    ] o.a.s.u.p.LogUpdateProcessorFactory [collection1]  webapp=null path=null params={}{add=[6 (1572604532261650432)]} 0 0
   [junit4]   2> 764711 INFO  (TEST-TestPointFields.testFloatPointFieldReturn-seed#[127C1875A23278A1]) [    ] o.a.s.u.p.LogUpdateProcessorFactory [collection1]  webapp=null path=null params={}{add=[7 (1572604532262699008)]} 0 0
   [junit4]   2> 764712 INFO  (TEST-TestPointFields.testFloatPointFieldReturn-seed#[127C1875A23278A1]) [    ] o.a.s.u.p.LogUpdateProcessorFactory [collection1]  webapp=null path=null params={}{add=[8 (1572604532262699009)]} 0 0
   [junit4]   2> 764712 INFO  (TEST-TestPointFields.testFloatPointFieldReturn-seed#[127C1875A23278A1]) [    ] o.a.s.u.p.LogUpdateProcessorFactory [collection1]  webapp=null path=null params={}{add=[9 (1572604532263747584)]} 0 0
   [junit4]   2> 764712 INFO  (TEST-TestPointFields.testFloatPointFieldReturn-seed#[127C1875A23278A1]) [    ] o.a.s.u.p.LogUpdateProcessorFactory [collection1]  webapp=null path=null params={}{add=[10 (1572604532263747585)]} 0 0
   [junit4]   2> 764713 INFO  (TEST-TestPointFields.testFloatPointFieldReturn-seed#[127C1875A23278A1]) [    ] o.a.s.u.p.LogUpdateProcessorFactory [collection1]  webapp=null path=null params={}{add=[11 (1572604532264796160)]} 0 0
   [junit4]   2> 764713 INFO  (TEST-TestPointFields.testFloatPointFieldReturn-seed#[127C1875A23278A1]) [    ] o.a.s.u.p.LogUpdateProcessorFactory [collection1]  webapp=null path=null params={}{add=[12 (1572604532264796161)]} 0 0
   [junit4]   2> 764714 INFO  (TEST-TestPointFields.testFloatPointFieldReturn-seed#[127C1875A23278A1]) [    ] o.a.s.u.p.LogUpdateProcessorFactory [collection1]  webapp=null path=null params={}{add=[13 (1572604532264796162)]} 0 1
   [junit4]   2> 764715 INFO  (TEST-TestPointFields.testFloatPointFieldReturn-seed#[127C1875A23278A1]) [    ] o.a.s.u.p.LogUpdateProcessorFactory [collection1]  webapp=null path=null params={}{add=[14 (1572604532266893312)]} 0 0
   [junit4]   2> 764715 INFO  (TEST-TestPointFields.testFloatPointFieldReturn-seed#[127C1875A23278A1]) [    ] o.a.s.u.p.LogUpdateProcessorFactory [collection1]  webapp=null path=null params={}{add=[15 (1572604532266893313)]} 0 0
   [junit4]   2> 764716 INFO  (TEST-TestPointFields.testFloatPointFieldReturn-seed#[127C1875A23278A1]) [    ] o.a.s.u.p.LogUpdateProcessorFactory [collection1]  webapp=null path=null params={}{add=[16 (1572604532267941888)]} 0 0
   [junit4]   2> 764716 INFO  (TEST-TestPointFields.testFloatPointFieldReturn-seed#[127C1875A23278A1]) [    ] o.a.s.u.p.LogUpdateProcessorFactory [collection1]  webapp=null path=null params={}{add=[17 (1572604532267941889)]} 0 0
   [junit4]   2> 764717 INFO  (TEST-TestPointFields.testFloatPointFieldReturn-seed#[127C1875A23278A1]) [    ] o.a.s.u.p.LogUpdateProcessorFactory [collection1]  webapp=null path=null params={}{add=[18 (1572604532268990464)]} 0 0
   [junit4]   2> 764717 INFO  (TEST-TestPointFields.testFloatPointFieldReturn-seed#[127C1875A23278A1]) [    ] o.a.s.u.p.LogUpdateProcessorFactory [collection1]  webapp=null path=null params={}{add=[19 (1572604532268990465)]} 0 0
   [junit4]   2> 764718 INFO  (TEST-TestPointFields.testFloatPointFieldReturn-seed#[127C1875A23278A1]) [    ] o.a.s.c.S.Request [collection1]  webapp=null path=null params={qt=/get&id=0&wt=xml} status=0 QTime=0
   [junit4]   2> 764718 INFO  (TEST-TestPointFields.testFloatPointFieldReturn-seed#[127C1875A23278A1]) [    ] o.a.s.c.S.Request [collection1]  webapp=null path=null params={qt=/get&id=1&wt=xml} status=0 QTime=0
   [junit4]   2> 764718 INFO  (TEST-TestPointFields.testFloatPointFieldReturn-seed#[127C1875A23278A1]) [    ] o.a.s.c.S.Request [collection1]  webapp=null path=null params={qt=/get&id=2&wt=xml} status=0 QTime=0
   [junit4]   2> 764719 INFO  (TEST-TestPointFields.testFloatPointFieldReturn-seed#[127C1875A23278A1]) [    ] o.a.s.c.S.Request [collection1]  webapp=null path=null params={qt=/get&id=3&wt=xml} status=0 QTime=0
   [junit4]   2> 764719 INFO  (TEST-TestPointFields.testFloatPointFieldReturn-seed#[127C1875A23278A1]) [    ] o.a.s.c.S.Request [collection1]  webapp=null path=null params={qt=/get&id=4&wt=xml} status=0 QTime=0
   [junit4]   2> 764719 INFO  (TEST-TestPointFields.testFloatPointFieldReturn-seed#[127C1875A23278A1]) [    ] o.a.s.c.S.Request [collection1]  webapp=null path=null params={qt=/get&id=5&wt=xml} status=0 QTime=0
   [junit4]   2> 764720 INFO  (TEST-TestPointFields.testFloatPointFieldReturn-seed#[127C1875A23278A1]) [    ] o.a.s.c.S.Request [collection1]  webapp=null path=null params={qt=/get&id=6&wt=xml} status=0 QTime=0
   [junit4]   2> 764720 INFO  (TEST-TestPointFields.testFloatPointFieldReturn-seed#[127C1875A23278A1]) [    ] o.a.s.c.S.Request [collection1]  webapp=null path=null params={qt=/get&id=7&wt=xml} status=0 QTime=0
   [junit4]   2> 764720 INFO  (TEST-TestPointFields.testFloatPointFieldReturn-seed#[127C1875A23278A1]) [    ] o.a.s.c.S.Request [collection1]  webapp=null path=null params={qt=/get&id=8&wt=xml} status=0 QTime=0
   [junit4]   2> 764721 INFO  (TEST-TestPointFields.testFloatPointFieldReturn-seed#[127C1875A23278A1]) [    ] o.a.s.c.S.Request [collection1]  webapp=null path=null params={qt=/get&id=9&wt=xml} status=0 QTime=0
   [junit4]   2> 764721 INFO  (TEST-TestPointFields.testFloatPointFieldReturn-seed#[127C1875A23278A1]) [    ] o.a.s.c.S.Request [collection1]  webapp=null path=null params={qt=/get&id=10&wt=xml} status=0 QTime=0
   [junit4]   2> 764721 INFO  (TEST-TestPointFields.testFloatPointFieldReturn-seed#[127C1875A23278A1]) [    ] o.a.s.c.S.Request [collection1]  webapp=null path=null params={qt=/get&id=11&wt=xml} status=0 QTime=0
   [junit4]   2> 764721 INFO  (TEST-TestPointFields.testFloatPointFieldReturn-seed#[127C1875A23278A1]) [    ] o.a.s.c.S.Request [collection1]  webapp=null path=null params={qt=/get&id=12&wt=xml} status=0 QTime=0
   [junit4]   2> 764722 INFO  (TEST-TestPointFields.testFloatPointFieldReturn-seed#[127C1875A23278A1]) [    ] o.a.s.c.S.Request [collection1]  webapp=null path=null params={qt=/get&id=13&wt=xml} status=0 QTime=0
   [junit4]   2> 764734 INFO  (TEST-TestPointFields.testFloatPointFieldReturn-seed#[127C1875A23278A1]) [    ] o.a.s.c.S.Request [collection1]  webapp=null path=null params={qt=/get&id=14&wt=xml} status=0 QTime=0
   [junit4]   2> 764734 INFO  (TEST-TestPointFields.testFloatPointFieldReturn-seed#[127C1875A23278A1]) [    ] o.a.s.c.S.Request [collection1]  webapp=null path=null params={qt=/get&id=15&wt=xml} status=0 QTime=0
   [junit4]   2> 764734 INFO  (TEST-TestPointFields.testFloatPointFieldReturn-seed#[127C1875A23278A1]) [    ] o.a.s.c.S.Request [collection1]  webapp=null path=null params={qt=/get&id=16&wt=xml} status=0 QTime=0
   [junit4]   2> 764735 INFO  (TEST-TestPointFields.testFloatPointFieldReturn-seed#[127C1875A23278A1]) [    ] o.a.s.c.S.Request [collection1]  webapp=null path=null params={qt=/get&id=17&wt=xml} status=0 QTime=0
   [junit4]   2> 764735 INFO  (TEST-TestPointFields.testFloatPointFieldReturn-seed#[127C1875A23278A1]) [    ] o.a.s.c.S.Request [collection1]  webapp=null path=null params={qt=/get&id=18&wt=xml} status=0 QTime=0
   [junit4]   2> 764736 INFO  (TEST-TestPointFields.testFloatPointFieldReturn-seed#[127C1875A23278A1]) [    ] o.a.s.c.S.Request [collection1]  webapp=null path=null params={qt=/get&id=19&wt=xml} status=0 QTime=0
   [junit4]   2> 764736 INFO  (TEST-TestPointFields.testFloatPointFieldReturn-seed#[127C1875A23278A1]) [    ] o.a.s.u.DirectUpdateHandler2 start commit{_version_=1572604532288913408,optimize=false,openSearcher=true,waitSearcher=true,expungeDeletes=false,softCommit=false,prepareCommit=false}
   [junit4]   2> 764736 INFO  (TEST-TestPointFields.testFloatPointFieldReturn-seed#[127C1875A23278A1]) [    ] o.a.s.u.SolrIndexWriter Calling setCommitData with IW:org.apache.solr.update.SolrIndexWriter@7812a3d7 commitCommandVersion:1572604532288913408
   [junit4]   2> 764738 INFO  (TEST-TestPointFields.testFloatPointFieldReturn-seed#[127C1875A23278A1]) [    ] o.a.s.s.SolrIndexSearcher Opening [Searcher@20022700[collection1] main]
   [junit4]   2> 764738 INFO  (TEST-TestPointFields.testFloatPointFieldReturn-seed#[127C1875A23278A1]) [    ] o.a.s.u.DirectUpdateHandler2 end_commit_flush
   [junit4]   2> 764739 INFO  (searcherExecutor-3074-thread-1) [    ] o.a.s.c.SolrCore [collection1] Registered new searcher Searcher@20022700[collection1] main{ExitableDirectoryReader(UninvertingDirectoryReader(Uninverting(_3(7.1.0):C7) Uninverting(_4(7.1.0):C7) Uninverting(_5(7.1.0):C6)))}
   [junit4]   2> 764739 INFO  (TEST-TestPointFields.testFloatPointFieldReturn-seed#[127C1875A23278A1]) [    ] o.a.s.u.p.LogUpdateProcessorFactory [collection1]  webapp=null path=null params={}{commit=} 0 3
   [junit4]   2> 764740 INFO  (TEST-TestPointFields.testFloatPointFieldReturn-seed#[127C1875A23278A1]) [    ] o.a.s.c.S.Request [collection1]  webapp=null path=null params={q=*:*&fl=id,+number_p_f&rows=20&wt=xml} hits=20 status=0 QTime=0
   [junit4]   2> 764744 INFO  (TEST-TestPointFields.testFloatPointFieldReturn-seed#[127C1875A23278A1]) [    ] o.a.s.c.S.Request [collection1]  webapp=null path=null params={qt=/get&id=0&wt=xml} status=0 QTime=1
   [junit4]   2> 764744 INFO  (TEST-TestPointFields.testFloatPointFieldReturn-seed#[127C1875A23278A1]) [    ] o.a.s.c.S.Request [collection1]  webapp=null path=null params={qt=/get&id=1&wt=xml} status=0 QTime=0
   [junit4]   2> 764745 INFO  (TEST-TestPointFields.testFloatPointFieldReturn-seed#[127C1875A23278A1]) [    ] o.a.s.c.S.Request [collection1]  webapp=null path=null params={qt=/get&id=2&wt=xml} status=0 QTime=0
   [junit4]   2> 764745 INFO  (TEST-TestPointFields.testFloatPointFieldReturn-seed#[127C1875A23278A1]) [    ] o.a.s.c.S.Request [collection1]  webapp=null path=null params={qt=/get&id=3&wt=xml} status=0 QTime=0
   [junit4]   2> 764745 INFO  (TEST-TestPointFields.testFloatPointFieldReturn-seed#[127C1875A23278A1]) [    ] o.a.s.c.S.Request [collection1]  webapp=null path=null params={qt=/get&id=4&wt=xml} status=0 QTime=0
   [junit4]   2> 764746 INFO  (TEST-TestPointFields.testFloatPointFieldReturn-seed#[127C1875A23278A1]) [    ] o.a.s.c.S.Request [collection1]  webapp=null path=null params={qt=/get&id=5&wt=xml} status=0 QTime=0
   [junit4]   2> 764746 INFO  (TEST-TestPointFields.testFloatPointFieldReturn-seed#[127C1875A23278A1]) [    ] o.a.s.c.S.Request [collection1]  webapp=null path=null params={qt=/get&id=6&wt=xml} status=0 QTime=0
   [junit4]   2> 764746 INFO  (TEST-TestPointFields.testFloatPointFieldReturn-seed#[127C1875A23278A1]) [    ] o.a.s.c.S.Request [collection1]  webapp=null path=null params={qt=/get&id=7&wt=xml} status=0 QTime=0
   [junit4]   2> 764747 INFO  (TEST-TestPointFields.testFloatPointFieldReturn-seed#[127C1875A23278A1]) [    ] o.a.s.c.S.Request [collection1]  webapp=null path=null params={qt=/get&id=8&wt=xml} status=0 QTime=0
   [junit4]   2> 764747 INFO  (TEST-TestPointFields.testFloatPointFieldReturn-seed#[127C1875A23278A1]) [    ] o.a.s.c.S.Request [collection1]  webapp=null path=null params={qt=/get&id=9&wt=xml} status=0 QTime=0
   [junit4]   2> 764747 INFO  (TEST-TestPointFields.testFloatPointFieldReturn-seed#[127C1875A23278A1]) [    ] o.a.s.c.S.Request [collection1]  webapp=null path=null params={qt=/get&id=10&wt=xml} status=0 QTime=0
   [junit4]   2> 764747 INFO  (TEST-TestPointFields.testFloatPointFieldReturn-seed#[127C1875A23278A1]) [    ] o.a.s.c.S.Request [collection1]  webapp=null path=null params={qt=/get&id=11&wt=xml} status=0 QTime=0
   [junit4]   2> 764748 INFO  (TEST-TestPointFields.testFloatPointFieldReturn-seed#[127C1875A23278A1]) [    ] o.a.s.c.S.Request [collection1]  webapp=null path=null params={qt=/get&id=12&wt=xml} status=0 QTime=0
   [junit4]   2> 764748 INFO  (TEST-TestPointFields.testFloatPointFieldReturn-seed#[127C1875A23278A1]) [    ] o.a.s.c.S.Request [collection1]  webapp=null path=null params={qt=/get&id=13&wt=xml} status=0 QTime=0
   [junit4]   2> 764748 INFO  (TEST-TestPointFields.testFloatPointFieldReturn-seed#[127C1875A23278A1]) [    ] o.a.s.c.S.Request [collection1]  webapp=null path=null params={qt=/get&id=14&wt=xml} status=0 QTime=0
   [junit4]   2> 764749 INFO  (TEST-TestPointFields.testFloatPointFieldReturn-seed#[127C1875A23278A1]) [    ] o.a.s.c.S.Request [collection1]  webapp=null path=null params={qt=/get&id=15&wt=xml} status=0 QTime=0
   [junit4]   2> 764749 INFO  (TEST-TestPointFields.testFloatPointFieldReturn-seed#[127C1875A23278A1]) [    ] o.a.s.c.S.Request [collection1]  webapp=null path=null params={qt=/get&id=16&wt=xml} status=0 QTime=0
   [junit4]   2> 764749 INFO  (TEST-TestPointFields.testFloatPointFieldReturn-seed#[127C1875A23278A1]) [    ] o.a.s.c.S.Request [collection1]  webapp=null path=null params={qt=/get&id=17&wt=xml} status=0 QTime=0
   [junit4]   2> 764750 INFO  (TEST-TestPointFields.testFloatPointFieldReturn-seed#[127C1875A23278A1]) [    ] o.a.s.c.S.Request [collection1]  webapp=null path=null params={qt=/get&id=18&wt=xml} status=0 QTime=0
   [junit4]   2> 764750 INFO  (TEST-TestPointFields.testFloatPointFieldReturn-seed#[127C1875A23278A1]) [    ] o.a.s.c.S.Request [collection1]  webapp=null path=null params={qt=/get&id=19&wt=xml} status=0 QTime=0
   [junit4]   2> 764750 INFO  (TEST-TestPointFields.testFloatPointFieldReturn-seed#[127C1875A23278A1]) [    ] o.a.s.u.DirectUpdateHandler2 [collection1] REMOVING ALL DOCUMENTS FROM INDEX
   [junit4]   2> 764751 INFO  (TEST-TestPointFields.testFloatPointFieldReturn-seed#[127C1875A23278A1]) [    ] o.a.s.s.SolrIndexSearcher Opening [Searcher@59e976dc[collection1] realtime]
   [junit4]   2> 764751 INFO  (TEST-TestPointFields.testFloatPointFieldReturn-seed#[127C1875A23278A1]) [    ] o.a.s.u.p.LogUpdateProcessorFactory [collection1]  webapp=null path=null params={_version_=-9223372036854775807&update.distrib=FROMLEADER&versions=true&wt=json&indent=true}{deleteByQuery=*:* (-9223372036854775807)} 0 0
   [junit4]   2> 764751 INFO  (TEST-TestPointFields.testFloatPointFieldReturn-seed#[127C1875A23278A1]) [    ] o.a.s.u.DirectUpdateHandler2 start commit{_version_=1572604532304642048,optimize=false,openSearcher=true,waitSearcher=true,expungeDeletes=false,softCommit=false,prepareCommit=false}
   [junit4]   2> 764751 INFO  (TEST-TestPointFields.testFloatPointFieldReturn-seed#[127C1875A23278A1]) [    ] o.a.s.u.SolrIndexWriter Calling setCommitData with IW:org.apache.solr.update.SolrIndexWriter@7812a3d7 commitCommandVersion:1572604532304642048
   [junit4]   2> 764751 INFO  (TEST-TestPointFields.testFloatPointFieldReturn-seed#[127C1875A23278A1]) [    ] o.a.s.s.SolrIndexSearcher Opening [Searcher@5663510[collection1] main]
   [junit4]   2> 764752 INFO  (TEST-TestPointFields.testFloatPointFieldReturn-seed#[127C1875A23278A1]) [    ] o.a.s.u.DirectUpdateHandler2 end_commit_flush
   [junit4]   2> 764753 INFO  (searcherExecutor-3074-thread-1) [    ] o.a.s.c.SolrCore [collection1] Registered new searcher Searcher@5663510[collection1] main{ExitableDirectoryReader(UninvertingDirectoryReader())}
   [junit4]   2> 764753 INFO  (TEST-TestPointFields.testFloatPointFieldReturn-seed#[127C1875A23278A1]) [    ] o.a.s.u.p.LogUpdateProcessorFactory [collection1]  webapp=null path=null params={}{commit=} 0 2
   [junit4]   2> 764754 INFO  (TEST-TestPointFields.testFloatPointFieldReturn-seed#[127C1875A23278A1]) [    ] o.a.s.u.p.LogUpdateProcessorFactory [collection1]  webapp=null path=null params={}{add=[0 (1572604532307787776)]} 0 0
   [junit4]   2> 764755 INFO  (TEST-TestPointFields.testFloatPointFieldReturn-seed#[127C1875A23278A1]) [    ] o.a.s.u.p.LogUpdateProcessorFactory [collection1]  webapp=null path=null params={}{add=[1 (1572604532308836352)]} 0 0
   [junit4]   2> 764755 INFO  (TEST-TestPointFields.testFloatPointFieldReturn-seed#[127C1875A23278A1]) [    ] o.a.s.u.p.LogUpdateProcessorFactory [collection1]  webapp=null path=null params={}{add=[2 (1572604532308836353)]} 0 0
   [junit4]   2> 764756 INFO  (TEST-TestPointFields.testFloatPointFieldReturn-seed#[127C1875A23278A1]) [    ] o.a.s.u.p.LogUpdateProcessorFactory [collection1]  webapp=null path=null params={}{add=[3 (1572604532309884928)]} 0 0
   [junit4]   2> 764756 INFO  (TEST-TestPointFields.testFloatPointFieldReturn-seed#[127C1875A23278A1]) [    ] o.a.s.u.p.LogUpdateProcessorFactory [collection1]  webapp=null path=null params={}{add=[4 (1572604532309884929)]} 0 0
   [junit4]   2> 764756 INFO  (TEST-TestPointFields.testFloatPointFieldReturn-seed#[127C1875A23278A1]) [    ] o.a.s.u.p.LogUpdateProcessorFactory [collection1]  webapp=null path=null params={}{add=[5 (1572604532309884930)]} 0 0
   [junit4]   2> 764757 INFO  (TEST-TestPointFields.testFloatPointFieldReturn-seed#[127C1875A23278A1]) [    ] o.a.s.u.p.LogUpdateProcessorFactory [collection1]  webapp=null path=null params={}{add=[6 (1572604532310933504)]} 0 0
   [junit4]   2> 764758 INFO  (TEST-TestPointFields.testFloatPointFieldReturn-seed#[127C1875A23278A1]) [    ] o.a.s.u.p.LogUpdateProcessorFactory [collection1]  webapp=null path=null params={}{add=[7 (1572604532311982080)]} 0 0
   [junit4]   2> 764758 INFO  (TEST-TestPointFields.testFloatPointFieldReturn-seed#[127C1875A23278A1]) [    ] o.a.s.u.p.LogUpdateProcessorFactory [collection1]  webapp=null path=null params={}{add=[8 (1572604532311982081)]} 0 0
   [junit4]   2> 764759 INFO  (TEST-TestPointFields.testFloatPointFieldReturn-seed#[127C1875A23278A1]) [    ] o.a.s.u.p.LogUpdateProcessorFactory [collection1]  webapp=null path=null params={}{add=[9 (1572604532313030656)]} 0 0
   [junit4]   2> 764759 INFO  (TEST-TestPointFields.testFloatPointFieldReturn-seed#[127C1875A23278A1]) [    ] o.a.s.u.p.LogUpdateProcessorFactory [collection1]  webapp=null path=null params={}{add=[10 (1572604532313030657)]} 0 0
   [junit4]   2> 764759 INFO  (TEST-TestPointFields.testFloatPointFieldReturn-seed#[127C1875A23278A1]) [    ] o.a.s.u.p.LogUpdateProcessorFactory [collection1]  webapp=null path=null params={}{add=[11 (1572604532313030658)]} 0 0
   [junit4]   2> 764760 INFO  (TEST-TestPointFields.testFloatPointFieldReturn-seed#[127C1875A23278A1]) [    ] o.a.s.u.p.LogUpdateProcessorFactory [collection1]  webapp=null path=null params={}{add=[12 (1572604532314079232)]} 0 0
   [junit4]   2> 764761 INFO  (TEST-TestPointFields.testFloatPointFieldReturn-seed#[127C1875A23278A1]) [    ] o.a.s.u.p.LogUpdateProcessorFactory [collection1]  webapp=null path=null params={}{add=[13 (1572604532314079233)]} 0 1
   [junit4]   2> 764762 INFO  (TEST-TestPointFields.testFloatPointFieldReturn-seed#[127C1875A23278A1]) [    ] o.a.s.u.p.LogUpdateProcessorFactory [collection1]  webapp=null path=null params={}{add=[14 (1572604532316176384)]} 0 0
   [junit4]   2> 764762 INFO  (TEST-TestPointFields.testFloatPointFieldReturn-seed#[127C1875A23278A1]) [    ] o.a.s.u.p.LogUpdateProcessorFactory [collection1]  webapp=null path=null params={}{add=[15 (1572604532316176385)]} 0 0
   [junit4]   2> 764763 INFO  (TEST-TestPointFields.testFloatPointFieldReturn-seed#[127C1875A23278A1]) [    ] o.a.s.u.p.LogUpdateProcessorFactory [collection1]  webapp=null path=null params={}{add=[16 (1572604532317224960)]} 0 0
   [junit4]   2> 764763 INFO  (TEST-TestPointFields.testFloatPointFieldReturn-seed#[127C1875A23278A1]) [    ] o.a.s.u.p.LogUpdateProcessorFactory [collection1]  webapp=null path=null params={}{add=[17 (1572604532317224961)]} 0 0
   [junit4]   2> 764764 INFO  (TEST-TestPointFields.testFloatPointFieldReturn-seed#[127C1875A23278A1]) [    ] o.a.s.u.p.LogUpdateProcessorFactory [collection1]  webapp=null path=null params={}{add=[18 (1572604532317224962)]} 0 0
   [junit4]   2> 764764 INFO  (TEST-TestPointFields.testFloatPointFieldReturn-seed#[127C1875A23278A1]) [    ] o.a.s.u.p.LogUpdateProcessorFactory [collection1]  webapp=null path=null params={}{add=[19 (1572604532318273536)]} 0 0
   [junit4]   2> 764764 INFO  (TEST-TestPointFields.testFloatPointFieldReturn-seed#[127C1875A23278A1]) [    ] o.a.s.c.S.Request [collection1]  webapp=null path=null params={qt=/get&id=0&wt=xml} status=0 QTime=0
   [junit4]   2> 764765 INFO  (TEST-TestPointFields.testFloatPointFieldReturn-seed#[127C1875A23278A1]) [    ] o.a.s.c.S.Request [collection1]  webapp=null path=null params={qt=/get&id=1&wt=xml} status=0 QTime=0
   [junit4]   2> 764765 INFO  (TEST-TestPointFields.testFloatPointFieldReturn-seed#[127C1875A23278A1]) [    ] o.a.s.c.S.Request [collection1]  webapp=null path=null params={qt=/get&id=2&wt=xml} status=0 QTime=0
   [junit4]   2> 764766 INFO  (TEST-TestPointFields.testFloatPointFieldReturn-seed#[127C1875A23278A1]) [    ] o.a.s.c.S.Request [collection1]  webapp=null path=null params={qt=/get&id=3&wt=xml} status=0 QTime=0
   [junit4]   2> 764766 INFO  (TEST-TestPointFields.testFloatPointFieldReturn-seed#[127C1875A23278A1]) [    ] o.a.s.c.S.Request [collection1]  webapp=null path=null params={qt=/get&id=4&wt=xml} status=0 QTime=0
   [junit4]   2> 764766 INFO  (TEST-TestPointFields.testFloatPointFieldReturn-seed#[127C1875A23278A1]) [    ] o.a.s.c.S.Request [collection1]  webapp=null path=null params={qt=/get&id=5&wt=xml} status=0 QTime=0
   [junit4]   2> 764767 INFO  (TEST-TestPointFields.testFloatPointFieldReturn-seed#[127C1875A23278A1]) [    ] o.a.s.c.S.Request [collection1]  webapp=null path=null params={qt=/get&id=6&wt=xml} status=0 QTime=0
   [junit4]   2> 764767 INFO  (TEST-TestPointFields.testFloatPointFieldReturn-seed#[127C1875A23278A1]) [    ] o.a.s.c.S.Request [collection1]  webapp=null path=null params={qt=/get&id=7&wt=xml} status=0 QTime=0
   [junit4]   2> 764767 INFO  (TEST-TestPointFields.testFloatPointFieldReturn-seed#[127C1875A23278A1]) [    ] o.a.s.c.S.Request [collection1]  webapp=null path=null params={qt=/get&id=8&wt=xml} status=0 QTime=0
   [junit4]   2> 764767 INFO  (TEST-TestPointFields.testFloatPointFieldReturn-seed#[127C1875A23278A1]) [    ] o.a.s.c.S.Request [collection1]  webapp=null path=null params={qt=/get&id=9&wt=xml} status=0 QTime=0
   [junit4]   2> 764770 INFO  (TEST-TestPointFields.testFloatPointFieldReturn-seed#[127C1875A23278A1]) [    ] o.a.s.c.S.Request [collection1]  webapp=null path=null params={qt=/get&id=10&wt=xml} status=0 QTime=0
   [junit4]   2> 764770 INFO  (TEST-TestPointFields.testFloatPointFieldReturn-seed#[127C1875A23278A1]) [    ] o.a.s.c.S.Request [collection1]  webapp=null path=null params={qt=/get&id=11&wt=xml} status=0 QTime=0
   [junit4]   2> 764770 INFO  (TEST-TestPointFields.testFloatPointFieldReturn-seed#[127C1875A23278A1]) [    ] o.a.s.c.S.Request [collection1]  webapp=null path=null params={qt=/get&id=12&wt=xml} status=0 QTime=0
   [junit4]   2> 764771 INFO  (TEST-TestPointFields.testFloatPointFieldReturn-seed#[127C1875A23278A1]) [    ] o.a.s.c.S.Request [collection1]  webapp=null path=null params={qt=/get&id=13&wt=xml} status=0 QTime=0
   [junit4]   2> 764771 INFO  (TEST-TestPointFields.testFloatPointFieldReturn-seed#[127C1875A23278A1]) [    ] o.a.s.c.S.Request [collection1]  webapp=null path=null params={qt=/get&id=14&wt=xml} status=0 QTime=0
   [junit4]   2> 764771 INFO  (TEST-TestPointFields.testFloatPointFieldReturn-seed#[127C1875A23278A1]) [    ] o.a.s.c.S.Request [collection1]  webapp=null path=null params={qt=/get&id=15&wt=xml} status=0 QTime=0
   [junit4]   2> 764772 INFO  (TEST-TestPointFields.testFloatPointFieldReturn-seed#[127C1875A23278A1]) [    ] o.a.s.c.S.Request [collection1]  webapp=null path=null params={qt=/get&id=16&wt=xml} status=0 QTime=0
   [junit4]   2> 764772 INFO  (TEST-TestPointFields.testFloatPointFieldReturn-seed#[127C1875A23278A1]) [    ] o.a.s.c.S.Request [collection1]  webapp=null path=null params={qt=/get&id=17&wt=xml} status=0 QTime=0
   [junit4]   2> 764772 INFO  (TEST-TestPointFields.testFloatPointFieldReturn-seed#[127C1875A23278A1]) [    ] o.a.s.c.S.Request [collection1]  webapp=null path=null params={qt=/get&id=18&wt=xml} status=0 QTime=0
   [junit4]   2> 764772 INFO  (TEST-TestPointFields.testFloatPointFieldReturn-seed#[127C1875A23278A1]) [    ] o.a.s.c.S.Request [collection1]  webapp=null path=null params={qt=/get&id=19&wt=xml} status=0 QTime=0
   [junit4]   2> 764773 INFO  (TEST-TestPointFields.testFloatPointFieldReturn-seed#[127C1875A23278A1]) [    ] o.a.s.u.DirectUpdateHandler2 start commit{_version_=1572604532327710720,optimize=false,openSearcher=true,waitSearcher=true,expungeDeletes=false,softCommit=false,prepareCommit=false}
   [junit4]   2> 764773 INFO  (TEST-TestPointFields.testFloatPointFieldReturn-seed#[127C1875A23278A1]) [    ] o.a.s.u.SolrIndexWriter Calling setCommitData with IW:org.apache.solr.update.SolrIndexWriter@7812a3d7 commitCommandVersion:1572604532327710720
   [junit4]   2> 764775 INFO  (TEST-TestPointFields.testFloatPointFieldReturn-seed#[127C1875A23278A1]) [    ] o.a.s.s.SolrIndexSearcher Opening [Searcher@6c2d66f2[collection1] main]
   [junit4]   2> 764776 INFO  (searcherExecutor-3074-thread-1) [    ] o.a.s.c.SolrCore [collection1] Registered new searcher Searcher@6c2d66f2[collection1] main{ExitableDirectoryReader(UninvertingDirectoryReader(Uninverting(_6(7.1.0):C7) Uninverting(_7(7.1.0):C7) Uninverting(_8(7.1.0):C6)))}
   [junit4]   2> 764776 INFO  (TEST-TestPointFields.testFloatPointFieldReturn-seed#[127C1875A23278A1]) [    ] o.a.s.u.DirectUpdateHandler2 end_commit_flush
   [junit4]   2> 764776 INFO  (TEST-TestPointFields.testFloatPointFieldReturn-seed#[127C1875A23278A1]) [    ] o.a.s.u.p.LogUpdateProcessorFactory [collection1]  webapp=null path=null params={}{commit=} 0 3
   [junit4]   2> 764777 INFO  (TEST-TestPointFields.testFloatPointFieldReturn-seed#[127C1875A23278A1]) [    ] o.a.s.c.S.Request [collection1]  webapp=null path=null params={q=*:*&fl=id,+number_p_f_dv_ns&rows=20&wt=xml} hits=20 status=0 QTime=0
   [junit4]   2> 764780 INFO  (TEST-TestPointFields.testFloatPointFieldReturn-seed#[127C1875A23278A1]) [    ] o.a.s.c.S.Request [collection1]  webapp=null path=null params={qt=/get&id=0&wt=xml} status=0 QTime=0
   [junit4]   2> 764780 INFO  (TEST-TestPointFields.testFloatPointFieldReturn-seed#[127C1875A23278A1]) [    ] o.a.s.c.S.Request [collection1]  webapp=null path=null params={qt=/get&id=1&wt=xml} status=0 QTime=0
   [junit4]   2> 764781 INFO  (TEST-TestPointFields.testFloatPointFieldReturn-seed#[127C1875A23278A1]) [    ] o.a.s.c.S.Request [collection1]  webapp=null path=null params={qt=/get&id=2&wt=xml} status=0 QTime=0
   [junit4]   2> 764781 INFO  (TEST-TestPointFields.testFloatPointFieldReturn-seed#[127C1875A23278A1]) [    ] o.a.s.c.S.Request [collection1]  webapp=null path=null params={qt=/get&id=3&wt=xml} status=0 QTime=0
   [junit4]   2> 764781 INFO  (TEST-TestPointFields.testFloatPointFieldReturn-seed#[127C1875A23278A1]) [    ] o.a.s.c.S.Request [collection1]  webapp=null path=null params={qt=/get&id=4&wt=xml} status=0 QTime=0
   [junit4]   2> 764782 INFO  (TEST-TestPointFields.testFloatPointFieldReturn-seed#[127C1875A23278A1]) [    ] o.a.s.c.S.Request [collection1]  webapp=null path=null params={qt=/get&id=5&wt=xml} status=0 QTime=0
   [junit4]   2> 764782 INFO  (TEST-TestPointFields.testFloatPointFieldReturn-seed#[127C1875A23278A1]) [    ] o.a.s.c.S.Request [collection1]  webapp=null path=null params={qt=/get&id=6&wt=xml} status=0 QTime=0
   [junit4]   2> 764782 INFO  (TEST-TestPointFields.testFloatPointFieldReturn-seed#[127C1875A23278A1]) [    ] o.a.s.c.S.Request [collection1]  webapp=null path=null params={qt=/get&id=7&wt=xml} status=0 QTime=0
   [junit4]   2> 764783 INFO  (TEST-TestPointFields.testFloatPointFieldReturn-seed#[127C1875A23278A1]) [    ] o.a.s.c.S.Request [collection1]  webapp=null path=null params={qt=/get&id=8&wt=xml} status=0 QTime=0
   [junit4]   2> 764783 INFO  (TEST-TestPointFields.testFloatPointFieldReturn-seed#[127C1875A23278A1]) [    ] o.a.s.c.S.Request [collection1]  webapp=null path=null params={qt=/get&id=9&wt=xml} status=0 QTime=0
   [junit4]   2> 764783 INFO  (TEST-TestPointFields.testFloatPointFieldReturn-seed#[127C1875A23278A1]) [    ] o.a.s.c.S.Request [collection1]  webapp=null path=null params={qt=/get&id=10&wt=xml} status=0 QTime=0
   [junit4]   2> 764784 INFO  (TEST-TestPointFields.testFloatPointFieldReturn-seed#[127C1875A23278A1]) [    ] o.a.s.c.S.Request [collection1]  webapp=null path=null params={qt=/get&id=11&wt=xml} status=0 QTime=0
   [junit4]   2> 764784 INFO  (TEST-TestPointFields.testFloatPointFieldReturn-seed#[127C1875A23278A1]) [    ] o.a.s.c.S.Request [collection1]  webapp=null path=null params={qt=/get&id=12&wt=xml} status=0 QTime=0
   [junit4]   2> 764785 INFO  (TEST-TestPointFields.testFloatPointFieldReturn-seed#[127C1875A23278A1]) [    ] o.a.s.c.S.Request [collection1]  webapp=null path=null params={qt=/get&id=13&wt=xml} status=0 QTime=0
   [junit4]   2> 764785 INFO  (TEST-TestPointFields.testFloatPointFieldReturn-seed#[127C1875A23278A1]) [    ] o.a.s.c.S.Request [collection1]  webapp=null path=null params={qt=/get&id=14&wt=xml} status=0 QTime=0
   [junit4]   2> 764785 INFO  (TEST-TestPointFields.testFloatPointFieldReturn-seed#[127C1875A23278A1]) [    ] o.a.s.c.S.Request [collection1]  webapp=null path=null params={qt=/get&id=15&wt=xml} status=0 QTime=0
   [junit4]   2> 764785 INFO  (TEST-TestPointFields.testFloatPointFieldReturn-seed#[127C1875A23278A1]) [    ] o.a.s.c.S.Request [collection1]  webapp=null path=null params={qt=/get&id=16&wt=xml} status=0 QTime=0
   [junit4]   2> 764786 INFO  (TEST-TestPointFields.testFloatPointFieldReturn-seed#[127C1875A23278A1]) [    ] o.a.s.c.S.Request [collection1]  webapp=null path=null params={qt=/get&id=17&wt=xml} status=0 QTime=0
   [junit4]   2> 764786 INFO  (TEST-TestPointFields.testFloatPointFieldReturn-seed#[127C1875A23278A1]) [    ] o.a.s.c.S.Request [collection1]  webapp=null path=null params={qt=/get&id=18&wt=xml} status=0 QTime=0
   [junit4]   2> 764786 INFO  (TEST-TestPointFields.testFloatPointFieldReturn-seed#[127C1875A23278A1]) [    ] o.a.s.c.S.Request [collection1]  webapp=null path=null params={qt=/get&id=19&wt=xml} status=0 QTime=0
   [junit4]   2> 764787 INFO  (TEST-TestPointFields.testFloatPointFieldReturn-seed#[127C1875A23278A1]) [    ] o.a.s.u.DirectUpdateHandler2 [collection1] REMOVING ALL DOCUMENTS FROM INDEX
   [junit4]   2> 764787 INFO  (TEST-TestPointFields.testFloatPointFieldReturn-seed#[127C1875A23278A1]) [    ] o.a.s.s.SolrIndexSearcher Opening [Searcher@350374f8[collection1] realtime]
   [junit4]   2> 764787 INFO  (TEST-TestPointFields.testFloatPointFieldReturn-seed#[127C1875A23278A1]) [    ] o.a.s.u.p.LogUpdateProcessorFactory [collection1]  webapp=null path=null params={_version_=-9223372036854775807&update.distrib=FROMLEADER&versions=true&wt=json&indent=true}{deleteByQuery=*:* (-9223372036854775807)} 0 0
   [junit4]   2> 764787 INFO  (TEST-TestPointFields.testFloatPointFieldReturn-seed#[127C1875A23278A1]) [    ] o.a.s.u.DirectUpdateHandler2 start commit{_version_=1572604532342390784,optimize=false,openSearcher=true,waitSearcher=true,expungeDeletes=false,softCommit=false,prepareCommit=false}
   [junit4]   2> 764788 INFO  (TEST-TestPointFields.testFloatPointFieldReturn-seed#[127C1875A23278A1]) [    ] o.a.s.u.SolrIndexWriter Calling setCommitData with IW:org.apache.solr.update.SolrIndexWriter@7812a3d7 commitCommandVersion:1572604532342390784
   [junit4]   2> 764788 INFO  (TEST-TestPointFields.testFloatPointFieldReturn-seed#[127C1875A23278A1]) [    ] o.a.s.s.SolrIndexSearcher Opening [Searcher@2c6d8b5d[collection1] main]
   [junit4]   2> 764789 INFO  (searcherExecutor-3074-thread-1) [    ] o.a.s.c.SolrCore [collection1] Registered new searcher Searcher@2c6d8b5d[collection1] main{ExitableDirectoryReader(UninvertingDirectoryReader())}
   [junit4]   2> 764789 INFO  (TEST-TestPointFields.testFloatPointFieldReturn-seed#[127C1875A23278A1]) [    ] o.a.s.u.DirectUpdateHandler2 end_commit_flush
   [junit4]   2> 764789 INFO  (TEST-TestPointFields.testFloatPointFieldReturn-seed#[127C1875A23278A1]) [    ] o.a.s.u.p.LogUpdateProcessorFactory [collection1]  webapp=null path=null params={}{commit=} 0 2
   [junit4]   2> 764790 INFO  (TEST-TestPointFields.testFloatPointFieldReturn-seed#[127C1875A23278A1]) [    ] o.a.s.u.DirectUpdateHandler2 [collection1] REMOVING ALL DOCUMENTS FROM INDEX
   [junit4]   2> 764790 INFO  (TEST-TestPointFields.testFloatPointFieldReturn-seed#[127C1875A23278A1]) [    ] o.a.s.s.SolrIndexSearcher Opening [Searcher@4315e53[collection1] realtime]
   [junit4]   2> 764790 INFO  (TEST-TestPointFields.testFloatPointFieldReturn-seed#[127C1875A23278A1]) [    ] o.a.s.u.p.LogUpdateProcessorFactory [collection1]  webapp=null path=null params={_version_=-9223372036854775807&update.distrib=FROMLEADER&versions=true&wt=json&indent=true}{deleteByQuery=*:* (-9223372036854775807)} 0 0
   [junit4]   2> 764790 INFO  (TEST-TestPointFields.testFloatPointFieldReturn-seed#[127C1875A23278A1]) [    ] o.a.s.u.DirectUpdateHandler2 start commit{_version_=1572604532345536512,optimize=false,openSearcher=true,waitSearcher=true,expungeDeletes=false,softCommit=false,prepareCommit=false}
   [junit4]   2> 764790 INFO  (TEST-TestPointFields.testFloatPointFieldReturn-seed#[127C1875A23278A1]) [    ] o.a.s.u.SolrIndexWriter Calling setCommitData with IW:org.apache.solr.update.SolrIndexWriter@7812a3d7 commitCommandVersion:1572604532345536512
   [junit4]   2> 764791 INFO  (TEST-TestPointFields.testFloatPointFieldReturn-seed#[127C1875A23278A1]) [    ] o.a.s.s.SolrIndexSearcher Opening [Searcher@36587e28[collection1] main]
   [junit4]   2> 764792 INFO  (searcherExecutor-3074-thread-1) [    ] o.a.s.c.SolrCore [collection1] Registered new searcher Searcher@36587e28[collection1] main{ExitableDirectoryReader(UninvertingDirectoryReader())}
   [junit4]   2> 764792 INFO  (TEST-TestPointFields.testFloatPointFieldReturn-seed#[127C1875A23278A1]) [    ] o.a.s.u.DirectUpdateHandler2 end_commit_flush
   [junit4]   2> 764792 INFO  (TEST-TestPointFields.testFloatPointFieldReturn-seed#[127C1875A23278A1]) [    ] o.a.s.u.p.LogUpdateProcessorFactory [collection1]  webapp=null path=null params={}{commit=} 0 1
   [junit4]   2> 764792 INFO  (TEST-TestPointFields.testFloatPointFieldReturn-seed#[127C1875A23278A1]) [    ] o.a.s.SolrTestCaseJ4 ###Ending testFloatPointFieldReturn
   [junit4]   2> 764795 INFO  (TEST-TestPointFields.testDoublePointFieldMultiValuedFacetField-seed#[127C1875A23278A1]) [    ] o.a.s.SolrTestCaseJ4 ###Starting testDoublePointFieldMultiValuedFacetField
   [junit4]   2> 764796 INFO  (TEST-TestPointFields.testDoublePointFieldMultiValuedFacetField-seed#[127C1875A23278A1]) [    ] o.a.s.u.p.LogUpdateProcessorFactory [collection1]  webapp=null path=null params={}{add=[0 (1572604532350779392)]} 0 0
   [junit4]   2> 764796 INFO  (TEST-TestPointFields.testDoublePointFieldMultiValuedFacetField-seed#[127C1875A23278A1]) [    ] o.a.s.u.p.LogUpdateProcessorFactory [collection1]  webapp=null path=null params={}{add=[1 (1572604532351827968)]} 0 0
   [junit4]   2> 764797 INFO  (TEST-TestPointFields.testDoublePointFieldMultiValuedFacetField-seed#[127C1875A23278A1]) [    ] o.a.s.u.p.LogUpdateProcessorFactory [collection1]  webapp=null path=null params={}{add=[2 (1572604532352876544)]} 0 0
   [junit4]   2> 764797 INFO  (TEST-TestPointFields.testDoublePointFieldMultiValuedFacetField-seed#[127C1875A23278A1]) [    ] o.a.s.u.p.LogUpdateProcessorFactory [collection1]  webapp=null path=null params={}{add=[3 (1572604532352876545)]} 0 0
   [junit4]   2> 764798 INFO  (TEST-TestPointFields.testDoublePointFieldMultiValuedFacetField-seed#[127C1875A23278A1]) [    ] o.a.s.u.p.LogUpdateProcessorFactory [col

[...truncated too long message...]

junit4]   2> 780838 INFO  (TEST-TestPointFields.testFloatPointFieldMultiValuedNonSearchableExactQuery-seed#[127C1875A23278A1]) [    ] o.a.s.c.S.Request [collection1]  webapp=null path=null params={q=number_p_f_ni_ns_mv:0.0014103696+OR+number_p_f_ni_ns_mv:\-3067.2761&wt=xml} hits=0 status=0 QTime=0
   [junit4]   2> 780838 INFO  (TEST-TestPointFields.testFloatPointFieldMultiValuedNonSearchableExactQuery-seed#[127C1875A23278A1]) [    ] o.a.s.c.S.Request [collection1]  webapp=null path=null params={q=number_p_f_ni_ns_mv:\-3067.2761+OR+number_p_f_ni_ns_mv:\-5.6514452E18&wt=xml} hits=0 status=0 QTime=0
   [junit4]   2> 780839 INFO  (TEST-TestPointFields.testFloatPointFieldMultiValuedNonSearchableExactQuery-seed#[127C1875A23278A1]) [    ] o.a.s.c.S.Request [collection1]  webapp=null path=null params={q=number_p_f_ni_ns_mv:\-5.6514452E18+OR+number_p_f_ni_ns_mv:\-2.1353209E\-20&wt=xml} hits=0 status=0 QTime=0
   [junit4]   2> 780839 INFO  (TEST-TestPointFields.testFloatPointFieldMultiValuedNonSearchableExactQuery-seed#[127C1875A23278A1]) [    ] o.a.s.c.S.Request [collection1]  webapp=null path=null params={q=number_p_f_ni_ns_mv:\-2.1353209E\-20+OR+number_p_f_ni_ns_mv:3.342032E21&wt=xml} hits=0 status=0 QTime=0
   [junit4]   2> 780839 INFO  (TEST-TestPointFields.testFloatPointFieldMultiValuedNonSearchableExactQuery-seed#[127C1875A23278A1]) [    ] o.a.s.c.S.Request [collection1]  webapp=null path=null params={q=number_p_f_ni_ns_mv:3.342032E21+OR+number_p_f_ni_ns_mv:1.030403E28&wt=xml} hits=0 status=0 QTime=0
   [junit4]   2> 780840 INFO  (TEST-TestPointFields.testFloatPointFieldMultiValuedNonSearchableExactQuery-seed#[127C1875A23278A1]) [    ] o.a.s.c.S.Request [collection1]  webapp=null path=null params={q=number_p_f_ni_ns_mv:\-6.97999E\-30+OR+number_p_f_ni_ns_mv:6.1700954E26&wt=xml} hits=0 status=0 QTime=0
   [junit4]   2> 780840 INFO  (TEST-TestPointFields.testFloatPointFieldMultiValuedNonSearchableExactQuery-seed#[127C1875A23278A1]) [    ] o.a.s.c.S.Request [collection1]  webapp=null path=null params={q=number_p_f_ni_ns_mv:\-9.628153E\-13+OR+number_p_f_ni_ns_mv:\-30.448502&wt=xml} hits=0 status=0 QTime=0
   [junit4]   2> 780840 INFO  (TEST-TestPointFields.testFloatPointFieldMultiValuedNonSearchableExactQuery-seed#[127C1875A23278A1]) [    ] o.a.s.c.S.Request [collection1]  webapp=null path=null params={q=number_p_f_ni_ns_mv:3.7781855E35+OR+number_p_f_ni_ns_mv:7.84509E\-14&wt=xml} hits=0 status=0 QTime=0
   [junit4]   2> 780840 INFO  (TEST-TestPointFields.testFloatPointFieldMultiValuedNonSearchableExactQuery-seed#[127C1875A23278A1]) [    ] o.a.s.c.S.Request [collection1]  webapp=null path=null params={q=number_p_f_ni_ns_mv:\-2.8977505E30+OR+number_p_f_ni_ns_mv:\-1.6346864E7&wt=xml} hits=0 status=0 QTime=0
   [junit4]   2> 780841 INFO  (TEST-TestPointFields.testFloatPointFieldMultiValuedNonSearchableExactQuery-seed#[127C1875A23278A1]) [    ] o.a.s.c.S.Request [collection1]  webapp=null path=null params={q=number_p_f_ni_ns_mv:\-7.3965607E12+OR+number_p_f_ni_ns_mv:0.0014103696&wt=xml} hits=0 status=0 QTime=0
   [junit4]   2> 780841 INFO  (TEST-TestPointFields.testFloatPointFieldMultiValuedNonSearchableExactQuery-seed#[127C1875A23278A1]) [    ] o.a.s.c.S.Request [collection1]  webapp=null path=null params={q=number_p_f_ni_ns_mv:\-1.7117003E\-25+OR+number_p_f_ni_ns_mv:\-3067.2761&wt=xml} hits=0 status=0 QTime=0
   [junit4]   2> 780841 INFO  (TEST-TestPointFields.testFloatPointFieldMultiValuedNonSearchableExactQuery-seed#[127C1875A23278A1]) [    ] o.a.s.c.S.Request [collection1]  webapp=null path=null params={q=number_p_f_ni_ns_mv:\-1.32156066E\-11+OR+number_p_f_ni_ns_mv:\-5.6514452E18&wt=xml} hits=0 status=0 QTime=0
   [junit4]   2> 780842 INFO  (TEST-TestPointFields.testFloatPointFieldMultiValuedNonSearchableExactQuery-seed#[127C1875A23278A1]) [    ] o.a.s.c.S.Request [collection1]  webapp=null path=null params={q=number_p_f_ni_ns_mv:1.7351158E\-19+OR+number_p_f_ni_ns_mv:\-2.1353209E\-20&wt=xml} hits=0 status=0 QTime=0
   [junit4]   2> 780842 INFO  (TEST-TestPointFields.testFloatPointFieldMultiValuedNonSearchableExactQuery-seed#[127C1875A23278A1]) [    ] o.a.s.c.S.Request [collection1]  webapp=null path=null params={q=number_p_f_ni_ns_mv:1.7407229E\-32+OR+number_p_f_ni_ns_mv:3.342032E21&wt=xml} hits=0 status=0 QTime=0
   [junit4]   2> 780842 INFO  (TEST-TestPointFields.testFloatPointFieldMultiValuedNonSearchableExactQuery-seed#[127C1875A23278A1]) [    ] o.a.s.c.S.Request [collection1]  webapp=null path=null params={q=number_p_f_ni_ns_mv:2.4093553E\-19+OR+number_p_f_ni_ns_mv:1.030403E28&wt=xml} hits=0 status=0 QTime=0
   [junit4]   2> 780843 INFO  (TEST-TestPointFields.testFloatPointFieldMultiValuedNonSearchableExactQuery-seed#[127C1875A23278A1]) [    ] o.a.s.u.DirectUpdateHandler2 [collection1] REMOVING ALL DOCUMENTS FROM INDEX
   [junit4]   2> 780843 INFO  (TEST-TestPointFields.testFloatPointFieldMultiValuedNonSearchableExactQuery-seed#[127C1875A23278A1]) [    ] o.a.s.s.SolrIndexSearcher Opening [Searcher@7d5d0d27[collection1] realtime]
   [junit4]   2> 780843 INFO  (TEST-TestPointFields.testFloatPointFieldMultiValuedNonSearchableExactQuery-seed#[127C1875A23278A1]) [    ] o.a.s.u.p.LogUpdateProcessorFactory [collection1]  webapp=null path=null params={_version_=-9223372036854775807&update.distrib=FROMLEADER&versions=true&wt=json&indent=true}{deleteByQuery=*:* (-9223372036854775807)} 0 0
   [junit4]   2> 780843 INFO  (TEST-TestPointFields.testFloatPointFieldMultiValuedNonSearchableExactQuery-seed#[127C1875A23278A1]) [    ] o.a.s.u.DirectUpdateHandler2 start commit{_version_=1572604549178327040,optimize=false,openSearcher=true,waitSearcher=true,expungeDeletes=false,softCommit=false,prepareCommit=false}
   [junit4]   2> 780843 INFO  (TEST-TestPointFields.testFloatPointFieldMultiValuedNonSearchableExactQuery-seed#[127C1875A23278A1]) [    ] o.a.s.u.SolrIndexWriter Calling setCommitData with IW:org.apache.solr.update.SolrIndexWriter@7812a3d7 commitCommandVersion:1572604549178327040
   [junit4]   2> 780844 INFO  (TEST-TestPointFields.testFloatPointFieldMultiValuedNonSearchableExactQuery-seed#[127C1875A23278A1]) [    ] o.a.s.s.SolrIndexSearcher Opening [Searcher@13c08d7d[collection1] main]
   [junit4]   2> 780844 INFO  (TEST-TestPointFields.testFloatPointFieldMultiValuedNonSearchableExactQuery-seed#[127C1875A23278A1]) [    ] o.a.s.u.DirectUpdateHandler2 end_commit_flush
   [junit4]   2> 780845 INFO  (searcherExecutor-3074-thread-1) [    ] o.a.s.c.SolrCore [collection1] Registered new searcher Searcher@13c08d7d[collection1] main{ExitableDirectoryReader(UninvertingDirectoryReader())}
   [junit4]   2> 780845 INFO  (TEST-TestPointFields.testFloatPointFieldMultiValuedNonSearchableExactQuery-seed#[127C1875A23278A1]) [    ] o.a.s.u.p.LogUpdateProcessorFactory [collection1]  webapp=null path=null params={}{commit=} 0 1
   [junit4]   2> 780845 INFO  (TEST-TestPointFields.testFloatPointFieldMultiValuedNonSearchableExactQuery-seed#[127C1875A23278A1]) [    ] o.a.s.SolrTestCaseJ4 ###Ending testFloatPointFieldMultiValuedNonSearchableExactQuery
   [junit4]   2> 780846 INFO  (SUITE-TestPointFields-seed#[127C1875A23278A1]-worker) [    ] o.a.s.SolrTestCaseJ4 ###deleteCore
   [junit4]   2> 780846 INFO  (SUITE-TestPointFields-seed#[127C1875A23278A1]-worker) [    ] o.a.s.c.CoreContainer Shutting down CoreContainer instance=1058649879
   [junit4]   2> 780846 INFO  (SUITE-TestPointFields-seed#[127C1875A23278A1]-worker) [    ] o.a.s.m.SolrMetricManager Closing metric reporters for registry=solr.node, tag=null
   [junit4]   2> 780847 INFO  (SUITE-TestPointFields-seed#[127C1875A23278A1]-worker) [    ] o.a.s.m.SolrMetricManager Closing metric reporters for registry=solr.jvm, tag=null
   [junit4]   2> 780848 INFO  (SUITE-TestPointFields-seed#[127C1875A23278A1]-worker) [    ] o.a.s.m.SolrMetricManager Closing metric reporters for registry=solr.jetty, tag=null
   [junit4]   2> 780848 INFO  (SUITE-TestPointFields-seed#[127C1875A23278A1]-worker) [    ] o.a.s.c.TransientSolrCoreCacheDefault Allocating transient cache for 2147483647 transient cores
   [junit4]   2> 780849 INFO  (coreCloseExecutor-3079-thread-1) [    x:collection1] o.a.s.c.SolrCore [collection1]  CLOSING SolrCore org.apache.solr.core.SolrCore@6e022a51
   [junit4]   2> 780850 INFO  (coreCloseExecutor-3079-thread-1) [    x:collection1] o.a.s.m.SolrMetricManager Closing metric reporters for registry=solr.core.collection1, tag=1845635665
   [junit4]   2> NOTE: leaving temporary files on disk at: /x1/jenkins/jenkins-slave/workspace/Lucene-Solr-Tests-7.x/solr/build/solr-core/test/J1/temp/solr.schema.TestPointFields_127C1875A23278A1-001
   [junit4]   2> NOTE: test params are: codec=Lucene70, sim=RandomSimilarity(queryNorm=false): {}, locale=ar-SY, timezone=Africa/Bangui
   [junit4]   2> NOTE: Linux 3.13.0-88-generic amd64/Oracle Corporation 1.8.0_131 (64-bit)/cpus=4,threads=1,free=174984288,total=534773760
   [junit4]   2> NOTE: All tests run in this JVM: [SchemaVersionSpecificBehaviorTest, TermVectorComponentTest, TestPolicyCloud, TestCopyFieldCollectionResource, TestLegacyFieldCache, TestStressInPlaceUpdates, TestNRTOpen, TestSolrConfigHandlerCloud, InfixSuggestersTest, SolrIndexMetricsTest, TestHdfsBackupRestoreCore, HighlighterMaxOffsetTest, SpatialHeatmapFacetsTest, TestLegacyTerms, SubstringBytesRefFilterTest, ScriptEngineTest, TestElisionMultitermQuery, ZkCLITest, FileBasedSpellCheckerTest, TestNamedUpdateProcessors, TestGraphMLResponseWriter, MergeStrategyTest, TestRestoreCore, TestCloudNestedDocsSort, SoftAutoCommitTest, SearchHandlerTest, TestConfigSetImmutable, ShardSplitTest, DistributedIntervalFacetingTest, QueryParsingTest, CollectionsAPIAsyncDistributedZkTest, TestFieldTypeResource, SolrSlf4jReporterTest, TestFuzzyAnalyzedSuggestions, ConfigSetsAPITest, CollectionsAPIDistributedZkTest, SolrXmlInZkTest, MetricsHandlerTest, TestRawResponseWriter, TestPointFields]
   [junit4] Completed [260/727 (1!)] on J1 in 16.44s, 104 tests, 4 errors, 1 skipped <<< FAILURES!

[...truncated 44876 lines...]

Mime
View raw message