lucene-dev mailing list archives

Site index · List index
Message view « Date » · « Thread »
Top « Date » · « Thread »
From Policeman Jenkins Server <jenk...@thetaphi.de>
Subject [JENKINS] Lucene-Solr-master-Windows (32bit/jdk1.8.0_131) - Build # 6656 - Still Unstable!
Date Sat, 17 Jun 2017 16:36:04 GMT
Build: https://jenkins.thetaphi.de/job/Lucene-Solr-master-Windows/6656/
Java: 32bit/jdk1.8.0_131 -client -XX:+UseConcMarkSweepGC

1 tests failed.
FAILED:  org.apache.solr.handler.V2ApiIntegrationTest.testCollectionsApi

Error Message:
Error from server at https://127.0.0.1:50242/solr: Expected mime type application/octet-stream but got text/html. <html> <head> <meta http-equiv="Content-Type" content="text/html;charset=ISO-8859-1"/> <title>Error 400 </title> </head> <body> <h2>HTTP ERROR: 400</h2> <p>Problem accessing /solr/____v2/c. Reason: <pre>    {metadata={error-class=org.apache.solr.common.SolrException,root-error-class=java.nio.file.InvalidPathException},msg=java.nio.file.InvalidPathException: Illegal char &lt;?&gt; at index 53: C:UsersjenkinsworkspaceLucene-Solr-master-Windowssolr?uildsolr-core estJ1 empsolr.handler.V2ApiIntegrationTest_1158D582EE1A556C-001 empDir-002,code=400}</pre></p> <hr /><a href="http://eclipse.org/jetty">Powered by Jetty:// 9.3.14.v20161028</a><hr/> </body> </html> 

Stack Trace:
org.apache.solr.client.solrj.impl.HttpSolrClient$RemoteSolrException: Error from server at https://127.0.0.1:50242/solr: Expected mime type application/octet-stream but got text/html. <html>
<head>
<meta http-equiv="Content-Type" content="text/html;charset=ISO-8859-1"/>
<title>Error 400 </title>
</head>
<body>
<h2>HTTP ERROR: 400</h2>
<p>Problem accessing /solr/____v2/c. Reason:
<pre>    {metadata={error-class=org.apache.solr.common.SolrException,root-error-class=java.nio.file.InvalidPathException},msg=java.nio.file.InvalidPathException: Illegal char &lt;?&gt; at index 53: C:UsersjenkinsworkspaceLucene-Solr-master-Windowssolr?uildsolr-core	estJ1	empsolr.handler.V2ApiIntegrationTest_1158D582EE1A556C-001	empDir-002,code=400}</pre></p>
<hr /><a href="http://eclipse.org/jetty">Powered by Jetty:// 9.3.14.v20161028</a><hr/>
</body>
</html>

	at __randomizedtesting.SeedInfo.seed([1158D582EE1A556C:CDC63203560331D2]:0)
	at org.apache.solr.client.solrj.impl.HttpSolrClient.executeMethod(HttpSolrClient.java:563)
	at org.apache.solr.client.solrj.impl.HttpSolrClient.request(HttpSolrClient.java:231)
	at org.apache.solr.client.solrj.impl.HttpSolrClient.request(HttpSolrClient.java:220)
	at org.apache.solr.client.solrj.impl.LBHttpSolrClient.doRequest(LBHttpSolrClient.java:459)
	at org.apache.solr.client.solrj.impl.LBHttpSolrClient.request(LBHttpSolrClient.java:389)
	at org.apache.solr.client.solrj.impl.CloudSolrClient.sendRequest(CloudSolrClient.java:1135)
	at org.apache.solr.client.solrj.impl.CloudSolrClient.requestWithRetryOnStaleState(CloudSolrClient.java:876)
	at org.apache.solr.client.solrj.impl.CloudSolrClient.request(CloudSolrClient.java:807)
	at org.apache.solr.client.solrj.SolrClient.request(SolrClient.java:1219)
	at org.apache.solr.handler.V2ApiIntegrationTest.testCollectionsApi(V2ApiIntegrationTest.java:97)
	at sun.reflect.NativeMethodAccessorImpl.invoke0(Native Method)
	at sun.reflect.NativeMethodAccessorImpl.invoke(NativeMethodAccessorImpl.java:62)
	at sun.reflect.DelegatingMethodAccessorImpl.invoke(DelegatingMethodAccessorImpl.java:43)
	at java.lang.reflect.Method.invoke(Method.java:498)
	at com.carrotsearch.randomizedtesting.RandomizedRunner.invoke(RandomizedRunner.java:1713)
	at com.carrotsearch.randomizedtesting.RandomizedRunner$8.evaluate(RandomizedRunner.java:907)
	at com.carrotsearch.randomizedtesting.RandomizedRunner$9.evaluate(RandomizedRunner.java:943)
	at com.carrotsearch.randomizedtesting.RandomizedRunner$10.evaluate(RandomizedRunner.java:957)
	at com.carrotsearch.randomizedtesting.rules.SystemPropertiesRestoreRule$1.evaluate(SystemPropertiesRestoreRule.java:57)
	at org.apache.lucene.util.TestRuleSetupTeardownChained$1.evaluate(TestRuleSetupTeardownChained.java:49)
	at org.apache.lucene.util.AbstractBeforeAfterRule$1.evaluate(AbstractBeforeAfterRule.java:45)
	at org.apache.lucene.util.TestRuleThreadAndTestName$1.evaluate(TestRuleThreadAndTestName.java:48)
	at org.apache.lucene.util.TestRuleIgnoreAfterMaxFailures$1.evaluate(TestRuleIgnoreAfterMaxFailures.java:64)
	at org.apache.lucene.util.TestRuleMarkFailure$1.evaluate(TestRuleMarkFailure.java:47)
	at com.carrotsearch.randomizedtesting.rules.StatementAdapter.evaluate(StatementAdapter.java:36)
	at com.carrotsearch.randomizedtesting.ThreadLeakControl$StatementRunner.run(ThreadLeakControl.java:368)
	at com.carrotsearch.randomizedtesting.ThreadLeakControl.forkTimeoutingTask(ThreadLeakControl.java:817)
	at com.carrotsearch.randomizedtesting.ThreadLeakControl$3.evaluate(ThreadLeakControl.java:468)
	at com.carrotsearch.randomizedtesting.RandomizedRunner.runSingleTest(RandomizedRunner.java:916)
	at com.carrotsearch.randomizedtesting.RandomizedRunner$5.evaluate(RandomizedRunner.java:802)
	at com.carrotsearch.randomizedtesting.RandomizedRunner$6.evaluate(RandomizedRunner.java:852)
	at com.carrotsearch.randomizedtesting.RandomizedRunner$7.evaluate(RandomizedRunner.java:863)
	at com.carrotsearch.randomizedtesting.rules.StatementAdapter.evaluate(StatementAdapter.java:36)
	at com.carrotsearch.randomizedtesting.rules.SystemPropertiesRestoreRule$1.evaluate(SystemPropertiesRestoreRule.java:57)
	at org.apache.lucene.util.AbstractBeforeAfterRule$1.evaluate(AbstractBeforeAfterRule.java:45)
	at com.carrotsearch.randomizedtesting.rules.StatementAdapter.evaluate(StatementAdapter.java:36)
	at org.apache.lucene.util.TestRuleStoreClassName$1.evaluate(TestRuleStoreClassName.java:41)
	at com.carrotsearch.randomizedtesting.rules.NoShadowingOrOverridesOnMethodsRule$1.evaluate(NoShadowingOrOverridesOnMethodsRule.java:40)
	at com.carrotsearch.randomizedtesting.rules.NoShadowingOrOverridesOnMethodsRule$1.evaluate(NoShadowingOrOverridesOnMethodsRule.java:40)
	at com.carrotsearch.randomizedtesting.rules.StatementAdapter.evaluate(StatementAdapter.java:36)
	at com.carrotsearch.randomizedtesting.rules.StatementAdapter.evaluate(StatementAdapter.java:36)
	at com.carrotsearch.randomizedtesting.rules.StatementAdapter.evaluate(StatementAdapter.java:36)
	at org.apache.lucene.util.TestRuleAssertionsRequired$1.evaluate(TestRuleAssertionsRequired.java:53)
	at org.apache.lucene.util.TestRuleMarkFailure$1.evaluate(TestRuleMarkFailure.java:47)
	at org.apache.lucene.util.TestRuleIgnoreAfterMaxFailures$1.evaluate(TestRuleIgnoreAfterMaxFailures.java:64)
	at org.apache.lucene.util.TestRuleIgnoreTestSuites$1.evaluate(TestRuleIgnoreTestSuites.java:54)
	at com.carrotsearch.randomizedtesting.rules.StatementAdapter.evaluate(StatementAdapter.java:36)
	at com.carrotsearch.randomizedtesting.ThreadLeakControl$StatementRunner.run(ThreadLeakControl.java:368)
	at java.lang.Thread.run(Thread.java:748)




Build Log:
[...truncated 11420 lines...]
   [junit4] Suite: org.apache.solr.handler.V2ApiIntegrationTest
   [junit4]   2> Creating dataDir: C:\Users\jenkins\workspace\Lucene-Solr-master-Windows\solr\build\solr-core\test\J1\temp\solr.handler.V2ApiIntegrationTest_1158D582EE1A556C-001\init-core-data-001
   [junit4]   2> 754359 WARN  (SUITE-V2ApiIntegrationTest-seed#[1158D582EE1A556C]-worker) [    ] o.a.s.SolrTestCaseJ4 startTrackingSearchers: numOpens=4 numCloses=4
   [junit4]   2> 754359 INFO  (SUITE-V2ApiIntegrationTest-seed#[1158D582EE1A556C]-worker) [    ] o.a.s.SolrTestCaseJ4 Using PointFields
   [junit4]   2> 754363 INFO  (SUITE-V2ApiIntegrationTest-seed#[1158D582EE1A556C]-worker) [    ] o.a.s.SolrTestCaseJ4 Randomized ssl (true) and clientAuth (false) via: @org.apache.solr.util.RandomizeSSL(reason=, value=NaN, ssl=NaN, clientAuth=NaN)
   [junit4]   2> 754368 INFO  (SUITE-V2ApiIntegrationTest-seed#[1158D582EE1A556C]-worker) [    ] o.a.s.c.MiniSolrCloudCluster Starting cluster of 2 servers in C:\Users\jenkins\workspace\Lucene-Solr-master-Windows\solr\build\solr-core\test\J1\temp\solr.handler.V2ApiIntegrationTest_1158D582EE1A556C-001\tempDir-001
   [junit4]   2> 754368 INFO  (SUITE-V2ApiIntegrationTest-seed#[1158D582EE1A556C]-worker) [    ] o.a.s.c.ZkTestServer STARTING ZK TEST SERVER
   [junit4]   2> 754369 INFO  (Thread-1282) [    ] o.a.s.c.ZkTestServer client port:0.0.0.0/0.0.0.0:0
   [junit4]   2> 754369 INFO  (Thread-1282) [    ] o.a.s.c.ZkTestServer Starting server
   [junit4]   2> 754378 ERROR (Thread-1282) [    ] o.a.z.s.ZooKeeperServer ZKShutdownHandler is not registered, so ZooKeeper server won't take any action on ERROR or SHUTDOWN server state changes
   [junit4]   2> 754468 INFO  (SUITE-V2ApiIntegrationTest-seed#[1158D582EE1A556C]-worker) [    ] o.a.s.c.ZkTestServer start zk server on port:50237
   [junit4]   2> 754507 INFO  (jetty-launcher-988-thread-1) [    ] o.e.j.s.Server jetty-9.3.14.v20161028
   [junit4]   2> 754507 INFO  (jetty-launcher-988-thread-2) [    ] o.e.j.s.Server jetty-9.3.14.v20161028
   [junit4]   2> 754508 INFO  (jetty-launcher-988-thread-1) [    ] o.e.j.s.h.ContextHandler Started o.e.j.s.ServletContextHandler@1753def{/solr,null,AVAILABLE}
   [junit4]   2> 754508 INFO  (jetty-launcher-988-thread-2) [    ] o.e.j.s.h.ContextHandler Started o.e.j.s.ServletContextHandler@19899bb{/solr,null,AVAILABLE}
   [junit4]   2> 754514 INFO  (jetty-launcher-988-thread-1) [    ] o.e.j.s.AbstractConnector Started ServerConnector@114ed68{SSL,[ssl, http/1.1]}{127.0.0.1:50241}
   [junit4]   2> 754514 INFO  (jetty-launcher-988-thread-2) [    ] o.e.j.s.AbstractConnector Started ServerConnector@9625d1{SSL,[ssl, http/1.1]}{127.0.0.1:50242}
   [junit4]   2> 754514 INFO  (jetty-launcher-988-thread-1) [    ] o.e.j.s.Server Started @759039ms
   [junit4]   2> 754515 INFO  (jetty-launcher-988-thread-2) [    ] o.e.j.s.Server Started @759039ms
   [junit4]   2> 754515 INFO  (jetty-launcher-988-thread-1) [    ] o.a.s.c.s.e.JettySolrRunner Jetty properties: {hostContext=/solr, hostPort=50241}
   [junit4]   2> 754515 INFO  (jetty-launcher-988-thread-2) [    ] o.a.s.c.s.e.JettySolrRunner Jetty properties: {hostContext=/solr, hostPort=50242}
   [junit4]   2> 754515 ERROR (jetty-launcher-988-thread-2) [    ] o.a.s.s.StartupLoggingUtils Missing Java Option solr.log.dir. Logging may be missing or incomplete.
   [junit4]   2> 754515 ERROR (jetty-launcher-988-thread-1) [    ] o.a.s.s.StartupLoggingUtils Missing Java Option solr.log.dir. Logging may be missing or incomplete.
   [junit4]   2> 754515 INFO  (jetty-launcher-988-thread-2) [    ] o.a.s.s.SolrDispatchFilter  ___      _       Welcome to Apache Solr™ version 7.0.0
   [junit4]   2> 754515 INFO  (jetty-launcher-988-thread-1) [    ] o.a.s.s.SolrDispatchFilter  ___      _       Welcome to Apache Solr™ version 7.0.0
   [junit4]   2> 754515 INFO  (jetty-launcher-988-thread-2) [    ] o.a.s.s.SolrDispatchFilter / __| ___| |_ _   Starting in cloud mode on port null
   [junit4]   2> 754516 INFO  (jetty-launcher-988-thread-2) [    ] o.a.s.s.SolrDispatchFilter \__ \/ _ \ | '_|  Install dir: null
   [junit4]   2> 754516 INFO  (jetty-launcher-988-thread-1) [    ] o.a.s.s.SolrDispatchFilter / __| ___| |_ _   Starting in cloud mode on port null
   [junit4]   2> 754516 INFO  (jetty-launcher-988-thread-2) [    ] o.a.s.s.SolrDispatchFilter |___/\___/_|_|    Start time: 2017-06-17T15:37:29.405Z
   [junit4]   2> 754516 INFO  (jetty-launcher-988-thread-1) [    ] o.a.s.s.SolrDispatchFilter \__ \/ _ \ | '_|  Install dir: null
   [junit4]   2> 754516 INFO  (jetty-launcher-988-thread-1) [    ] o.a.s.s.SolrDispatchFilter |___/\___/_|_|    Start time: 2017-06-17T15:37:29.405Z
   [junit4]   2> 754522 INFO  (jetty-launcher-988-thread-1) [    ] o.a.s.s.SolrDispatchFilter solr.xml found in ZooKeeper. Loading...
   [junit4]   2> 754522 INFO  (jetty-launcher-988-thread-2) [    ] o.a.s.s.SolrDispatchFilter solr.xml found in ZooKeeper. Loading...
   [junit4]   2> 754541 WARN  (NIOServerCxn.Factory:0.0.0.0/0.0.0.0:0) [    ] o.a.z.s.NIOServerCnxn caught end of stream exception
   [junit4]   2> EndOfStreamException: Unable to read additional data from client sessionid 0x15cb6b3b3b20001, likely client has closed socket
   [junit4]   2> 	at org.apache.zookeeper.server.NIOServerCnxn.doIO(NIOServerCnxn.java:239)
   [junit4]   2> 	at org.apache.zookeeper.server.NIOServerCnxnFactory.run(NIOServerCnxnFactory.java:203)
   [junit4]   2> 	at java.lang.Thread.run(Thread.java:748)
   [junit4]   2> 754548 INFO  (jetty-launcher-988-thread-1) [    ] o.a.s.c.ZkContainer Zookeeper client=127.0.0.1:50237/solr
   [junit4]   2> 754549 INFO  (jetty-launcher-988-thread-2) [    ] o.a.s.c.ZkContainer Zookeeper client=127.0.0.1:50237/solr
   [junit4]   2> 754554 WARN  (NIOServerCxn.Factory:0.0.0.0/0.0.0.0:0) [    ] o.a.z.s.NIOServerCnxn caught end of stream exception
   [junit4]   2> EndOfStreamException: Unable to read additional data from client sessionid 0x15cb6b3b3b20004, likely client has closed socket
   [junit4]   2> 	at org.apache.zookeeper.server.NIOServerCnxn.doIO(NIOServerCnxn.java:239)
   [junit4]   2> 	at org.apache.zookeeper.server.NIOServerCnxnFactory.run(NIOServerCnxnFactory.java:203)
   [junit4]   2> 	at java.lang.Thread.run(Thread.java:748)
   [junit4]   2> 754589 INFO  (jetty-launcher-988-thread-2) [n:127.0.0.1:50242_solr    ] o.a.s.c.Overseer Overseer (id=null) closing
   [junit4]   2> 754590 INFO  (jetty-launcher-988-thread-1) [n:127.0.0.1:50241_solr    ] o.a.s.c.Overseer Overseer (id=null) closing
   [junit4]   2> 754591 INFO  (jetty-launcher-988-thread-2) [n:127.0.0.1:50242_solr    ] o.a.s.c.OverseerElectionContext I am going to be the leader 127.0.0.1:50242_solr
   [junit4]   2> 754592 INFO  (jetty-launcher-988-thread-1) [n:127.0.0.1:50241_solr    ] o.a.s.c.ZkController Register node as live in ZooKeeper:/live_nodes/127.0.0.1:50241_solr
   [junit4]   2> 754593 INFO  (jetty-launcher-988-thread-2) [n:127.0.0.1:50242_solr    ] o.a.s.c.Overseer Overseer (id=98154174825496582-127.0.0.1:50242_solr-n_0000000000) starting
   [junit4]   2> 754597 INFO  (zkCallback-999-thread-1-processing-n:127.0.0.1:50241_solr) [n:127.0.0.1:50241_solr    ] o.a.s.c.c.ZkStateReader Updated live nodes from ZooKeeper... (0) -> (1)
   [junit4]   2> 754597 INFO  (zkCallback-1000-thread-1-processing-n:127.0.0.1:50242_solr) [n:127.0.0.1:50242_solr    ] o.a.s.c.c.ZkStateReader Updated live nodes from ZooKeeper... (0) -> (1)
   [junit4]   2> 754603 INFO  (jetty-launcher-988-thread-2) [n:127.0.0.1:50242_solr    ] o.a.s.c.ZkController Register node as live in ZooKeeper:/live_nodes/127.0.0.1:50242_solr
   [junit4]   2> 754609 INFO  (zkCallback-999-thread-1-processing-n:127.0.0.1:50241_solr) [n:127.0.0.1:50241_solr    ] o.a.s.c.c.ZkStateReader Updated live nodes from ZooKeeper... (1) -> (2)
   [junit4]   2> 754609 INFO  (OverseerStateUpdate-98154174825496582-127.0.0.1:50242_solr-n_0000000000) [n:127.0.0.1:50242_solr    ] o.a.s.c.c.ZkStateReader Updated live nodes from ZooKeeper... (1) -> (2)
   [junit4]   2> 754883 INFO  (jetty-launcher-988-thread-1) [n:127.0.0.1:50241_solr    ] o.a.s.m.r.SolrJmxReporter JMX monitoring for 'solr_50241.solr.node' (registry 'solr.node') enabled at server: com.sun.jmx.mbeanserver.JmxMBeanServer@619f7b
   [junit4]   2> 754888 INFO  (jetty-launcher-988-thread-2) [n:127.0.0.1:50242_solr    ] o.a.s.m.r.SolrJmxReporter JMX monitoring for 'solr_50242.solr.node' (registry 'solr.node') enabled at server: com.sun.jmx.mbeanserver.JmxMBeanServer@619f7b
   [junit4]   2> 754892 INFO  (jetty-launcher-988-thread-1) [n:127.0.0.1:50241_solr    ] o.a.s.m.r.SolrJmxReporter JMX monitoring for 'solr_50241.solr.jvm' (registry 'solr.jvm') enabled at server: com.sun.jmx.mbeanserver.JmxMBeanServer@619f7b
   [junit4]   2> 754892 INFO  (jetty-launcher-988-thread-1) [n:127.0.0.1:50241_solr    ] o.a.s.m.r.SolrJmxReporter JMX monitoring for 'solr_50241.solr.jetty' (registry 'solr.jetty') enabled at server: com.sun.jmx.mbeanserver.JmxMBeanServer@619f7b
   [junit4]   2> 754894 INFO  (jetty-launcher-988-thread-1) [n:127.0.0.1:50241_solr    ] o.a.s.c.CorePropertiesLocator Found 0 core definitions underneath C:\Users\jenkins\workspace\Lucene-Solr-master-Windows\solr\build\solr-core\test\J1\temp\solr.handler.V2ApiIntegrationTest_1158D582EE1A556C-001\tempDir-001\node2\.
   [junit4]   2> 754895 INFO  (jetty-launcher-988-thread-2) [n:127.0.0.1:50242_solr    ] o.a.s.m.r.SolrJmxReporter JMX monitoring for 'solr_50242.solr.jvm' (registry 'solr.jvm') enabled at server: com.sun.jmx.mbeanserver.JmxMBeanServer@619f7b
   [junit4]   2> 754895 INFO  (jetty-launcher-988-thread-2) [n:127.0.0.1:50242_solr    ] o.a.s.m.r.SolrJmxReporter JMX monitoring for 'solr_50242.solr.jetty' (registry 'solr.jetty') enabled at server: com.sun.jmx.mbeanserver.JmxMBeanServer@619f7b
   [junit4]   2> 754897 INFO  (jetty-launcher-988-thread-2) [n:127.0.0.1:50242_solr    ] o.a.s.c.CorePropertiesLocator Found 0 core definitions underneath C:\Users\jenkins\workspace\Lucene-Solr-master-Windows\solr\build\solr-core\test\J1\temp\solr.handler.V2ApiIntegrationTest_1158D582EE1A556C-001\tempDir-001\node1\.
   [junit4]   2> 754978 INFO  (SUITE-V2ApiIntegrationTest-seed#[1158D582EE1A556C]-worker) [    ] o.a.s.c.c.ZkStateReader Updated live nodes from ZooKeeper... (0) -> (2)
   [junit4]   2> 754983 INFO  (SUITE-V2ApiIntegrationTest-seed#[1158D582EE1A556C]-worker) [    ] o.a.s.c.s.i.ZkClientClusterStateProvider Cluster at 127.0.0.1:50237/solr ready
   [junit4]   2> 755060 INFO  (qtp11109482-6498) [n:127.0.0.1:50241_solr    ] o.a.s.h.a.CollectionsHandler Invoked Collection Action :create with params replicationFactor=2&collection.configName=conf1&name=collection1&nrtReplicas=2&action=CREATE&numShards=1&wt=javabin&version=2 and sendToOCPQueue=true
   [junit4]   2> 755063 INFO  (OverseerThreadFactory-2783-thread-1-processing-n:127.0.0.1:50242_solr) [n:127.0.0.1:50242_solr    ] o.a.s.c.CreateCollectionCmd Create collection collection1
   [junit4]   2> 755188 INFO  (qtp11109482-6493) [n:127.0.0.1:50241_solr    ] o.a.s.h.a.CoreAdminOperation core create command qt=/admin/cores&collection.configName=conf1&newCollection=true&name=collection1_shard1_replica_n1&action=CREATE&numShards=1&collection=collection1&shard=shard1&wt=javabin&version=2&replicaType=NRT
   [junit4]   2> 755189 INFO  (qtp11109482-6493) [n:127.0.0.1:50241_solr    ] o.a.s.c.TransientSolrCoreCacheDefault Allocating transient cache for 2147483647 transient cores
   [junit4]   2> 755239 INFO  (qtp25012041-6500) [n:127.0.0.1:50242_solr    ] o.a.s.h.a.CoreAdminOperation core create command qt=/admin/cores&collection.configName=conf1&newCollection=true&name=collection1_shard1_replica_n2&action=CREATE&numShards=1&collection=collection1&shard=shard1&wt=javabin&version=2&replicaType=NRT
   [junit4]   2> 755241 INFO  (qtp25012041-6500) [n:127.0.0.1:50242_solr    ] o.a.s.c.TransientSolrCoreCacheDefault Allocating transient cache for 2147483647 transient cores
   [junit4]   2> 755349 INFO  (zkCallback-999-thread-1-processing-n:127.0.0.1:50241_solr) [n:127.0.0.1:50241_solr    ] o.a.s.c.c.ZkStateReader A cluster state change: [WatchedEvent state:SyncConnected type:NodeDataChanged path:/collections/collection1/state.json] for collection [collection1] has occurred - updating... (live nodes size: [2])
   [junit4]   2> 755349 INFO  (zkCallback-1000-thread-1-processing-n:127.0.0.1:50242_solr) [n:127.0.0.1:50242_solr    ] o.a.s.c.c.ZkStateReader A cluster state change: [WatchedEvent state:SyncConnected type:NodeDataChanged path:/collections/collection1/state.json] for collection [collection1] has occurred - updating... (live nodes size: [2])
   [junit4]   2> 756227 INFO  (qtp11109482-6493) [n:127.0.0.1:50241_solr c:collection1 s:shard1  x:collection1_shard1_replica_n1] o.a.s.c.SolrConfig Using Lucene MatchVersion: 7.0.0
   [junit4]   2> 756240 INFO  (qtp11109482-6493) [n:127.0.0.1:50241_solr c:collection1 s:shard1  x:collection1_shard1_replica_n1] o.a.s.s.IndexSchema [collection1_shard1_replica_n1] Schema name=minimal
   [junit4]   2> 756246 INFO  (qtp11109482-6493) [n:127.0.0.1:50241_solr c:collection1 s:shard1  x:collection1_shard1_replica_n1] o.a.s.s.IndexSchema Loaded schema minimal/1.1 with uniqueid field id
   [junit4]   2> 756246 INFO  (qtp11109482-6493) [n:127.0.0.1:50241_solr c:collection1 s:shard1  x:collection1_shard1_replica_n1] o.a.s.c.CoreContainer Creating SolrCore 'collection1_shard1_replica_n1' using configuration from collection collection1, trusted=true
   [junit4]   2> 756247 INFO  (qtp11109482-6493) [n:127.0.0.1:50241_solr c:collection1 s:shard1  x:collection1_shard1_replica_n1] o.a.s.m.r.SolrJmxReporter JMX monitoring for 'solr_50241.solr.core.collection1.shard1.replica_n1' (registry 'solr.core.collection1.shard1.replica_n1') enabled at server: com.sun.jmx.mbeanserver.JmxMBeanServer@619f7b
   [junit4]   2> 756247 INFO  (qtp11109482-6493) [n:127.0.0.1:50241_solr c:collection1 s:shard1  x:collection1_shard1_replica_n1] o.a.s.c.SolrCore solr.RecoveryStrategy.Builder
   [junit4]   2> 756247 INFO  (qtp11109482-6493) [n:127.0.0.1:50241_solr c:collection1 s:shard1  x:collection1_shard1_replica_n1] o.a.s.c.SolrCore [[collection1_shard1_replica_n1] ] Opening new SolrCore at [C:\Users\jenkins\workspace\Lucene-Solr-master-Windows\solr\build\solr-core\test\J1\temp\solr.handler.V2ApiIntegrationTest_1158D582EE1A556C-001\tempDir-001\node2\collection1_shard1_replica_n1], dataDir=[C:\Users\jenkins\workspace\Lucene-Solr-master-Windows\solr\build\solr-core\test\J1\temp\solr.handler.V2ApiIntegrationTest_1158D582EE1A556C-001\tempDir-001\node2\.\collection1_shard1_replica_n1\data\]
   [junit4]   2> 756270 INFO  (qtp25012041-6500) [n:127.0.0.1:50242_solr c:collection1 s:shard1  x:collection1_shard1_replica_n2] o.a.s.c.SolrConfig Using Lucene MatchVersion: 7.0.0
   [junit4]   2> 756282 INFO  (qtp25012041-6500) [n:127.0.0.1:50242_solr c:collection1 s:shard1  x:collection1_shard1_replica_n2] o.a.s.s.IndexSchema [collection1_shard1_replica_n2] Schema name=minimal
   [junit4]   2> 756285 INFO  (qtp25012041-6500) [n:127.0.0.1:50242_solr c:collection1 s:shard1  x:collection1_shard1_replica_n2] o.a.s.s.IndexSchema Loaded schema minimal/1.1 with uniqueid field id
   [junit4]   2> 756285 INFO  (qtp25012041-6500) [n:127.0.0.1:50242_solr c:collection1 s:shard1  x:collection1_shard1_replica_n2] o.a.s.c.CoreContainer Creating SolrCore 'collection1_shard1_replica_n2' using configuration from collection collection1, trusted=true
   [junit4]   2> 756286 INFO  (qtp25012041-6500) [n:127.0.0.1:50242_solr c:collection1 s:shard1  x:collection1_shard1_replica_n2] o.a.s.m.r.SolrJmxReporter JMX monitoring for 'solr_50242.solr.core.collection1.shard1.replica_n2' (registry 'solr.core.collection1.shard1.replica_n2') enabled at server: com.sun.jmx.mbeanserver.JmxMBeanServer@619f7b
   [junit4]   2> 756286 INFO  (qtp25012041-6500) [n:127.0.0.1:50242_solr c:collection1 s:shard1  x:collection1_shard1_replica_n2] o.a.s.c.SolrCore solr.RecoveryStrategy.Builder
   [junit4]   2> 756286 INFO  (qtp25012041-6500) [n:127.0.0.1:50242_solr c:collection1 s:shard1  x:collection1_shard1_replica_n2] o.a.s.c.SolrCore [[collection1_shard1_replica_n2] ] Opening new SolrCore at [C:\Users\jenkins\workspace\Lucene-Solr-master-Windows\solr\build\solr-core\test\J1\temp\solr.handler.V2ApiIntegrationTest_1158D582EE1A556C-001\tempDir-001\node1\collection1_shard1_replica_n2], dataDir=[C:\Users\jenkins\workspace\Lucene-Solr-master-Windows\solr\build\solr-core\test\J1\temp\solr.handler.V2ApiIntegrationTest_1158D582EE1A556C-001\tempDir-001\node1\.\collection1_shard1_replica_n2\data\]
   [junit4]   2> 756455 INFO  (qtp11109482-6493) [n:127.0.0.1:50241_solr c:collection1 s:shard1  x:collection1_shard1_replica_n1] o.a.s.u.UpdateHandler Using UpdateLog implementation: org.apache.solr.update.UpdateLog
   [junit4]   2> 756455 INFO  (qtp11109482-6493) [n:127.0.0.1:50241_solr c:collection1 s:shard1  x:collection1_shard1_replica_n1] o.a.s.u.UpdateLog Initializing UpdateLog: dataDir=null defaultSyncLevel=FLUSH numRecordsToKeep=100 maxNumLogsToKeep=10 numVersionBuckets=65536
   [junit4]   2> 756459 INFO  (qtp11109482-6493) [n:127.0.0.1:50241_solr c:collection1 s:shard1  x:collection1_shard1_replica_n1] o.a.s.u.CommitTracker Hard AutoCommit: disabled
   [junit4]   2> 756459 INFO  (qtp11109482-6493) [n:127.0.0.1:50241_solr c:collection1 s:shard1  x:collection1_shard1_replica_n1] o.a.s.u.CommitTracker Soft AutoCommit: disabled
   [junit4]   2> 756460 INFO  (qtp25012041-6500) [n:127.0.0.1:50242_solr c:collection1 s:shard1  x:collection1_shard1_replica_n2] o.a.s.u.UpdateHandler Using UpdateLog implementation: org.apache.solr.update.UpdateLog
   [junit4]   2> 756460 INFO  (qtp25012041-6500) [n:127.0.0.1:50242_solr c:collection1 s:shard1  x:collection1_shard1_replica_n2] o.a.s.u.UpdateLog Initializing UpdateLog: dataDir=null defaultSyncLevel=FLUSH numRecordsToKeep=100 maxNumLogsToKeep=10 numVersionBuckets=65536
   [junit4]   2> 756463 INFO  (qtp25012041-6500) [n:127.0.0.1:50242_solr c:collection1 s:shard1  x:collection1_shard1_replica_n2] o.a.s.u.CommitTracker Hard AutoCommit: disabled
   [junit4]   2> 756463 INFO  (qtp25012041-6500) [n:127.0.0.1:50242_solr c:collection1 s:shard1  x:collection1_shard1_replica_n2] o.a.s.u.CommitTracker Soft AutoCommit: disabled
   [junit4]   2> 756464 INFO  (qtp11109482-6493) [n:127.0.0.1:50241_solr c:collection1 s:shard1  x:collection1_shard1_replica_n1] o.a.s.s.SolrIndexSearcher Opening [Searcher@1d2cb7c[collection1_shard1_replica_n1] main]
   [junit4]   2> 756465 INFO  (qtp25012041-6500) [n:127.0.0.1:50242_solr c:collection1 s:shard1  x:collection1_shard1_replica_n2] o.a.s.s.SolrIndexSearcher Opening [Searcher@1ad6463[collection1_shard1_replica_n2] main]
   [junit4]   2> 756466 INFO  (qtp11109482-6493) [n:127.0.0.1:50241_solr c:collection1 s:shard1  x:collection1_shard1_replica_n1] o.a.s.r.ManagedResourceStorage Configured ZooKeeperStorageIO with znodeBase: /configs/conf1
   [junit4]   2> 756467 INFO  (qtp25012041-6500) [n:127.0.0.1:50242_solr c:collection1 s:shard1  x:collection1_shard1_replica_n2] o.a.s.r.ManagedResourceStorage Configured ZooKeeperStorageIO with znodeBase: /configs/conf1
   [junit4]   2> 756468 INFO  (qtp25012041-6500) [n:127.0.0.1:50242_solr c:collection1 s:shard1  x:collection1_shard1_replica_n2] o.a.s.r.ManagedResourceStorage Loaded null at path _rest_managed.json using ZooKeeperStorageIO:path=/configs/conf1
   [junit4]   2> 756468 INFO  (qtp11109482-6493) [n:127.0.0.1:50241_solr c:collection1 s:shard1  x:collection1_shard1_replica_n1] o.a.s.r.ManagedResourceStorage Loaded null at path _rest_managed.json using ZooKeeperStorageIO:path=/configs/conf1
   [junit4]   2> 756468 INFO  (qtp25012041-6500) [n:127.0.0.1:50242_solr c:collection1 s:shard1  x:collection1_shard1_replica_n2] o.a.s.s.ZkIndexSchemaReader Creating ZooKeeper watch for the managed schema at /configs/conf1/managed-schema
   [junit4]   2> 756468 INFO  (qtp11109482-6493) [n:127.0.0.1:50241_solr c:collection1 s:shard1  x:collection1_shard1_replica_n1] o.a.s.s.ZkIndexSchemaReader Creating ZooKeeper watch for the managed schema at /configs/conf1/managed-schema
   [junit4]   2> 756470 INFO  (qtp25012041-6500) [n:127.0.0.1:50242_solr c:collection1 s:shard1  x:collection1_shard1_replica_n2] o.a.s.s.ZkIndexSchemaReader Current schema version 0 is already the latest
   [junit4]   2> 756477 INFO  (qtp11109482-6493) [n:127.0.0.1:50241_solr c:collection1 s:shard1  x:collection1_shard1_replica_n1] o.a.s.s.ZkIndexSchemaReader Current schema version 0 is already the latest
   [junit4]   2> 756478 INFO  (qtp25012041-6500) [n:127.0.0.1:50242_solr c:collection1 s:shard1  x:collection1_shard1_replica_n2] o.a.s.h.ReplicationHandler Commits will be reserved for  10000
   [junit4]   2> 756478 INFO  (qtp11109482-6493) [n:127.0.0.1:50241_solr c:collection1 s:shard1  x:collection1_shard1_replica_n1] o.a.s.h.ReplicationHandler Commits will be reserved for  10000
   [junit4]   2> 756478 INFO  (qtp25012041-6500) [n:127.0.0.1:50242_solr c:collection1 s:shard1  x:collection1_shard1_replica_n2] o.a.s.u.UpdateLog Could not find max version in index or recent updates, using new clock 1570466799411003392
   [junit4]   2> 756478 INFO  (qtp11109482-6493) [n:127.0.0.1:50241_solr c:collection1 s:shard1  x:collection1_shard1_replica_n1] o.a.s.u.UpdateLog Could not find max version in index or recent updates, using new clock 1570466799411003392
   [junit4]   2> 756483 INFO  (searcherExecutor-2788-thread-1-processing-n:127.0.0.1:50241_solr x:collection1_shard1_replica_n1 s:shard1 c:collection1) [n:127.0.0.1:50241_solr c:collection1 s:shard1  x:collection1_shard1_replica_n1] o.a.s.c.SolrCore [collection1_shard1_replica_n1] Registered new searcher Searcher@1d2cb7c[collection1_shard1_replica_n1] main{ExitableDirectoryReader(UninvertingDirectoryReader())}
   [junit4]   2> 756485 INFO  (searcherExecutor-2789-thread-1-processing-n:127.0.0.1:50242_solr x:collection1_shard1_replica_n2 s:shard1 c:collection1) [n:127.0.0.1:50242_solr c:collection1 s:shard1  x:collection1_shard1_replica_n2] o.a.s.c.SolrCore [collection1_shard1_replica_n2] Registered new searcher Searcher@1ad6463[collection1_shard1_replica_n2] main{ExitableDirectoryReader(UninvertingDirectoryReader())}
   [junit4]   2> 756495 INFO  (qtp25012041-6500) [n:127.0.0.1:50242_solr c:collection1 s:shard1  x:collection1_shard1_replica_n2] o.a.s.c.ShardLeaderElectionContext Enough replicas found to continue.
   [junit4]   2> 756495 INFO  (qtp25012041-6500) [n:127.0.0.1:50242_solr c:collection1 s:shard1  x:collection1_shard1_replica_n2] o.a.s.c.ShardLeaderElectionContext I may be the new leader - try and sync
   [junit4]   2> 756496 INFO  (qtp25012041-6500) [n:127.0.0.1:50242_solr c:collection1 s:shard1  x:collection1_shard1_replica_n2] o.a.s.c.SyncStrategy Sync replicas to https://127.0.0.1:50242/solr/collection1_shard1_replica_n2/
   [junit4]   2> 756496 INFO  (qtp25012041-6500) [n:127.0.0.1:50242_solr c:collection1 s:shard1  x:collection1_shard1_replica_n2] o.a.s.u.PeerSync PeerSync: core=collection1_shard1_replica_n2 url=https://127.0.0.1:50242/solr START replicas=[https://127.0.0.1:50241/solr/collection1_shard1_replica_n1/] nUpdates=100
   [junit4]   2> 756497 INFO  (qtp25012041-6500) [n:127.0.0.1:50242_solr c:collection1 s:shard1  x:collection1_shard1_replica_n2] o.a.s.u.PeerSync PeerSync: core=collection1_shard1_replica_n2 url=https://127.0.0.1:50242/solr DONE.  We have no versions.  sync failed.
   [junit4]   2> 756509 INFO  (qtp11109482-6499) [n:127.0.0.1:50241_solr c:collection1 s:shard1 r:core_node1 x:collection1_shard1_replica_n1] o.a.s.c.S.Request [collection1_shard1_replica_n1]  webapp=/solr path=/get params={distrib=false&qt=/get&fingerprint=false&getVersions=100&wt=javabin&version=2} status=0 QTime=0
   [junit4]   2> 756510 INFO  (qtp25012041-6500) [n:127.0.0.1:50242_solr c:collection1 s:shard1  x:collection1_shard1_replica_n2] o.a.s.c.SyncStrategy Leader's attempt to sync with shard failed, moving to the next candidate
   [junit4]   2> 756510 INFO  (qtp25012041-6500) [n:127.0.0.1:50242_solr c:collection1 s:shard1  x:collection1_shard1_replica_n2] o.a.s.c.ShardLeaderElectionContext We failed sync, but we have no versions - we can't sync in that case - we were active before, so become leader anyway
   [junit4]   2> 756510 INFO  (qtp25012041-6500) [n:127.0.0.1:50242_solr c:collection1 s:shard1  x:collection1_shard1_replica_n2] o.a.s.c.ShardLeaderElectionContext Found all replicas participating in election, clear LIR
   [junit4]   2> 756517 INFO  (qtp25012041-6500) [n:127.0.0.1:50242_solr c:collection1 s:shard1  x:collection1_shard1_replica_n2] o.a.s.c.ShardLeaderElectionContext I am the new leader: https://127.0.0.1:50242/solr/collection1_shard1_replica_n2/ shard1
   [junit4]   2> 756625 INFO  (zkCallback-999-thread-1-processing-n:127.0.0.1:50241_solr) [n:127.0.0.1:50241_solr    ] o.a.s.c.c.ZkStateReader A cluster state change: [WatchedEvent state:SyncConnected type:NodeDataChanged path:/collections/collection1/state.json] for collection [collection1] has occurred - updating... (live nodes size: [2])
   [junit4]   2> 756625 INFO  (zkCallback-1000-thread-1-processing-n:127.0.0.1:50242_solr) [n:127.0.0.1:50242_solr    ] o.a.s.c.c.ZkStateReader A cluster state change: [WatchedEvent state:SyncConnected type:NodeDataChanged path:/collections/collection1/state.json] for collection [collection1] has occurred - updating... (live nodes size: [2])
   [junit4]   2> 756672 INFO  (qtp25012041-6500) [n:127.0.0.1:50242_solr c:collection1 s:shard1  x:collection1_shard1_replica_n2] o.a.s.c.ZkController I am the leader, no recovery necessary
   [junit4]   2> 756677 INFO  (qtp25012041-6500) [n:127.0.0.1:50242_solr c:collection1 s:shard1  x:collection1_shard1_replica_n2] o.a.s.s.HttpSolrCall [admin] webapp=null path=/admin/cores params={qt=/admin/cores&collection.configName=conf1&newCollection=true&name=collection1_shard1_replica_n2&action=CREATE&numShards=1&collection=collection1&shard=shard1&wt=javabin&version=2&replicaType=NRT} status=0 QTime=1438
   [junit4]   2> 756780 INFO  (zkCallback-1000-thread-1-processing-n:127.0.0.1:50242_solr) [n:127.0.0.1:50242_solr    ] o.a.s.c.c.ZkStateReader A cluster state change: [WatchedEvent state:SyncConnected type:NodeDataChanged path:/collections/collection1/state.json] for collection [collection1] has occurred - updating... (live nodes size: [2])
   [junit4]   2> 756780 INFO  (zkCallback-999-thread-1-processing-n:127.0.0.1:50241_solr) [n:127.0.0.1:50241_solr    ] o.a.s.c.c.ZkStateReader A cluster state change: [WatchedEvent state:SyncConnected type:NodeDataChanged path:/collections/collection1/state.json] for collection [collection1] has occurred - updating... (live nodes size: [2])
   [junit4]   2> 757500 INFO  (qtp11109482-6493) [n:127.0.0.1:50241_solr c:collection1 s:shard1  x:collection1_shard1_replica_n1] o.a.s.s.HttpSolrCall [admin] webapp=null path=/admin/cores params={qt=/admin/cores&collection.configName=conf1&newCollection=true&name=collection1_shard1_replica_n1&action=CREATE&numShards=1&collection=collection1&shard=shard1&wt=javabin&version=2&replicaType=NRT} status=0 QTime=2311
   [junit4]   2> 757506 INFO  (qtp11109482-6498) [n:127.0.0.1:50241_solr    ] o.a.s.h.a.CollectionsHandler Wait for new collection to be active for at most 30 seconds. Check all shard replicas
   [junit4]   2> 757604 INFO  (zkCallback-999-thread-1-processing-n:127.0.0.1:50241_solr) [n:127.0.0.1:50241_solr    ] o.a.s.c.c.ZkStateReader A cluster state change: [WatchedEvent state:SyncConnected type:NodeDataChanged path:/collections/collection1/state.json] for collection [collection1] has occurred - updating... (live nodes size: [2])
   [junit4]   2> 757604 INFO  (zkCallback-1000-thread-1-processing-n:127.0.0.1:50242_solr) [n:127.0.0.1:50242_solr    ] o.a.s.c.c.ZkStateReader A cluster state change: [WatchedEvent state:SyncConnected type:NodeDataChanged path:/collections/collection1/state.json] for collection [collection1] has occurred - updating... (live nodes size: [2])
   [junit4]   2> 758509 INFO  (qtp11109482-6498) [n:127.0.0.1:50241_solr    ] o.a.s.s.HttpSolrCall [admin] webapp=null path=/admin/collections params={replicationFactor=2&collection.configName=conf1&name=collection1&nrtReplicas=2&action=CREATE&numShards=1&wt=javabin&version=2} status=0 QTime=3448
   [junit4]   2> 758527 INFO  (TEST-V2ApiIntegrationTest.testIntrospect-seed#[1158D582EE1A556C]) [    ] o.a.s.SolrTestCaseJ4 ###Starting testIntrospect
   [junit4]   2> 758555 INFO  (TEST-V2ApiIntegrationTest.testIntrospect-seed#[1158D582EE1A556C]) [    ] o.a.s.SolrTestCaseJ4 ###Ending testIntrospect
   [junit4]   2> 758594 INFO  (TEST-V2ApiIntegrationTest.testSetPropertyValidationOfCluster-seed#[1158D582EE1A556C]) [    ] o.a.s.SolrTestCaseJ4 ###Starting testSetPropertyValidationOfCluster
   [junit4]   2> 758619 INFO  (qtp11109482-6495) [n:127.0.0.1:50241_solr    ] o.a.s.s.HttpSolrCall [admin] webapp=null path=/cluster params={wt=javabin&version=2} status=0 QTime=9
   [junit4]   2> 758623 INFO  (qtp25012041-6502) [n:127.0.0.1:50242_solr    ] o.a.s.s.HttpSolrCall [admin] webapp=null path=/cluster params={wt=javabin&version=2} status=0 QTime=3
   [junit4]   2> 758626 INFO  (TEST-V2ApiIntegrationTest.testSetPropertyValidationOfCluster-seed#[1158D582EE1A556C]) [    ] o.a.s.SolrTestCaseJ4 ###Ending testSetPropertyValidationOfCluster
   [junit4]   2> 758639 INFO  (TEST-V2ApiIntegrationTest.testCollectionsApi-seed#[1158D582EE1A556C]) [    ] o.a.s.SolrTestCaseJ4 ###Starting testCollectionsApi
   [junit4]   2> 758655 INFO  (TEST-V2ApiIntegrationTest.testCollectionsApi-seed#[1158D582EE1A556C]) [    ] o.a.s.SolrTestCaseJ4 ###Ending testCollectionsApi
   [junit4]   2> NOTE: reproduce with: ant test  -Dtestcase=V2ApiIntegrationTest -Dtests.method=testCollectionsApi -Dtests.seed=1158D582EE1A556C -Dtests.slow=true -Dtests.locale=sl-SI -Dtests.timezone=America/Nipigon -Dtests.asserts=true -Dtests.file.encoding=UTF-8
   [junit4] ERROR   0.03s J1 | V2ApiIntegrationTest.testCollectionsApi <<<
   [junit4]    > Throwable #1: org.apache.solr.client.solrj.impl.HttpSolrClient$RemoteSolrException: Error from server at https://127.0.0.1:50242/solr: Expected mime type application/octet-stream but got text/html. <html>
   [junit4]    > <head>
   [junit4]    > <meta http-equiv="Content-Type" content="text/html;charset=ISO-8859-1"/>
   [junit4]    > <title>Error 400 </title>
   [junit4]    > </head>
   [junit4]    > <body>
   [junit4]    > <h2>HTTP ERROR: 400</h2>
   [junit4]    > <p>Problem accessing /solr/____v2/c. Reason:
   [junit4]    > <pre>    {metadata={error-class=org.apache.solr.common.SolrException,root-error-class=java.nio.file.InvalidPathException},msg=java.nio.file.InvalidPathException: Illegal char &lt;?&gt; at index 53: C:UsersjenkinsworkspaceLucene-Solr-master-Windowssolr?uildsolr-core	estJ1	empsolr.handler.V2ApiIntegrationTest_1158D582EE1A556C-001	empDir-002,code=400}</pre></p>
   [junit4]    > <hr /><a href="http://eclipse.org/jetty">Powered by Jetty:// 9.3.14.v20161028</a><hr/>
   [junit4]    > </body>
   [junit4]    > </html>
   [junit4]    > 	at __randomizedtesting.SeedInfo.seed([1158D582EE1A556C:CDC63203560331D2]:0)
   [junit4]    > 	at org.apache.solr.client.solrj.impl.HttpSolrClient.executeMethod(HttpSolrClient.java:563)
   [junit4]    > 	at org.apache.solr.client.solrj.impl.HttpSolrClient.request(HttpSolrClient.java:231)
   [junit4]    > 	at org.apache.solr.client.solrj.impl.HttpSolrClient.request(HttpSolrClient.java:220)
   [junit4]    > 	at org.apache.solr.client.solrj.impl.LBHttpSolrClient.doRequest(LBHttpSolrClient.java:459)
   [junit4]    > 	at org.apache.solr.client.solrj.impl.LBHttpSolrClient.request(LBHttpSolrClient.java:389)
   [junit4]    > 	at org.apache.solr.client.solrj.impl.CloudSolrClient.sendRequest(CloudSolrClient.java:1135)
   [junit4]    > 	at org.apache.solr.client.solrj.impl.CloudSolrClient.requestWithRetryOnStaleState(CloudSolrClient.java:876)
   [junit4]    > 	at org.apache.solr.client.solrj.impl.CloudSolrClient.request(CloudSolrClient.java:807)
   [junit4]    > 	at org.apache.solr.client.solrj.SolrClient.request(SolrClient.java:1219)
   [junit4]    > 	at org.apache.solr.handler.V2ApiIntegrationTest.testCollectionsApi(V2ApiIntegrationTest.java:97)
   [junit4]    > 	at java.lang.Thread.run(Thread.java:748)
   [junit4]   2> 758677 INFO  (TEST-V2ApiIntegrationTest.testWelcomeMessage-seed#[1158D582EE1A556C]) [    ] o.a.s.SolrTestCaseJ4 ###Starting testWelcomeMessage
   [junit4]   2> 758678 INFO  (qtp11109482-6501) [n:127.0.0.1:50241_solr    ] o.a.s.s.HttpSolrCall [admin] webapp=null path=/ params={wt=javabin&version=2} status=0 QTime=0
   [junit4]   2> 758680 INFO  (qtp25012041-6494) [n:127.0.0.1:50242_solr    ] o.a.s.s.HttpSolrCall [admin] webapp=null path=/_introspect params={wt=javabin&version=2} status=0 QTime=0
   [junit4]   2> 758681 INFO  (TEST-V2ApiIntegrationTest.testWelcomeMessage-seed#[1158D582EE1A556C]) [    ] o.a.s.SolrTestCaseJ4 ###Ending testWelcomeMessage
   [junit4]   2> 758700 INFO  (TEST-V2ApiIntegrationTest.testSingleWarning-seed#[1158D582EE1A556C]) [    ] o.a.s.SolrTestCaseJ4 ###Starting testSingleWarning
   [junit4]   2> 758713 INFO  (TEST-V2ApiIntegrationTest.testSingleWarning-seed#[1158D582EE1A556C]) [    ] o.a.s.SolrTestCaseJ4 ###Ending testSingleWarning
   [junit4]   2> 758715 WARN  (NIOServerCxn.Factory:0.0.0.0/0.0.0.0:0) [    ] o.a.z.s.NIOServerCnxn caught end of stream exception
   [junit4]   2> EndOfStreamException: Unable to read additional data from client sessionid 0x15cb6b3b3b20008, likely client has closed socket
   [junit4]   2> 	at org.apache.zookeeper.server.NIOServerCnxn.doIO(NIOServerCnxn.java:239)
   [junit4]   2> 	at org.apache.zookeeper.server.NIOServerCnxnFactory.run(NIOServerCnxnFactory.java:203)
   [junit4]   2> 	at java.lang.Thread.run(Thread.java:748)
   [junit4]   2> 758723 INFO  (jetty-closer-989-thread-1) [    ] o.e.j.s.AbstractConnector Stopped ServerConnector@114ed68{SSL,[ssl, http/1.1]}{127.0.0.1:0}
   [junit4]   2> 758724 INFO  (jetty-closer-989-thread-1) [    ] o.a.s.c.CoreContainer Shutting down CoreContainer instance=20551753
   [junit4]   2> 758724 INFO  (jetty-closer-989-thread-1) [    ] o.a.s.m.SolrMetricManager Closing metric reporters for registry=solr.node, tag=null
   [junit4]   2> 758725 INFO  (jetty-closer-989-thread-2) [    ] o.e.j.s.AbstractConnector Stopped ServerConnector@9625d1{SSL,[ssl, http/1.1]}{127.0.0.1:0}
   [junit4]   2> 758725 INFO  (jetty-closer-989-thread-2) [    ] o.a.s.c.CoreContainer Shutting down CoreContainer instance=9255757
   [junit4]   2> 758725 INFO  (jetty-closer-989-thread-2) [    ] o.a.s.m.SolrMetricManager Closing metric reporters for registry=solr.node, tag=null
   [junit4]   2> 758726 INFO  (jetty-closer-989-thread-1) [    ] o.a.s.m.SolrMetricManager Closing metric reporters for registry=solr.jvm, tag=null
   [junit4]   2> 758728 INFO  (jetty-closer-989-thread-2) [    ] o.a.s.m.SolrMetricManager Closing metric reporters for registry=solr.jvm, tag=null
   [junit4]   2> 758730 INFO  (jetty-closer-989-thread-1) [    ] o.a.s.m.SolrMetricManager Closing metric reporters for registry=solr.jetty, tag=null
   [junit4]   2> 758731 INFO  (jetty-closer-989-thread-2) [    ] o.a.s.m.SolrMetricManager Closing metric reporters for registry=solr.jetty, tag=null
   [junit4]   2> 758734 INFO  (jetty-closer-989-thread-1) [    ] o.a.s.m.SolrMetricManager Closing metric reporters for registry=solr.cluster, tag=null
   [junit4]   2> 758736 INFO  (jetty-closer-989-thread-2) [    ] o.a.s.m.SolrMetricManager Closing metric reporters for registry=solr.cluster, tag=null
   [junit4]   2> 758737 INFO  (coreCloseExecutor-2798-thread-1) [n:127.0.0.1:50241_solr c:collection1 s:shard1 r:core_node1 x:collection1_shard1_replica_n1] o.a.s.c.SolrCore [collection1_shard1_replica_n1]  CLOSING SolrCore org.apache.solr.core.SolrCore@105daa1
   [junit4]   2> 758739 INFO  (coreCloseExecutor-2799-thread-1) [n:127.0.0.1:50242_solr c:collection1 s:shard1 r:core_node2 x:collection1_shard1_replica_n2] o.a.s.c.SolrCore [collection1_shard1_replica_n2]  CLOSING SolrCore org.apache.solr.core.SolrCore@1bdd75a
   [junit4]   2> 758742 INFO  (coreCloseExecutor-2799-thread-1) [n:127.0.0.1:50242_solr c:collection1 s:shard1 r:core_node2 x:collection1_shard1_replica_n2] o.a.s.m.SolrMetricManager Closing metric reporters for registry=solr.core.collection1.shard1.replica_n2, tag=29218650
   [junit4]   2> 758747 INFO  (coreCloseExecutor-2798-thread-1) [n:127.0.0.1:50241_solr c:collection1 s:shard1 r:core_node1 x:collection1_shard1_replica_n1] o.a.s.m.SolrMetricManager Closing metric reporters for registry=solr.core.collection1.shard1.replica_n1, tag=17160865
   [junit4]   2> 758751 INFO  (coreCloseExecutor-2799-thread-1) [n:127.0.0.1:50242_solr c:collection1 s:shard1 r:core_node2 x:collection1_shard1_replica_n2] o.a.s.m.SolrMetricManager Closing metric reporters for registry=solr.collection.collection1.shard1.leader, tag=29218650
   [junit4]   2> 758752 INFO  (coreCloseExecutor-2798-thread-1) [n:127.0.0.1:50241_solr c:collection1 s:shard1 r:core_node1 x:collection1_shard1_replica_n1] o.a.s.m.SolrMetricManager Closing metric reporters for registry=solr.collection.collection1.shard1.leader, tag=17160865
   [junit4]   2> 758755 INFO  (jetty-closer-989-thread-2) [    ] o.a.s.c.Overseer Overseer (id=98154174825496582-127.0.0.1:50242_solr-n_0000000000) closing
   [junit4]   2> 758755 INFO  (OverseerStateUpdate-98154174825496582-127.0.0.1:50242_solr-n_0000000000) [n:127.0.0.1:50242_solr    ] o.a.s.c.Overseer Overseer Loop exiting : 127.0.0.1:50242_solr
   [junit4]   2> 758755 WARN  (NIOServerCxn.Factory:0.0.0.0/0.0.0.0:0) [    ] o.a.z.s.NIOServerCnxn caught end of stream exception
   [junit4]   2> EndOfStreamException: Unable to read additional data from client sessionid 0x15cb6b3b3b20005, likely client has closed socket
   [junit4]   2> 	at org.apache.zookeeper.server.NIOServerCnxn.doIO(NIOServerCnxn.java:239)
   [junit4]   2> 	at org.apache.zookeeper.server.NIOServerCnxnFactory.run(NIOServerCnxnFactory.java:203)
   [junit4]   2> 	at java.lang.Thread.run(Thread.java:748)
   [junit4]   2> 758755 WARN  (zkCallback-999-thread-1-processing-n:127.0.0.1:50241_solr) [n:127.0.0.1:50241_solr    ] o.a.s.c.c.ZkStateReader ZooKeeper watch triggered, but Solr cannot talk to ZK: [KeeperErrorCode = Session expired for /live_nodes]
   [junit4]   2> 758757 INFO  (jetty-closer-989-thread-1) [    ] o.e.j.s.h.ContextHandler Stopped o.e.j.s.ServletContextHandler@1753def{/solr,null,UNAVAILABLE}
   [junit4]   2> 758757 INFO  (zkCallback-1000-thread-1-processing-n:127.0.0.1:50242_solr) [n:127.0.0.1:50242_solr    ] o.a.s.c.c.ZkStateReader Updated live nodes from ZooKeeper... (2) -> (1)
   [junit4]   2> 758757 WARN  (zkCallback-1000-thread-1-processing-n:127.0.0.1:50242_solr) [n:127.0.0.1:50242_solr    ] o.a.s.c.c.ZkStateReader ZooKeeper watch triggered, but Solr cannot talk to ZK: [KeeperErrorCode = Session expired for /live_nodes]
   [junit4]   2> 758758 INFO  (jetty-closer-989-thread-2) [    ] o.e.j.s.h.ContextHandler Stopped o.e.j.s.ServletContextHandler@19899bb{/solr,null,UNAVAILABLE}
   [junit4]   2> 758758 ERROR (SUITE-V2ApiIntegrationTest-seed#[1158D582EE1A556C]-worker) [    ] o.a.z.s.ZooKeeperServer ZKShutdownHandler is not registered, so ZooKeeper server won't take any action on ERROR or SHUTDOWN server state changes
   [junit4]   2> 758760 INFO  (SUITE-V2ApiIntegrationTest-seed#[1158D582EE1A556C]-worker) [    ] o.a.s.c.ZkTestServer connecting to 127.0.0.1:50237 50237
   [junit4]   2> 758761 INFO  (Thread-1282) [    ] o.a.s.c.ZkTestServer connecting to 127.0.0.1:50237 50237
   [junit4]   2> 758761 WARN  (Thread-1282) [    ] o.a.s.c.ZkTestServer Watch limit violations: 
   [junit4]   2> Maximum concurrent create/delete watches above limit:
   [junit4]   2> 
   [junit4]   2> 	3	/solr/aliases.json
   [junit4]   2> 	2	/solr/configs/conf1/managed-schema
   [junit4]   2> 	2	/solr/security.json
   [junit4]   2> 	2	/solr/configs/conf1
   [junit4]   2> 
   [junit4]   2> Maximum concurrent data watches above limit:
   [junit4]   2> 
   [junit4]   2> 	3	/solr/clusterstate.json
   [junit4]   2> 	3	/solr/clusterprops.json
   [junit4]   2> 	2	/solr/collections/collection1/state.json
   [junit4]   2> 
   [junit4]   2> Maximum concurrent children watches above limit:
   [junit4]   2> 
   [junit4]   2> 	3	/solr/live_nodes
   [junit4]   2> 	3	/solr/collections
   [junit4]   2> 
   [junit4]   2> NOTE: leaving temporary files on disk at: C:\Users\jenkins\workspace\Lucene-Solr-master-Windows\solr\build\solr-core\test\J1\temp\solr.handler.V2ApiIntegrationTest_1158D582EE1A556C-001
   [junit4]   2> Jun 17, 2017 3:37:33 PM com.carrotsearch.randomizedtesting.ThreadLeakControl checkThreadLeaks
   [junit4]   2> WARNING: Will linger awaiting termination of 4 leaked thread(s).
   [junit4]   2> NOTE: test params are: codec=Asserting(Lucene70): {}, docValues:{}, maxPointsInLeafNode=170, maxMBSortInHeap=5.390404012670204, sim=RandomSimilarity(queryNorm=false): {}, locale=sl-SI, timezone=America/Nipigon
   [junit4]   2> NOTE: Windows 10 10.0 x86/Oracle Corporation 1.8.0_131 (32-bit)/cpus=3,threads=1,free=73010624,total=191283200
   [junit4]   2> NOTE: All tests run in this JVM: [TestNumericTerms32, LoggingHandlerTest, MetricUtilsTest, BlobRepositoryCloudTest, LukeRequestHandlerTest, FileBasedSpellCheckerTest, ChaosMonkeySafeLeaderTest, TestFastWriter, SecurityConfHandlerTest, HLLUtilTest, TestAtomicUpdateErrorCases, QueryParsingTest, TestTrieFacet, UninvertDocValuesMergePolicyTest, TestSearchPerf, BasicAuthIntegrationTest, TestPivotHelperCode, TestComponentsName, DistanceUnitsTest, DistributedIntervalFacetingTest, TestFieldResource, TestClusterStateMutator, DataDrivenBlockJoinTest, CoreAdminCreateDiscoverTest, JvmMetricsTest, OpenCloseCoreStressTest, RegexBoostProcessorTest, CloneFieldUpdateProcessorFactoryTest, TestValueSourceCache, TestFieldCacheWithThreads, AtomicUpdatesTest, TermVectorComponentDistributedTest, TimeZoneUtilsTest, SortByFunctionTest, TestSolrCLIRunExample, TestNumericTokenStream, TestSolrIndexConfig, CollectionStateFormat2Test, TestDistribDocBasedVersion, TestSolrConfigHandler, TestExactStatsCache, HdfsBasicDistributedZkTest, TestConfigSetsAPIExclusivity, HighlighterConfigTest, TestNestedDocsSort, DOMUtilTest, NotRequiredUniqueKeyTest, TestSolrQueryParser, ClassificationUpdateProcessorIntegrationTest, FieldMutatingUpdateProcessorTest, TestHashQParserPlugin, SuggesterWFSTTest, TestSchemaVersionResource, DebugComponentTest, ShardRoutingCustomTest, HdfsDirectoryTest, TestRandomRequestDistribution, TestNoOpRegenerator, SpellCheckCollatorTest, TestEmbeddedSolrServerConstructors, DistributedExpandComponentTest, TestAnalyzeInfixSuggestions, TestSolr4Spatial, BitVectorTest, SolrMetricReporterTest, DistribDocExpirationUpdateProcessorTest, TestRecovery, BasicDistributedZk2Test, SimpleCollectionCreateDeleteTest, SolrCmdDistributorTest, SolrIndexMetricsTest, PreAnalyzedUpdateProcessorTest, TestJettySolrRunner, BigEndianAscendingWordDeserializerTest, TestScoreJoinQPScore, SignatureUpdateProcessorFactoryTest, TestLegacyTerms, BaseCdcrDistributedZkTest, TestInPlaceUpdatesDistrib, LeaderInitiatedRecoveryOnCommitTest, TestDynamicLoading, OverriddenZkACLAndCredentialsProvidersTest, SolrCoreMetricManagerTest, V2ApiIntegrationTest]
   [junit4] Completed [151/725 (1!)] on J1 in 4.95s, 5 tests, 1 error <<< FAILURES!

[...truncated 41296 lines...]

Mime
View raw message