lucene-dev mailing list archives

Site index · List index
Message view « Date » · « Thread »
Top « Date » · « Thread »
From Policeman Jenkins Server <jenk...@thetaphi.de>
Subject [JENKINS-EA] Lucene-Solr-master-Linux (32bit/jdk-9-ea+173) - Build # 19926 - Unstable!
Date Wed, 21 Jun 2017 18:24:25 GMT
Build: https://jenkins.thetaphi.de/job/Lucene-Solr-master-Linux/19926/
Java: 32bit/jdk-9-ea+173 -server -XX:+UseG1GC

8 tests failed.
FAILED:  junit.framework.TestSuite.org.apache.solr.cloud.CdcrVersionReplicationTest

Error Message:
2 threads leaked from SUITE scope at org.apache.solr.cloud.CdcrVersionReplicationTest:     1) Thread[id=13912, name=cdcr-update-log-synchronizer-6406-thread-1, state=WAITING, group=TGRP-CdcrVersionReplicationTest]         at java.base@9-ea/jdk.internal.misc.Unsafe.park(Native Method)         at java.base@9-ea/java.util.concurrent.locks.LockSupport.park(LockSupport.java:194)         at java.base@9-ea/java.util.concurrent.locks.AbstractQueuedSynchronizer$ConditionObject.await(AbstractQueuedSynchronizer.java:2062)         at java.base@9-ea/java.util.concurrent.ScheduledThreadPoolExecutor$DelayedWorkQueue.take(ScheduledThreadPoolExecutor.java:1119)         at java.base@9-ea/java.util.concurrent.ScheduledThreadPoolExecutor$DelayedWorkQueue.take(ScheduledThreadPoolExecutor.java:848)         at java.base@9-ea/java.util.concurrent.ThreadPoolExecutor.getTask(ThreadPoolExecutor.java:1086)         at java.base@9-ea/java.util.concurrent.ThreadPoolExecutor.runWorker(ThreadPoolExecutor.java:1146)         at java.base@9-ea/java.util.concurrent.ThreadPoolExecutor$Worker.run(ThreadPoolExecutor.java:635)         at java.base@9-ea/java.lang.Thread.run(Thread.java:844)    2) Thread[id=13900, name=cdcr-update-log-synchronizer-6400-thread-1, state=WAITING, group=TGRP-CdcrVersionReplicationTest]         at java.base@9-ea/jdk.internal.misc.Unsafe.park(Native Method)         at java.base@9-ea/java.util.concurrent.locks.LockSupport.park(LockSupport.java:194)         at java.base@9-ea/java.util.concurrent.locks.AbstractQueuedSynchronizer$ConditionObject.await(AbstractQueuedSynchronizer.java:2062)         at java.base@9-ea/java.util.concurrent.ScheduledThreadPoolExecutor$DelayedWorkQueue.take(ScheduledThreadPoolExecutor.java:1119)         at java.base@9-ea/java.util.concurrent.ScheduledThreadPoolExecutor$DelayedWorkQueue.take(ScheduledThreadPoolExecutor.java:848)         at java.base@9-ea/java.util.concurrent.ThreadPoolExecutor.getTask(ThreadPoolExecutor.java:1086)         at java.base@9-ea/java.util.concurrent.ThreadPoolExecutor.runWorker(ThreadPoolExecutor.java:1146)         at java.base@9-ea/java.util.concurrent.ThreadPoolExecutor$Worker.run(ThreadPoolExecutor.java:635)         at java.base@9-ea/java.lang.Thread.run(Thread.java:844)

Stack Trace:
com.carrotsearch.randomizedtesting.ThreadLeakError: 2 threads leaked from SUITE scope at org.apache.solr.cloud.CdcrVersionReplicationTest: 
   1) Thread[id=13912, name=cdcr-update-log-synchronizer-6406-thread-1, state=WAITING, group=TGRP-CdcrVersionReplicationTest]
        at java.base@9-ea/jdk.internal.misc.Unsafe.park(Native Method)
        at java.base@9-ea/java.util.concurrent.locks.LockSupport.park(LockSupport.java:194)
        at java.base@9-ea/java.util.concurrent.locks.AbstractQueuedSynchronizer$ConditionObject.await(AbstractQueuedSynchronizer.java:2062)
        at java.base@9-ea/java.util.concurrent.ScheduledThreadPoolExecutor$DelayedWorkQueue.take(ScheduledThreadPoolExecutor.java:1119)
        at java.base@9-ea/java.util.concurrent.ScheduledThreadPoolExecutor$DelayedWorkQueue.take(ScheduledThreadPoolExecutor.java:848)
        at java.base@9-ea/java.util.concurrent.ThreadPoolExecutor.getTask(ThreadPoolExecutor.java:1086)
        at java.base@9-ea/java.util.concurrent.ThreadPoolExecutor.runWorker(ThreadPoolExecutor.java:1146)
        at java.base@9-ea/java.util.concurrent.ThreadPoolExecutor$Worker.run(ThreadPoolExecutor.java:635)
        at java.base@9-ea/java.lang.Thread.run(Thread.java:844)
   2) Thread[id=13900, name=cdcr-update-log-synchronizer-6400-thread-1, state=WAITING, group=TGRP-CdcrVersionReplicationTest]
        at java.base@9-ea/jdk.internal.misc.Unsafe.park(Native Method)
        at java.base@9-ea/java.util.concurrent.locks.LockSupport.park(LockSupport.java:194)
        at java.base@9-ea/java.util.concurrent.locks.AbstractQueuedSynchronizer$ConditionObject.await(AbstractQueuedSynchronizer.java:2062)
        at java.base@9-ea/java.util.concurrent.ScheduledThreadPoolExecutor$DelayedWorkQueue.take(ScheduledThreadPoolExecutor.java:1119)
        at java.base@9-ea/java.util.concurrent.ScheduledThreadPoolExecutor$DelayedWorkQueue.take(ScheduledThreadPoolExecutor.java:848)
        at java.base@9-ea/java.util.concurrent.ThreadPoolExecutor.getTask(ThreadPoolExecutor.java:1086)
        at java.base@9-ea/java.util.concurrent.ThreadPoolExecutor.runWorker(ThreadPoolExecutor.java:1146)
        at java.base@9-ea/java.util.concurrent.ThreadPoolExecutor$Worker.run(ThreadPoolExecutor.java:635)
        at java.base@9-ea/java.lang.Thread.run(Thread.java:844)
	at __randomizedtesting.SeedInfo.seed([25A18B9435646E6C]:0)


FAILED:  junit.framework.TestSuite.org.apache.solr.cloud.CdcrVersionReplicationTest

Error Message:
There are still zombie threads that couldn't be terminated:    1) Thread[id=13912, name=cdcr-update-log-synchronizer-6406-thread-1, state=WAITING, group=TGRP-CdcrVersionReplicationTest]         at java.base@9-ea/jdk.internal.misc.Unsafe.park(Native Method)         at java.base@9-ea/java.util.concurrent.locks.LockSupport.park(LockSupport.java:194)         at java.base@9-ea/java.util.concurrent.locks.AbstractQueuedSynchronizer$ConditionObject.await(AbstractQueuedSynchronizer.java:2062)         at java.base@9-ea/java.util.concurrent.ScheduledThreadPoolExecutor$DelayedWorkQueue.take(ScheduledThreadPoolExecutor.java:1119)         at java.base@9-ea/java.util.concurrent.ScheduledThreadPoolExecutor$DelayedWorkQueue.take(ScheduledThreadPoolExecutor.java:848)         at java.base@9-ea/java.util.concurrent.ThreadPoolExecutor.getTask(ThreadPoolExecutor.java:1086)         at java.base@9-ea/java.util.concurrent.ThreadPoolExecutor.runWorker(ThreadPoolExecutor.java:1146)         at java.base@9-ea/java.util.concurrent.ThreadPoolExecutor$Worker.run(ThreadPoolExecutor.java:635)         at java.base@9-ea/java.lang.Thread.run(Thread.java:844)    2) Thread[id=13900, name=cdcr-update-log-synchronizer-6400-thread-1, state=WAITING, group=TGRP-CdcrVersionReplicationTest]         at java.base@9-ea/jdk.internal.misc.Unsafe.park(Native Method)         at java.base@9-ea/java.util.concurrent.locks.LockSupport.park(LockSupport.java:194)         at java.base@9-ea/java.util.concurrent.locks.AbstractQueuedSynchronizer$ConditionObject.await(AbstractQueuedSynchronizer.java:2062)         at java.base@9-ea/java.util.concurrent.ScheduledThreadPoolExecutor$DelayedWorkQueue.take(ScheduledThreadPoolExecutor.java:1119)         at java.base@9-ea/java.util.concurrent.ScheduledThreadPoolExecutor$DelayedWorkQueue.take(ScheduledThreadPoolExecutor.java:848)         at java.base@9-ea/java.util.concurrent.ThreadPoolExecutor.getTask(ThreadPoolExecutor.java:1086)         at java.base@9-ea/java.util.concurrent.ThreadPoolExecutor.runWorker(ThreadPoolExecutor.java:1146)         at java.base@9-ea/java.util.concurrent.ThreadPoolExecutor$Worker.run(ThreadPoolExecutor.java:635)         at java.base@9-ea/java.lang.Thread.run(Thread.java:844)

Stack Trace:
com.carrotsearch.randomizedtesting.ThreadLeakError: There are still zombie threads that couldn't be terminated:
   1) Thread[id=13912, name=cdcr-update-log-synchronizer-6406-thread-1, state=WAITING, group=TGRP-CdcrVersionReplicationTest]
        at java.base@9-ea/jdk.internal.misc.Unsafe.park(Native Method)
        at java.base@9-ea/java.util.concurrent.locks.LockSupport.park(LockSupport.java:194)
        at java.base@9-ea/java.util.concurrent.locks.AbstractQueuedSynchronizer$ConditionObject.await(AbstractQueuedSynchronizer.java:2062)
        at java.base@9-ea/java.util.concurrent.ScheduledThreadPoolExecutor$DelayedWorkQueue.take(ScheduledThreadPoolExecutor.java:1119)
        at java.base@9-ea/java.util.concurrent.ScheduledThreadPoolExecutor$DelayedWorkQueue.take(ScheduledThreadPoolExecutor.java:848)
        at java.base@9-ea/java.util.concurrent.ThreadPoolExecutor.getTask(ThreadPoolExecutor.java:1086)
        at java.base@9-ea/java.util.concurrent.ThreadPoolExecutor.runWorker(ThreadPoolExecutor.java:1146)
        at java.base@9-ea/java.util.concurrent.ThreadPoolExecutor$Worker.run(ThreadPoolExecutor.java:635)
        at java.base@9-ea/java.lang.Thread.run(Thread.java:844)
   2) Thread[id=13900, name=cdcr-update-log-synchronizer-6400-thread-1, state=WAITING, group=TGRP-CdcrVersionReplicationTest]
        at java.base@9-ea/jdk.internal.misc.Unsafe.park(Native Method)
        at java.base@9-ea/java.util.concurrent.locks.LockSupport.park(LockSupport.java:194)
        at java.base@9-ea/java.util.concurrent.locks.AbstractQueuedSynchronizer$ConditionObject.await(AbstractQueuedSynchronizer.java:2062)
        at java.base@9-ea/java.util.concurrent.ScheduledThreadPoolExecutor$DelayedWorkQueue.take(ScheduledThreadPoolExecutor.java:1119)
        at java.base@9-ea/java.util.concurrent.ScheduledThreadPoolExecutor$DelayedWorkQueue.take(ScheduledThreadPoolExecutor.java:848)
        at java.base@9-ea/java.util.concurrent.ThreadPoolExecutor.getTask(ThreadPoolExecutor.java:1086)
        at java.base@9-ea/java.util.concurrent.ThreadPoolExecutor.runWorker(ThreadPoolExecutor.java:1146)
        at java.base@9-ea/java.util.concurrent.ThreadPoolExecutor$Worker.run(ThreadPoolExecutor.java:635)
        at java.base@9-ea/java.lang.Thread.run(Thread.java:844)
	at __randomizedtesting.SeedInfo.seed([25A18B9435646E6C]:0)


FAILED:  org.apache.solr.cloud.ClusterStateUpdateTest.testCoreRegistration

Error Message:
expected:<http[]://127.0.0.1:33039/s...> but was:<http[s]://127.0.0.1:33039/s...>

Stack Trace:
org.junit.ComparisonFailure: expected:<http[]://127.0.0.1:33039/s...> but was:<http[s]://127.0.0.1:33039/s...>
	at __randomizedtesting.SeedInfo.seed([25A18B9435646E6C:9B2AED3B4C1E6059]:0)
	at org.junit.Assert.assertEquals(Assert.java:125)
	at org.junit.Assert.assertEquals(Assert.java:147)
	at org.apache.solr.cloud.ClusterStateUpdateTest.testCoreRegistration(ClusterStateUpdateTest.java:104)
	at java.base/jdk.internal.reflect.NativeMethodAccessorImpl.invoke0(Native Method)
	at java.base/jdk.internal.reflect.NativeMethodAccessorImpl.invoke(NativeMethodAccessorImpl.java:62)
	at java.base/jdk.internal.reflect.DelegatingMethodAccessorImpl.invoke(DelegatingMethodAccessorImpl.java:43)
	at java.base/java.lang.reflect.Method.invoke(Method.java:564)
	at com.carrotsearch.randomizedtesting.RandomizedRunner.invoke(RandomizedRunner.java:1713)
	at com.carrotsearch.randomizedtesting.RandomizedRunner$8.evaluate(RandomizedRunner.java:907)
	at com.carrotsearch.randomizedtesting.RandomizedRunner$9.evaluate(RandomizedRunner.java:943)
	at com.carrotsearch.randomizedtesting.RandomizedRunner$10.evaluate(RandomizedRunner.java:957)
	at com.carrotsearch.randomizedtesting.rules.SystemPropertiesRestoreRule$1.evaluate(SystemPropertiesRestoreRule.java:57)
	at org.apache.lucene.util.TestRuleSetupTeardownChained$1.evaluate(TestRuleSetupTeardownChained.java:49)
	at org.apache.lucene.util.AbstractBeforeAfterRule$1.evaluate(AbstractBeforeAfterRule.java:45)
	at org.apache.lucene.util.TestRuleThreadAndTestName$1.evaluate(TestRuleThreadAndTestName.java:48)
	at org.apache.lucene.util.TestRuleIgnoreAfterMaxFailures$1.evaluate(TestRuleIgnoreAfterMaxFailures.java:64)
	at org.apache.lucene.util.TestRuleMarkFailure$1.evaluate(TestRuleMarkFailure.java:47)
	at com.carrotsearch.randomizedtesting.rules.StatementAdapter.evaluate(StatementAdapter.java:36)
	at com.carrotsearch.randomizedtesting.ThreadLeakControl$StatementRunner.run(ThreadLeakControl.java:368)
	at com.carrotsearch.randomizedtesting.ThreadLeakControl.forkTimeoutingTask(ThreadLeakControl.java:817)
	at com.carrotsearch.randomizedtesting.ThreadLeakControl$3.evaluate(ThreadLeakControl.java:468)
	at com.carrotsearch.randomizedtesting.RandomizedRunner.runSingleTest(RandomizedRunner.java:916)
	at com.carrotsearch.randomizedtesting.RandomizedRunner$5.evaluate(RandomizedRunner.java:802)
	at com.carrotsearch.randomizedtesting.RandomizedRunner$6.evaluate(RandomizedRunner.java:852)
	at com.carrotsearch.randomizedtesting.RandomizedRunner$7.evaluate(RandomizedRunner.java:863)
	at com.carrotsearch.randomizedtesting.rules.StatementAdapter.evaluate(StatementAdapter.java:36)
	at com.carrotsearch.randomizedtesting.rules.SystemPropertiesRestoreRule$1.evaluate(SystemPropertiesRestoreRule.java:57)
	at org.apache.lucene.util.AbstractBeforeAfterRule$1.evaluate(AbstractBeforeAfterRule.java:45)
	at com.carrotsearch.randomizedtesting.rules.StatementAdapter.evaluate(StatementAdapter.java:36)
	at org.apache.lucene.util.TestRuleStoreClassName$1.evaluate(TestRuleStoreClassName.java:41)
	at com.carrotsearch.randomizedtesting.rules.NoShadowingOrOverridesOnMethodsRule$1.evaluate(NoShadowingOrOverridesOnMethodsRule.java:40)
	at com.carrotsearch.randomizedtesting.rules.NoShadowingOrOverridesOnMethodsRule$1.evaluate(NoShadowingOrOverridesOnMethodsRule.java:40)
	at com.carrotsearch.randomizedtesting.rules.StatementAdapter.evaluate(StatementAdapter.java:36)
	at com.carrotsearch.randomizedtesting.rules.StatementAdapter.evaluate(StatementAdapter.java:36)
	at org.apache.lucene.util.TestRuleAssertionsRequired$1.evaluate(TestRuleAssertionsRequired.java:53)
	at org.apache.lucene.util.TestRuleMarkFailure$1.evaluate(TestRuleMarkFailure.java:47)
	at org.apache.lucene.util.TestRuleIgnoreAfterMaxFailures$1.evaluate(TestRuleIgnoreAfterMaxFailures.java:64)
	at org.apache.lucene.util.TestRuleIgnoreTestSuites$1.evaluate(TestRuleIgnoreTestSuites.java:54)
	at com.carrotsearch.randomizedtesting.rules.StatementAdapter.evaluate(StatementAdapter.java:36)
	at com.carrotsearch.randomizedtesting.ThreadLeakControl$StatementRunner.run(ThreadLeakControl.java:368)
	at java.base/java.lang.Thread.run(Thread.java:844)


FAILED:  org.apache.solr.cloud.CollectionsAPISolrJTest.testClusterProp

Error Message:
Expecting legacyCloud to false as default expected:<null> but was:<false>

Stack Trace:
java.lang.AssertionError: Expecting legacyCloud to false as default expected:<null> but was:<false>
	at __randomizedtesting.SeedInfo.seed([25A18B9435646E6C:848935D1382AE84B]:0)
	at org.junit.Assert.fail(Assert.java:93)
	at org.junit.Assert.failNotEquals(Assert.java:647)
	at org.junit.Assert.assertEquals(Assert.java:128)
	at org.apache.solr.cloud.CollectionsAPISolrJTest.testClusterProp(CollectionsAPISolrJTest.java:272)
	at java.base/jdk.internal.reflect.NativeMethodAccessorImpl.invoke0(Native Method)
	at java.base/jdk.internal.reflect.NativeMethodAccessorImpl.invoke(NativeMethodAccessorImpl.java:62)
	at java.base/jdk.internal.reflect.DelegatingMethodAccessorImpl.invoke(DelegatingMethodAccessorImpl.java:43)
	at java.base/java.lang.reflect.Method.invoke(Method.java:564)
	at com.carrotsearch.randomizedtesting.RandomizedRunner.invoke(RandomizedRunner.java:1713)
	at com.carrotsearch.randomizedtesting.RandomizedRunner$8.evaluate(RandomizedRunner.java:907)
	at com.carrotsearch.randomizedtesting.RandomizedRunner$9.evaluate(RandomizedRunner.java:943)
	at com.carrotsearch.randomizedtesting.RandomizedRunner$10.evaluate(RandomizedRunner.java:957)
	at com.carrotsearch.randomizedtesting.rules.SystemPropertiesRestoreRule$1.evaluate(SystemPropertiesRestoreRule.java:57)
	at org.apache.lucene.util.TestRuleSetupTeardownChained$1.evaluate(TestRuleSetupTeardownChained.java:49)
	at org.apache.lucene.util.AbstractBeforeAfterRule$1.evaluate(AbstractBeforeAfterRule.java:45)
	at org.apache.lucene.util.TestRuleThreadAndTestName$1.evaluate(TestRuleThreadAndTestName.java:48)
	at org.apache.lucene.util.TestRuleIgnoreAfterMaxFailures$1.evaluate(TestRuleIgnoreAfterMaxFailures.java:64)
	at org.apache.lucene.util.TestRuleMarkFailure$1.evaluate(TestRuleMarkFailure.java:47)
	at com.carrotsearch.randomizedtesting.rules.StatementAdapter.evaluate(StatementAdapter.java:36)
	at com.carrotsearch.randomizedtesting.ThreadLeakControl$StatementRunner.run(ThreadLeakControl.java:368)
	at com.carrotsearch.randomizedtesting.ThreadLeakControl.forkTimeoutingTask(ThreadLeakControl.java:817)
	at com.carrotsearch.randomizedtesting.ThreadLeakControl$3.evaluate(ThreadLeakControl.java:468)
	at com.carrotsearch.randomizedtesting.RandomizedRunner.runSingleTest(RandomizedRunner.java:916)
	at com.carrotsearch.randomizedtesting.RandomizedRunner$5.evaluate(RandomizedRunner.java:802)
	at com.carrotsearch.randomizedtesting.RandomizedRunner$6.evaluate(RandomizedRunner.java:852)
	at com.carrotsearch.randomizedtesting.RandomizedRunner$7.evaluate(RandomizedRunner.java:863)
	at com.carrotsearch.randomizedtesting.rules.StatementAdapter.evaluate(StatementAdapter.java:36)
	at com.carrotsearch.randomizedtesting.rules.SystemPropertiesRestoreRule$1.evaluate(SystemPropertiesRestoreRule.java:57)
	at org.apache.lucene.util.AbstractBeforeAfterRule$1.evaluate(AbstractBeforeAfterRule.java:45)
	at com.carrotsearch.randomizedtesting.rules.StatementAdapter.evaluate(StatementAdapter.java:36)
	at org.apache.lucene.util.TestRuleStoreClassName$1.evaluate(TestRuleStoreClassName.java:41)
	at com.carrotsearch.randomizedtesting.rules.NoShadowingOrOverridesOnMethodsRule$1.evaluate(NoShadowingOrOverridesOnMethodsRule.java:40)
	at com.carrotsearch.randomizedtesting.rules.NoShadowingOrOverridesOnMethodsRule$1.evaluate(NoShadowingOrOverridesOnMethodsRule.java:40)
	at com.carrotsearch.randomizedtesting.rules.StatementAdapter.evaluate(StatementAdapter.java:36)
	at com.carrotsearch.randomizedtesting.rules.StatementAdapter.evaluate(StatementAdapter.java:36)
	at org.apache.lucene.util.TestRuleAssertionsRequired$1.evaluate(TestRuleAssertionsRequired.java:53)
	at org.apache.lucene.util.TestRuleMarkFailure$1.evaluate(TestRuleMarkFailure.java:47)
	at org.apache.lucene.util.TestRuleIgnoreAfterMaxFailures$1.evaluate(TestRuleIgnoreAfterMaxFailures.java:64)
	at org.apache.lucene.util.TestRuleIgnoreTestSuites$1.evaluate(TestRuleIgnoreTestSuites.java:54)
	at com.carrotsearch.randomizedtesting.rules.StatementAdapter.evaluate(StatementAdapter.java:36)
	at com.carrotsearch.randomizedtesting.ThreadLeakControl$StatementRunner.run(ThreadLeakControl.java:368)
	at java.base/java.lang.Thread.run(Thread.java:844)


FAILED:  org.apache.solr.cloud.LeaderElectionIntegrationTest.testSimpleSliceLeaderElection

Error Message:
Expected to see nodes come back collection1 null Live Nodes: [127.0.0.1:46575_solr, 127.0.0.1:46153_solr, 127.0.0.1:39859_solr] Last available state: DocCollection(collection1//collections/collection1/state.json/17)={   "pullReplicas":"0",   "replicationFactor":"1",   "shards":{     "shard1":{       "range":"80000000-ffffffff",       "state":"active",       "replicas":{         "core_node1":{           "core":"collection1_shard1_replica_n1",           "base_url":"http://127.0.0.1:39859/solr",           "node_name":"127.0.0.1:39859_solr",           "state":"active",           "type":"NRT"},         "core_node3":{           "core":"collection1_shard1_replica_n2",           "base_url":"http://127.0.0.1:33359/solr",           "node_name":"127.0.0.1:33359_solr",           "state":"down",           "type":"NRT"},         "core_node4":{           "core":"collection1_shard1_replica_n3",           "base_url":"http://127.0.0.1:39697/solr",           "node_name":"127.0.0.1:39697_solr",           "state":"down",           "type":"NRT"},         "core_node5":{           "core":"collection1_shard1_replica_n4",           "base_url":"http://127.0.0.1:42803/solr",           "node_name":"127.0.0.1:42803_solr",           "state":"down",           "type":"NRT"},         "core_node6":{           "core":"collection1_shard1_replica_n5",           "base_url":"http://127.0.0.1:46575/solr",           "node_name":"127.0.0.1:46575_solr",           "state":"active",           "type":"NRT",           "leader":"true"}}},     "shard2":{       "range":"0-7fffffff",       "state":"active",       "replicas":{"core_node2":{           "core":"collection1_shard2_replica_n1",           "base_url":"http://127.0.0.1:46153/solr",           "node_name":"127.0.0.1:46153_solr",           "state":"active",           "type":"NRT",           "leader":"true"}}}},   "router":{"name":"compositeId"},   "maxShardsPerNode":"1",   "autoAddReplicas":"false",   "nrtReplicas":"1",   "tlogReplicas":"0"}

Stack Trace:
java.lang.AssertionError: Expected to see nodes come back collection1
null
Live Nodes: [127.0.0.1:46575_solr, 127.0.0.1:46153_solr, 127.0.0.1:39859_solr]
Last available state: DocCollection(collection1//collections/collection1/state.json/17)={
  "pullReplicas":"0",
  "replicationFactor":"1",
  "shards":{
    "shard1":{
      "range":"80000000-ffffffff",
      "state":"active",
      "replicas":{
        "core_node1":{
          "core":"collection1_shard1_replica_n1",
          "base_url":"http://127.0.0.1:39859/solr",
          "node_name":"127.0.0.1:39859_solr",
          "state":"active",
          "type":"NRT"},
        "core_node3":{
          "core":"collection1_shard1_replica_n2",
          "base_url":"http://127.0.0.1:33359/solr",
          "node_name":"127.0.0.1:33359_solr",
          "state":"down",
          "type":"NRT"},
        "core_node4":{
          "core":"collection1_shard1_replica_n3",
          "base_url":"http://127.0.0.1:39697/solr",
          "node_name":"127.0.0.1:39697_solr",
          "state":"down",
          "type":"NRT"},
        "core_node5":{
          "core":"collection1_shard1_replica_n4",
          "base_url":"http://127.0.0.1:42803/solr",
          "node_name":"127.0.0.1:42803_solr",
          "state":"down",
          "type":"NRT"},
        "core_node6":{
          "core":"collection1_shard1_replica_n5",
          "base_url":"http://127.0.0.1:46575/solr",
          "node_name":"127.0.0.1:46575_solr",
          "state":"active",
          "type":"NRT",
          "leader":"true"}}},
    "shard2":{
      "range":"0-7fffffff",
      "state":"active",
      "replicas":{"core_node2":{
          "core":"collection1_shard2_replica_n1",
          "base_url":"http://127.0.0.1:46153/solr",
          "node_name":"127.0.0.1:46153_solr",
          "state":"active",
          "type":"NRT",
          "leader":"true"}}}},
  "router":{"name":"compositeId"},
  "maxShardsPerNode":"1",
  "autoAddReplicas":"false",
  "nrtReplicas":"1",
  "tlogReplicas":"0"}
	at __randomizedtesting.SeedInfo.seed([25A18B9435646E6C:7B9546DA761BF28B]:0)
	at org.junit.Assert.fail(Assert.java:93)
	at org.apache.solr.cloud.SolrCloudTestCase.waitForState(SolrCloudTestCase.java:269)
	at org.apache.solr.cloud.LeaderElectionIntegrationTest.testSimpleSliceLeaderElection(LeaderElectionIntegrationTest.java:109)
	at java.base/jdk.internal.reflect.NativeMethodAccessorImpl.invoke0(Native Method)
	at java.base/jdk.internal.reflect.NativeMethodAccessorImpl.invoke(NativeMethodAccessorImpl.java:62)
	at java.base/jdk.internal.reflect.DelegatingMethodAccessorImpl.invoke(DelegatingMethodAccessorImpl.java:43)
	at java.base/java.lang.reflect.Method.invoke(Method.java:564)
	at com.carrotsearch.randomizedtesting.RandomizedRunner.invoke(RandomizedRunner.java:1713)
	at com.carrotsearch.randomizedtesting.RandomizedRunner$8.evaluate(RandomizedRunner.java:907)
	at com.carrotsearch.randomizedtesting.RandomizedRunner$9.evaluate(RandomizedRunner.java:943)
	at com.carrotsearch.randomizedtesting.RandomizedRunner$10.evaluate(RandomizedRunner.java:957)
	at com.carrotsearch.randomizedtesting.rules.SystemPropertiesRestoreRule$1.evaluate(SystemPropertiesRestoreRule.java:57)
	at org.apache.lucene.util.TestRuleSetupTeardownChained$1.evaluate(TestRuleSetupTeardownChained.java:49)
	at org.apache.lucene.util.AbstractBeforeAfterRule$1.evaluate(AbstractBeforeAfterRule.java:45)
	at org.apache.lucene.util.TestRuleThreadAndTestName$1.evaluate(TestRuleThreadAndTestName.java:48)
	at org.apache.lucene.util.TestRuleIgnoreAfterMaxFailures$1.evaluate(TestRuleIgnoreAfterMaxFailures.java:64)
	at org.apache.lucene.util.TestRuleMarkFailure$1.evaluate(TestRuleMarkFailure.java:47)
	at com.carrotsearch.randomizedtesting.rules.StatementAdapter.evaluate(StatementAdapter.java:36)
	at com.carrotsearch.randomizedtesting.ThreadLeakControl$StatementRunner.run(ThreadLeakControl.java:368)
	at com.carrotsearch.randomizedtesting.ThreadLeakControl.forkTimeoutingTask(ThreadLeakControl.java:817)
	at com.carrotsearch.randomizedtesting.ThreadLeakControl$3.evaluate(ThreadLeakControl.java:468)
	at com.carrotsearch.randomizedtesting.RandomizedRunner.runSingleTest(RandomizedRunner.java:916)
	at com.carrotsearch.randomizedtesting.RandomizedRunner$5.evaluate(RandomizedRunner.java:802)
	at com.carrotsearch.randomizedtesting.RandomizedRunner$6.evaluate(RandomizedRunner.java:852)
	at com.carrotsearch.randomizedtesting.RandomizedRunner$7.evaluate(RandomizedRunner.java:863)
	at com.carrotsearch.randomizedtesting.rules.StatementAdapter.evaluate(StatementAdapter.java:36)
	at com.carrotsearch.randomizedtesting.rules.SystemPropertiesRestoreRule$1.evaluate(SystemPropertiesRestoreRule.java:57)
	at org.apache.lucene.util.AbstractBeforeAfterRule$1.evaluate(AbstractBeforeAfterRule.java:45)
	at com.carrotsearch.randomizedtesting.rules.StatementAdapter.evaluate(StatementAdapter.java:36)
	at org.apache.lucene.util.TestRuleStoreClassName$1.evaluate(TestRuleStoreClassName.java:41)
	at com.carrotsearch.randomizedtesting.rules.NoShadowingOrOverridesOnMethodsRule$1.evaluate(NoShadowingOrOverridesOnMethodsRule.java:40)
	at com.carrotsearch.randomizedtesting.rules.NoShadowingOrOverridesOnMethodsRule$1.evaluate(NoShadowingOrOverridesOnMethodsRule.java:40)
	at com.carrotsearch.randomizedtesting.rules.StatementAdapter.evaluate(StatementAdapter.java:36)
	at com.carrotsearch.randomizedtesting.rules.StatementAdapter.evaluate(StatementAdapter.java:36)
	at org.apache.lucene.util.TestRuleAssertionsRequired$1.evaluate(TestRuleAssertionsRequired.java:53)
	at org.apache.lucene.util.TestRuleMarkFailure$1.evaluate(TestRuleMarkFailure.java:47)
	at org.apache.lucene.util.TestRuleIgnoreAfterMaxFailures$1.evaluate(TestRuleIgnoreAfterMaxFailures.java:64)
	at org.apache.lucene.util.TestRuleIgnoreTestSuites$1.evaluate(TestRuleIgnoreTestSuites.java:54)
	at com.carrotsearch.randomizedtesting.rules.StatementAdapter.evaluate(StatementAdapter.java:36)
	at com.carrotsearch.randomizedtesting.ThreadLeakControl$StatementRunner.run(ThreadLeakControl.java:368)
	at java.base/java.lang.Thread.run(Thread.java:844)


FAILED:  org.apache.solr.cloud.ShardSplitTest.testSplitWithChaosMonkey

Error Message:
shard2 is not consistent.  Got 38 from http://127.0.0.1:37009/collection1_shard2_replica_n0 (previous client) and got 76 from http://127.0.0.1:32867/collection1_shard2_replica_n1

Stack Trace:
java.lang.AssertionError: shard2 is not consistent.  Got 38 from http://127.0.0.1:37009/collection1_shard2_replica_n0 (previous client) and got 76 from http://127.0.0.1:32867/collection1_shard2_replica_n1
	at __randomizedtesting.SeedInfo.seed([25A18B9435646E6C:AE8658457462C5E8]:0)
	at org.junit.Assert.fail(Assert.java:93)
	at org.apache.solr.cloud.AbstractFullDistribZkTestBase.checkShardConsistency(AbstractFullDistribZkTestBase.java:1319)
	at org.apache.solr.cloud.ShardSplitTest.testSplitWithChaosMonkey(ShardSplitTest.java:474)
	at java.base/jdk.internal.reflect.NativeMethodAccessorImpl.invoke0(Native Method)
	at java.base/jdk.internal.reflect.NativeMethodAccessorImpl.invoke(NativeMethodAccessorImpl.java:62)
	at java.base/jdk.internal.reflect.DelegatingMethodAccessorImpl.invoke(DelegatingMethodAccessorImpl.java:43)
	at java.base/java.lang.reflect.Method.invoke(Method.java:564)
	at com.carrotsearch.randomizedtesting.RandomizedRunner.invoke(RandomizedRunner.java:1713)
	at com.carrotsearch.randomizedtesting.RandomizedRunner$8.evaluate(RandomizedRunner.java:907)
	at com.carrotsearch.randomizedtesting.RandomizedRunner$9.evaluate(RandomizedRunner.java:943)
	at com.carrotsearch.randomizedtesting.RandomizedRunner$10.evaluate(RandomizedRunner.java:957)
	at org.apache.solr.BaseDistributedSearchTestCase$ShardsRepeatRule$ShardsFixedStatement.callStatement(BaseDistributedSearchTestCase.java:985)
	at org.apache.solr.BaseDistributedSearchTestCase$ShardsRepeatRule$ShardsStatement.evaluate(BaseDistributedSearchTestCase.java:960)
	at com.carrotsearch.randomizedtesting.rules.SystemPropertiesRestoreRule$1.evaluate(SystemPropertiesRestoreRule.java:57)
	at org.apache.lucene.util.TestRuleSetupTeardownChained$1.evaluate(TestRuleSetupTeardownChained.java:49)
	at org.apache.lucene.util.AbstractBeforeAfterRule$1.evaluate(AbstractBeforeAfterRule.java:45)
	at org.apache.lucene.util.TestRuleThreadAndTestName$1.evaluate(TestRuleThreadAndTestName.java:48)
	at org.apache.lucene.util.TestRuleIgnoreAfterMaxFailures$1.evaluate(TestRuleIgnoreAfterMaxFailures.java:64)
	at org.apache.lucene.util.TestRuleMarkFailure$1.evaluate(TestRuleMarkFailure.java:47)
	at com.carrotsearch.randomizedtesting.rules.StatementAdapter.evaluate(StatementAdapter.java:36)
	at com.carrotsearch.randomizedtesting.ThreadLeakControl$StatementRunner.run(ThreadLeakControl.java:368)
	at com.carrotsearch.randomizedtesting.ThreadLeakControl.forkTimeoutingTask(ThreadLeakControl.java:817)
	at com.carrotsearch.randomizedtesting.ThreadLeakControl$3.evaluate(ThreadLeakControl.java:468)
	at com.carrotsearch.randomizedtesting.RandomizedRunner.runSingleTest(RandomizedRunner.java:916)
	at com.carrotsearch.randomizedtesting.RandomizedRunner$5.evaluate(RandomizedRunner.java:802)
	at com.carrotsearch.randomizedtesting.RandomizedRunner$6.evaluate(RandomizedRunner.java:852)
	at com.carrotsearch.randomizedtesting.RandomizedRunner$7.evaluate(RandomizedRunner.java:863)
	at com.carrotsearch.randomizedtesting.rules.StatementAdapter.evaluate(StatementAdapter.java:36)
	at com.carrotsearch.randomizedtesting.rules.SystemPropertiesRestoreRule$1.evaluate(SystemPropertiesRestoreRule.java:57)
	at org.apache.lucene.util.AbstractBeforeAfterRule$1.evaluate(AbstractBeforeAfterRule.java:45)
	at com.carrotsearch.randomizedtesting.rules.StatementAdapter.evaluate(StatementAdapter.java:36)
	at org.apache.lucene.util.TestRuleStoreClassName$1.evaluate(TestRuleStoreClassName.java:41)
	at com.carrotsearch.randomizedtesting.rules.NoShadowingOrOverridesOnMethodsRule$1.evaluate(NoShadowingOrOverridesOnMethodsRule.java:40)
	at com.carrotsearch.randomizedtesting.rules.NoShadowingOrOverridesOnMethodsRule$1.evaluate(NoShadowingOrOverridesOnMethodsRule.java:40)
	at com.carrotsearch.randomizedtesting.rules.StatementAdapter.evaluate(StatementAdapter.java:36)
	at com.carrotsearch.randomizedtesting.rules.StatementAdapter.evaluate(StatementAdapter.java:36)
	at org.apache.lucene.util.TestRuleAssertionsRequired$1.evaluate(TestRuleAssertionsRequired.java:53)
	at org.apache.lucene.util.TestRuleMarkFailure$1.evaluate(TestRuleMarkFailure.java:47)
	at org.apache.lucene.util.TestRuleIgnoreAfterMaxFailures$1.evaluate(TestRuleIgnoreAfterMaxFailures.java:64)
	at org.apache.lucene.util.TestRuleIgnoreTestSuites$1.evaluate(TestRuleIgnoreTestSuites.java:54)
	at com.carrotsearch.randomizedtesting.rules.StatementAdapter.evaluate(StatementAdapter.java:36)
	at com.carrotsearch.randomizedtesting.ThreadLeakControl$StatementRunner.run(ThreadLeakControl.java:368)
	at java.base/java.lang.Thread.run(Thread.java:844)


FAILED:  org.apache.solr.cloud.UnloadDistributedZkTest.test

Error Message:


Stack Trace:
java.lang.NullPointerException
	at __randomizedtesting.SeedInfo.seed([25A18B9435646E6C:ADF5B44E9B980394]:0)
	at org.apache.solr.cloud.UnloadDistributedZkTest.testCoreUnloadAndLeaders(UnloadDistributedZkTest.java:171)
	at org.apache.solr.cloud.UnloadDistributedZkTest.test(UnloadDistributedZkTest.java:68)
	at java.base/jdk.internal.reflect.NativeMethodAccessorImpl.invoke0(Native Method)
	at java.base/jdk.internal.reflect.NativeMethodAccessorImpl.invoke(NativeMethodAccessorImpl.java:62)
	at java.base/jdk.internal.reflect.DelegatingMethodAccessorImpl.invoke(DelegatingMethodAccessorImpl.java:43)
	at java.base/java.lang.reflect.Method.invoke(Method.java:564)
	at com.carrotsearch.randomizedtesting.RandomizedRunner.invoke(RandomizedRunner.java:1713)
	at com.carrotsearch.randomizedtesting.RandomizedRunner$8.evaluate(RandomizedRunner.java:907)
	at com.carrotsearch.randomizedtesting.RandomizedRunner$9.evaluate(RandomizedRunner.java:943)
	at com.carrotsearch.randomizedtesting.RandomizedRunner$10.evaluate(RandomizedRunner.java:957)
	at org.apache.solr.BaseDistributedSearchTestCase$ShardsRepeatRule$ShardsFixedStatement.callStatement(BaseDistributedSearchTestCase.java:985)
	at org.apache.solr.BaseDistributedSearchTestCase$ShardsRepeatRule$ShardsStatement.evaluate(BaseDistributedSearchTestCase.java:960)
	at com.carrotsearch.randomizedtesting.rules.SystemPropertiesRestoreRule$1.evaluate(SystemPropertiesRestoreRule.java:57)
	at org.apache.lucene.util.TestRuleSetupTeardownChained$1.evaluate(TestRuleSetupTeardownChained.java:49)
	at org.apache.lucene.util.AbstractBeforeAfterRule$1.evaluate(AbstractBeforeAfterRule.java:45)
	at org.apache.lucene.util.TestRuleThreadAndTestName$1.evaluate(TestRuleThreadAndTestName.java:48)
	at org.apache.lucene.util.TestRuleIgnoreAfterMaxFailures$1.evaluate(TestRuleIgnoreAfterMaxFailures.java:64)
	at org.apache.lucene.util.TestRuleMarkFailure$1.evaluate(TestRuleMarkFailure.java:47)
	at com.carrotsearch.randomizedtesting.rules.StatementAdapter.evaluate(StatementAdapter.java:36)
	at com.carrotsearch.randomizedtesting.ThreadLeakControl$StatementRunner.run(ThreadLeakControl.java:368)
	at com.carrotsearch.randomizedtesting.ThreadLeakControl.forkTimeoutingTask(ThreadLeakControl.java:817)
	at com.carrotsearch.randomizedtesting.ThreadLeakControl$3.evaluate(ThreadLeakControl.java:468)
	at com.carrotsearch.randomizedtesting.RandomizedRunner.runSingleTest(RandomizedRunner.java:916)
	at com.carrotsearch.randomizedtesting.RandomizedRunner$5.evaluate(RandomizedRunner.java:802)
	at com.carrotsearch.randomizedtesting.RandomizedRunner$6.evaluate(RandomizedRunner.java:852)
	at com.carrotsearch.randomizedtesting.RandomizedRunner$7.evaluate(RandomizedRunner.java:863)
	at com.carrotsearch.randomizedtesting.rules.StatementAdapter.evaluate(StatementAdapter.java:36)
	at com.carrotsearch.randomizedtesting.rules.SystemPropertiesRestoreRule$1.evaluate(SystemPropertiesRestoreRule.java:57)
	at org.apache.lucene.util.AbstractBeforeAfterRule$1.evaluate(AbstractBeforeAfterRule.java:45)
	at com.carrotsearch.randomizedtesting.rules.StatementAdapter.evaluate(StatementAdapter.java:36)
	at org.apache.lucene.util.TestRuleStoreClassName$1.evaluate(TestRuleStoreClassName.java:41)
	at com.carrotsearch.randomizedtesting.rules.NoShadowingOrOverridesOnMethodsRule$1.evaluate(NoShadowingOrOverridesOnMethodsRule.java:40)
	at com.carrotsearch.randomizedtesting.rules.NoShadowingOrOverridesOnMethodsRule$1.evaluate(NoShadowingOrOverridesOnMethodsRule.java:40)
	at com.carrotsearch.randomizedtesting.rules.StatementAdapter.evaluate(StatementAdapter.java:36)
	at com.carrotsearch.randomizedtesting.rules.StatementAdapter.evaluate(StatementAdapter.java:36)
	at org.apache.lucene.util.TestRuleAssertionsRequired$1.evaluate(TestRuleAssertionsRequired.java:53)
	at org.apache.lucene.util.TestRuleMarkFailure$1.evaluate(TestRuleMarkFailure.java:47)
	at org.apache.lucene.util.TestRuleIgnoreAfterMaxFailures$1.evaluate(TestRuleIgnoreAfterMaxFailures.java:64)
	at org.apache.lucene.util.TestRuleIgnoreTestSuites$1.evaluate(TestRuleIgnoreTestSuites.java:54)
	at com.carrotsearch.randomizedtesting.rules.StatementAdapter.evaluate(StatementAdapter.java:36)
	at com.carrotsearch.randomizedtesting.ThreadLeakControl$StatementRunner.run(ThreadLeakControl.java:368)
	at java.base/java.lang.Thread.run(Thread.java:844)


FAILED:  org.apache.solr.ltr.TestLTROnSolrCloud.testSimpleQuery

Error Message:
Path not found: /responseHeader/status

Stack Trace:
java.lang.RuntimeException: Path not found: /responseHeader/status
	at __randomizedtesting.SeedInfo.seed([DB6C43B805DBF997:AE6183A415C13F42]:0)
	at org.apache.solr.util.RestTestBase.assertJPut(RestTestBase.java:329)
	at org.apache.solr.util.RestTestBase.assertJPut(RestTestBase.java:271)
	at org.apache.solr.ltr.TestRerankBase.loadFeature(TestRerankBase.java:286)
	at org.apache.solr.ltr.TestLTROnSolrCloud.loadModelsAndFeatures(TestLTROnSolrCloud.java:184)
	at org.apache.solr.ltr.TestLTROnSolrCloud.setupSolrCluster(TestLTROnSolrCloud.java:138)
	at org.apache.solr.ltr.TestLTROnSolrCloud.setUp(TestLTROnSolrCloud.java:58)
	at java.base/jdk.internal.reflect.NativeMethodAccessorImpl.invoke0(Native Method)
	at java.base/jdk.internal.reflect.NativeMethodAccessorImpl.invoke(NativeMethodAccessorImpl.java:62)
	at java.base/jdk.internal.reflect.DelegatingMethodAccessorImpl.invoke(DelegatingMethodAccessorImpl.java:43)
	at java.base/java.lang.reflect.Method.invoke(Method.java:564)
	at com.carrotsearch.randomizedtesting.RandomizedRunner.invoke(RandomizedRunner.java:1713)
	at com.carrotsearch.randomizedtesting.RandomizedRunner$9.evaluate(RandomizedRunner.java:941)
	at com.carrotsearch.randomizedtesting.RandomizedRunner$10.evaluate(RandomizedRunner.java:957)
	at com.carrotsearch.randomizedtesting.rules.SystemPropertiesRestoreRule$1.evaluate(SystemPropertiesRestoreRule.java:57)
	at org.apache.lucene.util.TestRuleSetupTeardownChained$1.evaluate(TestRuleSetupTeardownChained.java:49)
	at org.apache.lucene.util.AbstractBeforeAfterRule$1.evaluate(AbstractBeforeAfterRule.java:45)
	at org.apache.lucene.util.TestRuleThreadAndTestName$1.evaluate(TestRuleThreadAndTestName.java:48)
	at org.apache.lucene.util.TestRuleIgnoreAfterMaxFailures$1.evaluate(TestRuleIgnoreAfterMaxFailures.java:64)
	at org.apache.lucene.util.TestRuleMarkFailure$1.evaluate(TestRuleMarkFailure.java:47)
	at com.carrotsearch.randomizedtesting.rules.StatementAdapter.evaluate(StatementAdapter.java:36)
	at com.carrotsearch.randomizedtesting.ThreadLeakControl$StatementRunner.run(ThreadLeakControl.java:368)
	at com.carrotsearch.randomizedtesting.ThreadLeakControl.forkTimeoutingTask(ThreadLeakControl.java:817)
	at com.carrotsearch.randomizedtesting.ThreadLeakControl$3.evaluate(ThreadLeakControl.java:468)
	at com.carrotsearch.randomizedtesting.RandomizedRunner.runSingleTest(RandomizedRunner.java:916)
	at com.carrotsearch.randomizedtesting.RandomizedRunner$5.evaluate(RandomizedRunner.java:802)
	at com.carrotsearch.randomizedtesting.RandomizedRunner$6.evaluate(RandomizedRunner.java:852)
	at com.carrotsearch.randomizedtesting.RandomizedRunner$7.evaluate(RandomizedRunner.java:863)
	at com.carrotsearch.randomizedtesting.rules.StatementAdapter.evaluate(StatementAdapter.java:36)
	at com.carrotsearch.randomizedtesting.rules.SystemPropertiesRestoreRule$1.evaluate(SystemPropertiesRestoreRule.java:57)
	at org.apache.lucene.util.AbstractBeforeAfterRule$1.evaluate(AbstractBeforeAfterRule.java:45)
	at com.carrotsearch.randomizedtesting.rules.StatementAdapter.evaluate(StatementAdapter.java:36)
	at org.apache.lucene.util.TestRuleStoreClassName$1.evaluate(TestRuleStoreClassName.java:41)
	at com.carrotsearch.randomizedtesting.rules.NoShadowingOrOverridesOnMethodsRule$1.evaluate(NoShadowingOrOverridesOnMethodsRule.java:40)
	at com.carrotsearch.randomizedtesting.rules.NoShadowingOrOverridesOnMethodsRule$1.evaluate(NoShadowingOrOverridesOnMethodsRule.java:40)
	at com.carrotsearch.randomizedtesting.rules.StatementAdapter.evaluate(StatementAdapter.java:36)
	at com.carrotsearch.randomizedtesting.rules.StatementAdapter.evaluate(StatementAdapter.java:36)
	at org.apache.lucene.util.TestRuleAssertionsRequired$1.evaluate(TestRuleAssertionsRequired.java:53)
	at org.apache.lucene.util.TestRuleMarkFailure$1.evaluate(TestRuleMarkFailure.java:47)
	at org.apache.lucene.util.TestRuleIgnoreAfterMaxFailures$1.evaluate(TestRuleIgnoreAfterMaxFailures.java:64)
	at org.apache.lucene.util.TestRuleIgnoreTestSuites$1.evaluate(TestRuleIgnoreTestSuites.java:54)
	at com.carrotsearch.randomizedtesting.rules.StatementAdapter.evaluate(StatementAdapter.java:36)
	at com.carrotsearch.randomizedtesting.ThreadLeakControl$StatementRunner.run(ThreadLeakControl.java:368)
	at java.base/java.lang.Thread.run(Thread.java:844)




Build Log:
[...truncated 11201 lines...]
   [junit4] Suite: org.apache.solr.cloud.ClusterStateUpdateTest
   [junit4]   2> Creating dataDir: /home/jenkins/workspace/Lucene-Solr-master-Linux/solr/build/solr-core/test/J1/temp/solr.cloud.ClusterStateUpdateTest_25A18B9435646E6C-001/init-core-data-001
   [junit4]   2> 236020 WARN  (SUITE-ClusterStateUpdateTest-seed#[25A18B9435646E6C]-worker) [    ] o.a.s.SolrTestCaseJ4 startTrackingSearchers: numOpens=9 numCloses=9
   [junit4]   2> 236021 INFO  (SUITE-ClusterStateUpdateTest-seed#[25A18B9435646E6C]-worker) [    ] o.a.s.SolrTestCaseJ4 Using PointFields
   [junit4]   2> 236021 INFO  (SUITE-ClusterStateUpdateTest-seed#[25A18B9435646E6C]-worker) [    ] o.a.s.SolrTestCaseJ4 Randomized ssl (true) and clientAuth (false) via: @org.apache.solr.util.RandomizeSSL(reason="", ssl=0.0/0.0, value=0.0/0.0, clientAuth=0.0/0.0)
   [junit4]   2> 236023 INFO  (TEST-ClusterStateUpdateTest.testCoreRegistration-seed#[25A18B9435646E6C]) [    ] o.a.s.SolrTestCaseJ4 ###Starting testCoreRegistration
   [junit4]   2> 236023 INFO  (TEST-ClusterStateUpdateTest.testCoreRegistration-seed#[25A18B9435646E6C]) [    ] o.a.s.c.MiniSolrCloudCluster Starting cluster of 3 servers in /home/jenkins/workspace/Lucene-Solr-master-Linux/solr/build/solr-core/test/J1/temp/solr.cloud.ClusterStateUpdateTest_25A18B9435646E6C-001/tempDir-001
   [junit4]   2> 236023 INFO  (TEST-ClusterStateUpdateTest.testCoreRegistration-seed#[25A18B9435646E6C]) [    ] o.a.s.c.ZkTestServer STARTING ZK TEST SERVER
   [junit4]   2> 236024 INFO  (Thread-603) [    ] o.a.s.c.ZkTestServer client port:0.0.0.0/0.0.0.0:0
   [junit4]   2> 236024 INFO  (Thread-603) [    ] o.a.s.c.ZkTestServer Starting server
   [junit4]   2> 236028 ERROR (Thread-603) [    ] o.a.z.s.ZooKeeperServer ZKShutdownHandler is not registered, so ZooKeeper server won't take any action on ERROR or SHUTDOWN server state changes
   [junit4]   2> 236124 INFO  (TEST-ClusterStateUpdateTest.testCoreRegistration-seed#[25A18B9435646E6C]) [    ] o.a.s.c.ZkTestServer start zk server on port:33729
   [junit4]   2> 236129 INFO  (jetty-launcher-508-thread-1) [    ] o.e.j.s.Server jetty-9.3.14.v20161028
   [junit4]   2> 236129 INFO  (jetty-launcher-508-thread-2) [    ] o.e.j.s.Server jetty-9.3.14.v20161028
   [junit4]   2> 236129 INFO  (jetty-launcher-508-thread-3) [    ] o.e.j.s.Server jetty-9.3.14.v20161028
   [junit4]   2> 236130 INFO  (jetty-launcher-508-thread-3) [    ] o.e.j.s.h.ContextHandler Started o.e.j.s.ServletContextHandler@948764{/solr,null,AVAILABLE}
   [junit4]   2> 236130 INFO  (jetty-launcher-508-thread-1) [    ] o.e.j.s.h.ContextHandler Started o.e.j.s.ServletContextHandler@ed603b{/solr,null,AVAILABLE}
   [junit4]   2> 236130 INFO  (jetty-launcher-508-thread-2) [    ] o.e.j.s.h.ContextHandler Started o.e.j.s.ServletContextHandler@6f452c{/solr,null,AVAILABLE}
   [junit4]   2> 236131 INFO  (jetty-launcher-508-thread-1) [    ] o.e.j.s.AbstractConnector Started ServerConnector@1ba921a{SSL,[ssl, http/1.1]}{127.0.0.1:33039}
   [junit4]   2> 236131 INFO  (jetty-launcher-508-thread-1) [    ] o.e.j.s.Server Started @238691ms
   [junit4]   2> 236131 INFO  (jetty-launcher-508-thread-1) [    ] o.a.s.c.s.e.JettySolrRunner Jetty properties: {hostContext=/solr, hostPort=33039}
   [junit4]   2> 236135 INFO  (jetty-launcher-508-thread-2) [    ] o.e.j.s.AbstractConnector Started ServerConnector@16b5b8e{SSL,[ssl, http/1.1]}{127.0.0.1:36919}
   [junit4]   2> 236135 INFO  (jetty-launcher-508-thread-2) [    ] o.e.j.s.Server Started @238695ms
   [junit4]   2> 236135 ERROR (jetty-launcher-508-thread-1) [    ] o.a.s.s.StartupLoggingUtils Missing Java Option solr.log.dir. Logging may be missing or incomplete.
   [junit4]   2> 236135 INFO  (jetty-launcher-508-thread-2) [    ] o.a.s.c.s.e.JettySolrRunner Jetty properties: {hostContext=/solr, hostPort=36919}
   [junit4]   2> 236135 INFO  (jetty-launcher-508-thread-1) [    ] o.a.s.s.SolrDispatchFilter  ___      _       Welcome to Apache Solr™ version 7.0.0
   [junit4]   2> 236135 INFO  (jetty-launcher-508-thread-1) [    ] o.a.s.s.SolrDispatchFilter / __| ___| |_ _   Starting in cloud mode on port null
   [junit4]   2> 236135 INFO  (jetty-launcher-508-thread-1) [    ] o.a.s.s.SolrDispatchFilter \__ \/ _ \ | '_|  Install dir: null
   [junit4]   2> 236135 INFO  (jetty-launcher-508-thread-1) [    ] o.a.s.s.SolrDispatchFilter |___/\___/_|_|    Start time: 2017-06-21T18:00:00.796570Z
   [junit4]   2> 236135 ERROR (jetty-launcher-508-thread-2) [    ] o.a.s.s.StartupLoggingUtils Missing Java Option solr.log.dir. Logging may be missing or incomplete.
   [junit4]   2> 236135 INFO  (jetty-launcher-508-thread-2) [    ] o.a.s.s.SolrDispatchFilter  ___      _       Welcome to Apache Solr™ version 7.0.0
   [junit4]   2> 236135 INFO  (jetty-launcher-508-thread-2) [    ] o.a.s.s.SolrDispatchFilter / __| ___| |_ _   Starting in cloud mode on port null
   [junit4]   2> 236135 INFO  (jetty-launcher-508-thread-2) [    ] o.a.s.s.SolrDispatchFilter \__ \/ _ \ | '_|  Install dir: null
   [junit4]   2> 236135 INFO  (jetty-launcher-508-thread-2) [    ] o.a.s.s.SolrDispatchFilter |___/\___/_|_|    Start time: 2017-06-21T18:00:00.796742Z
   [junit4]   2> 236135 INFO  (jetty-launcher-508-thread-3) [    ] o.e.j.s.AbstractConnector Started ServerConnector@bf8362{SSL,[ssl, http/1.1]}{127.0.0.1:36351}
   [junit4]   2> 236136 INFO  (jetty-launcher-508-thread-3) [    ] o.e.j.s.Server Started @238696ms
   [junit4]   2> 236136 INFO  (jetty-launcher-508-thread-3) [    ] o.a.s.c.s.e.JettySolrRunner Jetty properties: {hostContext=/solr, hostPort=36351}
   [junit4]   2> 236136 ERROR (jetty-launcher-508-thread-3) [    ] o.a.s.s.StartupLoggingUtils Missing Java Option solr.log.dir. Logging may be missing or incomplete.
   [junit4]   2> 236136 INFO  (jetty-launcher-508-thread-3) [    ] o.a.s.s.SolrDispatchFilter  ___      _       Welcome to Apache Solr™ version 7.0.0
   [junit4]   2> 236136 INFO  (jetty-launcher-508-thread-3) [    ] o.a.s.s.SolrDispatchFilter / __| ___| |_ _   Starting in cloud mode on port null
   [junit4]   2> 236136 INFO  (jetty-launcher-508-thread-3) [    ] o.a.s.s.SolrDispatchFilter \__ \/ _ \ | '_|  Install dir: null
   [junit4]   2> 236136 INFO  (jetty-launcher-508-thread-3) [    ] o.a.s.s.SolrDispatchFilter |___/\___/_|_|    Start time: 2017-06-21T18:00:00.797446Z
   [junit4]   2> 236148 INFO  (jetty-launcher-508-thread-1) [    ] o.a.s.s.SolrDispatchFilter solr.xml found in ZooKeeper. Loading...
   [junit4]   2> 236148 INFO  (jetty-launcher-508-thread-3) [    ] o.a.s.s.SolrDispatchFilter solr.xml found in ZooKeeper. Loading...
   [junit4]   2> 236152 INFO  (jetty-launcher-508-thread-2) [    ] o.a.s.s.SolrDispatchFilter solr.xml found in ZooKeeper. Loading...
   [junit4]   2> 236153 INFO  (jetty-launcher-508-thread-1) [    ] o.a.s.c.ZkContainer Zookeeper client=127.0.0.1:33729/solr
   [junit4]   2> 236154 INFO  (jetty-launcher-508-thread-3) [    ] o.a.s.c.ZkContainer Zookeeper client=127.0.0.1:33729/solr
   [junit4]   2> 236165 INFO  (jetty-launcher-508-thread-2) [    ] o.a.s.c.ZkContainer Zookeeper client=127.0.0.1:33729/solr
   [junit4]   2> 236171 INFO  (jetty-launcher-508-thread-1) [    ] o.a.s.c.Overseer Overseer (id=null) closing
   [junit4]   2> 236171 INFO  (jetty-launcher-508-thread-3) [    ] o.a.s.c.Overseer Overseer (id=null) closing
   [junit4]   2> 236171 INFO  (jetty-launcher-508-thread-1) [    ] o.a.s.c.OverseerElectionContext I am going to be the leader 127.0.0.1:33039_solr
   [junit4]   2> 236172 INFO  (jetty-launcher-508-thread-1) [    ] o.a.s.c.Overseer Overseer (id=98177384492957702-127.0.0.1:33039_solr-n_0000000000) starting
   [junit4]   2> 236172 INFO  (jetty-launcher-508-thread-3) [    ] o.a.s.c.ZkController Register node as live in ZooKeeper:/live_nodes/127.0.0.1:36351_solr
   [junit4]   2> 236172 INFO  (zkCallback-520-thread-1) [    ] o.a.s.c.c.ZkStateReader Updated live nodes from ZooKeeper... (0) -> (1)
   [junit4]   2> 236172 INFO  (zkCallback-523-thread-1) [    ] o.a.s.c.c.ZkStateReader Updated live nodes from ZooKeeper... (0) -> (1)
   [junit4]   2> 236173 INFO  (jetty-launcher-508-thread-2) [    ] o.a.s.c.Overseer Overseer (id=null) closing
   [junit4]   2> 236176 INFO  (zkCallback-526-thread-1) [    ] o.a.s.c.c.ZkStateReader Updated live nodes from ZooKeeper... (0) -> (1)
   [junit4]   2> 236178 INFO  (jetty-launcher-508-thread-1) [    ] o.a.s.c.ZkController Register node as live in ZooKeeper:/live_nodes/127.0.0.1:33039_solr
   [junit4]   2> 236177 INFO  (jetty-launcher-508-thread-2) [    ] o.a.s.c.ZkController Register node as live in ZooKeeper:/live_nodes/127.0.0.1:36919_solr
   [junit4]   2> 236180 INFO  (zkCallback-520-thread-1) [    ] o.a.s.c.c.ZkStateReader Updated live nodes from ZooKeeper... (1) -> (3)
   [junit4]   2> 236180 INFO  (zkCallback-523-thread-1) [    ] o.a.s.c.c.ZkStateReader Updated live nodes from ZooKeeper... (1) -> (3)
   [junit4]   2> 236180 INFO  (zkCallback-526-thread-1) [    ] o.a.s.c.c.ZkStateReader Updated live nodes from ZooKeeper... (1) -> (3)
   [junit4]   2> 236231 INFO  (jetty-launcher-508-thread-1) [    ] o.a.s.m.r.SolrJmxReporter JMX monitoring for 'solr_33039.solr.node' (registry 'solr.node') enabled at server: com.sun.jmx.mbeanserver.JmxMBeanServer@882072
   [junit4]   2> 236234 INFO  (jetty-launcher-508-thread-1) [    ] o.a.s.m.r.SolrJmxReporter JMX monitoring for 'solr_33039.solr.jvm' (registry 'solr.jvm') enabled at server: com.sun.jmx.mbeanserver.JmxMBeanServer@882072
   [junit4]   2> 236234 INFO  (jetty-launcher-508-thread-1) [    ] o.a.s.m.r.SolrJmxReporter JMX monitoring for 'solr_33039.solr.jetty' (registry 'solr.jetty') enabled at server: com.sun.jmx.mbeanserver.JmxMBeanServer@882072
   [junit4]   2> 236234 INFO  (jetty-launcher-508-thread-1) [    ] o.a.s.c.CorePropertiesLocator Found 0 core definitions underneath /home/jenkins/workspace/Lucene-Solr-master-Linux/solr/build/solr-core/test/J1/temp/solr.cloud.ClusterStateUpdateTest_25A18B9435646E6C-001/tempDir-001/node1/.
   [junit4]   2> 236240 INFO  (jetty-launcher-508-thread-3) [    ] o.a.s.m.r.SolrJmxReporter JMX monitoring for 'solr_36351.solr.node' (registry 'solr.node') enabled at server: com.sun.jmx.mbeanserver.JmxMBeanServer@882072
   [junit4]   2> 236243 INFO  (jetty-launcher-508-thread-3) [    ] o.a.s.m.r.SolrJmxReporter JMX monitoring for 'solr_36351.solr.jvm' (registry 'solr.jvm') enabled at server: com.sun.jmx.mbeanserver.JmxMBeanServer@882072
   [junit4]   2> 236243 INFO  (jetty-launcher-508-thread-3) [    ] o.a.s.m.r.SolrJmxReporter JMX monitoring for 'solr_36351.solr.jetty' (registry 'solr.jetty') enabled at server: com.sun.jmx.mbeanserver.JmxMBeanServer@882072
   [junit4]   2> 236243 INFO  (jetty-launcher-508-thread-3) [    ] o.a.s.c.CorePropertiesLocator Found 0 core definitions underneath /home/jenkins/workspace/Lucene-Solr-master-Linux/solr/build/solr-core/test/J1/temp/solr.cloud.ClusterStateUpdateTest_25A18B9435646E6C-001/tempDir-001/node3/.
   [junit4]   2> 236259 INFO  (jetty-launcher-508-thread-2) [    ] o.a.s.m.r.SolrJmxReporter JMX monitoring for 'solr_36919.solr.node' (registry 'solr.node') enabled at server: com.sun.jmx.mbeanserver.JmxMBeanServer@882072
   [junit4]   2> 236263 INFO  (jetty-launcher-508-thread-2) [    ] o.a.s.m.r.SolrJmxReporter JMX monitoring for 'solr_36919.solr.jvm' (registry 'solr.jvm') enabled at server: com.sun.jmx.mbeanserver.JmxMBeanServer@882072
   [junit4]   2> 236263 INFO  (jetty-launcher-508-thread-2) [    ] o.a.s.m.r.SolrJmxReporter JMX monitoring for 'solr_36919.solr.jetty' (registry 'solr.jetty') enabled at server: com.sun.jmx.mbeanserver.JmxMBeanServer@882072
   [junit4]   2> 236264 INFO  (jetty-launcher-508-thread-2) [    ] o.a.s.c.CorePropertiesLocator Found 0 core definitions underneath /home/jenkins/workspace/Lucene-Solr-master-Linux/solr/build/solr-core/test/J1/temp/solr.cloud.ClusterStateUpdateTest_25A18B9435646E6C-001/tempDir-001/node2/.
   [junit4]   2> 236282 INFO  (TEST-ClusterStateUpdateTest.testCoreRegistration-seed#[25A18B9435646E6C]) [    ] o.a.s.c.c.ZkStateReader Updated live nodes from ZooKeeper... (0) -> (3)
   [junit4]   2> 236282 INFO  (TEST-ClusterStateUpdateTest.testCoreRegistration-seed#[25A18B9435646E6C]) [    ] o.a.s.c.s.i.ZkClientClusterStateProvider Cluster at 127.0.0.1:33729/solr ready
   [junit4]   2> 236305 INFO  (qtp7242080-2868) [    ] o.a.s.h.a.CollectionsHandler Invoked Collection Action :create with params pullReplicas=0&replicationFactor=1&name=testcore&nrtReplicas=1&action=CREATE&numShards=1&tlogReplicas=0&createNodeSet=127.0.0.1:33039_solr&wt=javabin&version=2 and sendToOCPQueue=true
   [junit4]   2> 236307 INFO  (OverseerThreadFactory-1323-thread-1) [    ] o.a.s.c.CreateCollectionCmd Create collection testcore
   [junit4]   2> 236307 INFO  (OverseerThreadFactory-1323-thread-1) [    ] o.a.s.c.CreateCollectionCmd Only one config set found in zk - using it:conf
   [junit4]   2> 236410 INFO  (OverseerStateUpdate-98177384492957702-127.0.0.1:33039_solr-n_0000000000) [    ] o.a.s.c.o.SliceMutator createReplica() {
   [junit4]   2>   "operation":"ADDREPLICA",
   [junit4]   2>   "collection":"testcore",
   [junit4]   2>   "shard":"shard1",
   [junit4]   2>   "core":"testcore_shard1_replica_n1",
   [junit4]   2>   "state":"down",
   [junit4]   2>   "base_url":"https://127.0.0.1:33039/solr",
   [junit4]   2>   "type":"NRT"} 
   [junit4]   2> 236632 INFO  (qtp27251759-2866) [    ] o.a.s.h.a.CoreAdminOperation core create command qt=/admin/cores&coreNodeName=core_node1&collection.configName=conf&newCollection=true&name=testcore_shard1_replica_n1&action=CREATE&numShards=1&collection=testcore&shard=shard1&wt=javabin&version=2&replicaType=NRT
   [junit4]   2> 236632 INFO  (qtp27251759-2866) [    ] o.a.s.c.TransientSolrCoreCacheDefault Allocating transient cache for 2147483647 transient cores
   [junit4]   2> 236734 INFO  (zkCallback-520-thread-1) [    ] o.a.s.c.c.ZkStateReader A cluster state change: [WatchedEvent state:SyncConnected type:NodeDataChanged path:/collections/testcore/state.json] for collection [testcore] has occurred - updating... (live nodes size: [3])
   [junit4]   2> 236734 INFO  (zkCallback-520-thread-2) [    ] o.a.s.c.c.ZkStateReader A cluster state change: [WatchedEvent state:SyncConnected type:NodeDataChanged path:/collections/testcore/state.json] for collection [testcore] has occurred - updating... (live nodes size: [3])
   [junit4]   2> 237638 INFO  (qtp27251759-2866) [    ] o.a.s.c.SolrConfig Using Lucene MatchVersion: 7.0.0
   [junit4]   2> 237642 INFO  (qtp27251759-2866) [    ] o.a.s.s.IndexSchema [testcore_shard1_replica_n1] Schema name=minimal
   [junit4]   2> 237643 INFO  (qtp27251759-2866) [    ] o.a.s.s.IndexSchema Loaded schema minimal/1.1 with uniqueid field id
   [junit4]   2> 237643 INFO  (qtp27251759-2866) [    ] o.a.s.c.CoreContainer Creating SolrCore 'testcore_shard1_replica_n1' using configuration from collection testcore, trusted=true
   [junit4]   2> 237644 INFO  (qtp27251759-2866) [    ] o.a.s.m.r.SolrJmxReporter JMX monitoring for 'solr_33039.solr.core.testcore.shard1.replica_n1' (registry 'solr.core.testcore.shard1.replica_n1') enabled at server: com.sun.jmx.mbeanserver.JmxMBeanServer@882072
   [junit4]   2> 237644 INFO  (qtp27251759-2866) [    ] o.a.s.c.SolrCore solr.RecoveryStrategy.Builder
   [junit4]   2> 237644 INFO  (qtp27251759-2866) [    ] o.a.s.c.SolrCore [[testcore_shard1_replica_n1] ] Opening new SolrCore at [/home/jenkins/workspace/Lucene-Solr-master-Linux/solr/build/solr-core/test/J1/temp/solr.cloud.ClusterStateUpdateTest_25A18B9435646E6C-001/tempDir-001/node1/testcore_shard1_replica_n1], dataDir=[/home/jenkins/workspace/Lucene-Solr-master-Linux/solr/build/solr-core/test/J1/temp/solr.cloud.ClusterStateUpdateTest_25A18B9435646E6C-001/tempDir-001/node1/./testcore_shard1_replica_n1/data/]
   [junit4]   2> 237679 INFO  (qtp27251759-2866) [    ] o.a.s.u.UpdateHandler Using UpdateLog implementation: org.apache.solr.update.UpdateLog
   [junit4]   2> 237679 INFO  (qtp27251759-2866) [    ] o.a.s.u.UpdateLog Initializing UpdateLog: dataDir=null defaultSyncLevel=FLUSH numRecordsToKeep=100 maxNumLogsToKeep=10 numVersionBuckets=65536
   [junit4]   2> 237680 INFO  (qtp27251759-2866) [    ] o.a.s.u.CommitTracker Hard AutoCommit: disabled
   [junit4]   2> 237680 INFO  (qtp27251759-2866) [    ] o.a.s.u.CommitTracker Soft AutoCommit: disabled
   [junit4]   2> 237681 INFO  (qtp27251759-2866) [    ] o.a.s.s.SolrIndexSearcher Opening [Searcher@15cfb73[testcore_shard1_replica_n1] main]
   [junit4]   2> 237682 INFO  (qtp27251759-2866) [    ] o.a.s.r.ManagedResourceStorage Configured ZooKeeperStorageIO with znodeBase: /configs/conf
   [junit4]   2> 237682 INFO  (qtp27251759-2866) [    ] o.a.s.r.ManagedResourceStorage Loaded null at path _rest_managed.json using ZooKeeperStorageIO:path=/configs/conf
   [junit4]   2> 237683 INFO  (qtp27251759-2866) [    ] o.a.s.h.ReplicationHandler Commits will be reserved for  10000
   [junit4]   2> 237684 INFO  (searcherExecutor-1330-thread-1) [    ] o.a.s.c.SolrCore [testcore_shard1_replica_n1] Registered new searcher Searcher@15cfb73[testcore_shard1_replica_n1] main{ExitableDirectoryReader(UninvertingDirectoryReader())}
   [junit4]   2> 237684 INFO  (qtp27251759-2866) [    ] o.a.s.u.UpdateLog Could not find max version in index or recent updates, using new clock 1570838153626910720
   [junit4]   2> 237687 INFO  (qtp27251759-2866) [    ] o.a.s.c.ShardLeaderElectionContext Enough replicas found to continue.
   [junit4]   2> 237687 INFO  (qtp27251759-2866) [    ] o.a.s.c.ShardLeaderElectionContext I may be the new leader - try and sync
   [junit4]   2> 237687 INFO  (qtp27251759-2866) [    ] o.a.s.c.ShardLeaderElectionContext Found all replicas participating in election, clear LIR
   [junit4]   2> 237688 INFO  (qtp27251759-2866) [    ] o.a.s.c.ShardLeaderElectionContext I am the new leader: https://127.0.0.1:33039/solr/testcore_shard1_replica_n1/ shard1
   [junit4]   2> 237789 INFO  (zkCallback-520-thread-2) [    ] o.a.s.c.c.ZkStateReader A cluster state change: [WatchedEvent state:SyncConnected type:NodeDataChanged path:/collections/testcore/state.json] for collection [testcore] has occurred - updating... (live nodes size: [3])
   [junit4]   2> 237789 INFO  (zkCallback-520-thread-1) [    ] o.a.s.c.c.ZkStateReader A cluster state change: [WatchedEvent state:SyncConnected type:NodeDataChanged path:/collections/testcore/state.json] for collection [testcore] has occurred - updating... (live nodes size: [3])
   [junit4]   2> 237839 WARN  (qtp27251759-2866) [    ] o.a.s.c.ZkController Skipping recovery according to sys prop solrcloud.skip.autorecovery
   [junit4]   2> 237840 INFO  (qtp27251759-2866) [    ] o.a.s.s.HttpSolrCall [admin] webapp=null path=/admin/cores params={qt=/admin/cores&coreNodeName=core_node1&collection.configName=conf&newCollection=true&name=testcore_shard1_replica_n1&action=CREATE&numShards=1&collection=testcore&shard=shard1&wt=javabin&version=2&replicaType=NRT} status=0 QTime=1209
   [junit4]   2> 237842 INFO  (qtp7242080-2868) [    ] o.a.s.h.a.CollectionsHandler Wait for new collection to be active for at most 30 seconds. Check all shard replicas
   [junit4]   2> 237941 INFO  (zkCallback-520-thread-1) [    ] o.a.s.c.c.ZkStateReader A cluster state change: [WatchedEvent state:SyncConnected type:NodeDataChanged path:/collections/testcore/state.json] for collection [testcore] has occurred - updating... (live nodes size: [3])
   [junit4]   2> 237941 INFO  (zkCallback-520-thread-2) [    ] o.a.s.c.c.ZkStateReader A cluster state change: [WatchedEvent state:SyncConnected type:NodeDataChanged path:/collections/testcore/state.json] for collection [testcore] has occurred - updating... (live nodes size: [3])
   [junit4]   2> 238308 INFO  (OverseerCollectionConfigSetProcessor-98177384492957702-127.0.0.1:33039_solr-n_0000000000) [    ] o.a.s.c.OverseerTaskQueue Response ZK path: /overseer/collection-queue-work/qnr-0000000000 doesn't exist.  Requestor may have disconnected from ZooKeeper
   [junit4]   2> 238843 INFO  (qtp7242080-2868) [    ] o.a.s.s.HttpSolrCall [admin] webapp=null path=/admin/collections params={pullReplicas=0&replicationFactor=1&name=testcore&nrtReplicas=1&action=CREATE&numShards=1&tlogReplicas=0&createNodeSet=127.0.0.1:33039_solr&wt=javabin&version=2} status=0 QTime=2537
   [junit4]   2> 238844 INFO  (TEST-ClusterStateUpdateTest.testCoreRegistration-seed#[25A18B9435646E6C]) [    ] o.a.s.SolrTestCaseJ4 ###Ending testCoreRegistration
   [junit4]   2> NOTE: reproduce with: ant test  -Dtestcase=ClusterStateUpdateTest -Dtests.method=testCoreRegistration -Dtests.seed=25A18B9435646E6C -Dtests.multiplier=3 -Dtests.slow=true -Dtests.locale=rm-CH -Dtests.timezone=America/Metlakatla -Dtests.asserts=true -Dtests.file.encoding=UTF-8
   [junit4] FAILURE 2.82s J1 | ClusterStateUpdateTest.testCoreRegistration <<<
   [junit4]    > Throwable #1: org.junit.ComparisonFailure: expected:<http[]://127.0.0.1:33039/s...> but was:<http[s]://127.0.0.1:33039/s...>
   [junit4]    > 	at __randomizedtesting.SeedInfo.seed([25A18B9435646E6C:9B2AED3B4C1E6059]:0)
   [junit4]    > 	at org.apache.solr.cloud.ClusterStateUpdateTest.testCoreRegistration(ClusterStateUpdateTest.java:104)
   [junit4]    > 	at java.base/jdk.internal.reflect.NativeMethodAccessorImpl.invoke0(Native Method)
   [junit4]    > 	at java.base/jdk.internal.reflect.NativeMethodAccessorImpl.invoke(NativeMethodAccessorImpl.java:62)
   [junit4]    > 	at java.base/jdk.internal.reflect.DelegatingMethodAccessorImpl.invoke(DelegatingMethodAccessorImpl.java:43)
   [junit4]    > 	at java.base/java.lang.reflect.Method.invoke(Method.java:564)
   [junit4]    > 	at java.base/java.lang.Thread.run(Thread.java:844)
   [junit4]   2> 238847 INFO  (jetty-closer-509-thread-1) [    ] o.e.j.s.AbstractConnector Stopped ServerConnector@1ba921a{SSL,[ssl, http/1.1]}{127.0.0.1:0}
   [junit4]   2> 238847 INFO  (jetty-closer-509-thread-2) [    ] o.e.j.s.AbstractConnector Stopped ServerConnector@bf8362{SSL,[ssl, http/1.1]}{127.0.0.1:0}
   [junit4]   2> 238847 INFO  (jetty-closer-509-thread-1) [    ] o.a.s.c.CoreContainer Shutting down CoreContainer instance=29625386
   [junit4]   2> 238848 INFO  (jetty-closer-509-thread-2) [    ] o.a.s.c.CoreContainer Shutting down CoreContainer instance=27465544
   [junit4]   2> 238847 INFO  (jetty-closer-509-thread-3) [    ] o.e.j.s.AbstractConnector Stopped ServerConnector@16b5b8e{SSL,[ssl, http/1.1]}{127.0.0.1:0}
   [junit4]   2> 238848 INFO  (jetty-closer-509-thread-3) [    ] o.a.s.c.CoreContainer Shutting down CoreContainer instance=15665311
   [junit4]   2> 238848 INFO  (jetty-closer-509-thread-1) [    ] o.a.s.m.SolrMetricManager Closing metric reporters for registry=solr.node, tag=null
   [junit4]   2> 238848 INFO  (jetty-closer-509-thread-3) [    ] o.a.s.m.SolrMetricManager Closing metric reporters for registry=solr.node, tag=null
   [junit4]   2> 238849 INFO  (jetty-closer-509-thread-1) [    ] o.a.s.m.SolrMetricManager Closing metric reporters for registry=solr.jvm, tag=null
   [junit4]   2> 238849 INFO  (jetty-closer-509-thread-3) [    ] o.a.s.m.SolrMetricManager Closing metric reporters for registry=solr.jvm, tag=null
   [junit4]   2> 238849 INFO  (jetty-closer-509-thread-2) [    ] o.a.s.m.SolrMetricManager Closing metric reporters for registry=solr.node, tag=null
   [junit4]   2> 238850 INFO  (jetty-closer-509-thread-1) [    ] o.a.s.m.SolrMetricManager Closing metric reporters for registry=solr.jetty, tag=null
   [junit4]   2> 238850 INFO  (jetty-closer-509-thread-3) [    ] o.a.s.m.SolrMetricManager Closing metric reporters for registry=solr.jetty, tag=null
   [junit4]   2> 238850 INFO  (jetty-closer-509-thread-3) [    ] o.a.s.m.SolrMetricManager Closing metric reporters for registry=solr.cluster, tag=null
   [junit4]   2> 238850 INFO  (jetty-closer-509-thread-1) [    ] o.a.s.m.SolrMetricManager Closing metric reporters for registry=solr.cluster, tag=null
   [junit4]   2> 238851 INFO  (jetty-closer-509-thread-3) [    ] o.a.s.c.TransientSolrCoreCacheDefault Allocating transient cache for 2147483647 transient cores
   [junit4]   2> 238851 INFO  (coreCloseExecutor-1335-thread-1) [    ] o.a.s.c.SolrCore [testcore_shard1_replica_n1]  CLOSING SolrCore org.apache.solr.core.SolrCore@15b2774
   [junit4]   2> 238851 INFO  (jetty-closer-509-thread-2) [    ] o.a.s.m.SolrMetricManager Closing metric reporters for registry=solr.jvm, tag=null
   [junit4]   2> 238851 INFO  (zkCallback-523-thread-1) [    ] o.a.s.c.c.ZkStateReader Updated live nodes from ZooKeeper... (3) -> (2)
   [junit4]   2> 238851 INFO  (zkCallback-520-thread-2) [    ] o.a.s.c.c.ZkStateReader Updated live nodes from ZooKeeper... (3) -> (2)
   [junit4]   2> 238852 INFO  (coreCloseExecutor-1335-thread-1) [    ] o.a.s.m.SolrMetricManager Closing metric reporters for registry=solr.core.testcore.shard1.replica_n1, tag=22751092
   [junit4]   2> 238852 INFO  (jetty-closer-509-thread-2) [    ] o.a.s.m.SolrMetricManager Closing metric reporters for registry=solr.jetty, tag=null
   [junit4]   2> 238852 INFO  (jetty-closer-509-thread-2) [    ] o.a.s.m.SolrMetricManager Closing metric reporters for registry=solr.cluster, tag=null
   [junit4]   2> 238852 INFO  (jetty-closer-509-thread-2) [    ] o.a.s.c.TransientSolrCoreCacheDefault Allocating transient cache for 2147483647 transient cores
   [junit4]   2> 238853 INFO  (zkCallback-520-thread-2) [    ] o.a.s.c.c.ZkStateReader Updated live nodes from ZooKeeper... (2) -> (1)
   [junit4]   2> 238853 WARN  (zkCallback-523-thread-1) [    ] o.a.s.c.c.ZkStateReader ZooKeeper watch triggered, but Solr cannot talk to ZK: [KeeperErrorCode = Session expired for /live_nodes]
   [junit4]   2> 238853 INFO  (jetty-closer-509-thread-2) [    ] o.e.j.s.h.ContextHandler Stopped o.e.j.s.ServletContextHandler@948764{/solr,null,UNAVAILABLE}
   [junit4]   2> 238854 INFO  (coreCloseExecutor-1335-thread-1) [    ] o.a.s.m.SolrMetricManager Closing metric reporters for registry=solr.collection.testcore.shard1.leader, tag=22751092
   [junit4]   2> 238854 INFO  (jetty-closer-509-thread-1) [    ] o.a.s.c.Overseer Overseer (id=98177384492957702-127.0.0.1:33039_solr-n_0000000000) closing
   [junit4]   2> 238854 INFO  (OverseerStateUpdate-98177384492957702-127.0.0.1:33039_solr-n_0000000000) [    ] o.a.s.c.Overseer Overseer Loop exiting : 127.0.0.1:33039_solr
   [junit4]   2> 240351 WARN  (zkCallback-526-thread-1) [    ] o.a.s.c.c.ZkStateReader ZooKeeper watch triggered, but Solr cannot talk to ZK: [KeeperErrorCode = Session expired for /live_nodes]
   [junit4]   2> 240352 INFO  (jetty-closer-509-thread-3) [    ] o.e.j.s.h.ContextHandler Stopped o.e.j.s.ServletContextHandler@6f452c{/solr,null,UNAVAILABLE}
   [junit4]   2> 240355 WARN  (zkCallback-520-thread-2) [    ] o.a.s.c.c.ZkStateReader ZooKeeper watch triggered, but Solr cannot talk to ZK: [KeeperErrorCode = Session expired for /live_nodes]
   [junit4]   2> 240355 INFO  (jetty-closer-509-thread-1) [    ] o.e.j.s.h.ContextHandler Stopped o.e.j.s.ServletContextHandler@ed603b{/solr,null,UNAVAILABLE}
   [junit4]   2> 240356 ERROR (SUITE-ClusterStateUpdateTest-seed#[25A18B9435646E6C]-worker) [    ] o.a.z.s.ZooKeeperServer ZKShutdownHandler is not registered, so ZooKeeper server won't take any action on ERROR or SHUTDOWN server state changes
   [junit4]   2> 240356 INFO  (SUITE-ClusterStateUpdateTest-seed#[25A18B9435646E6C]-worker) [    ] o.a.s.c.ZkTestServer connecting to 127.0.0.1:33729 33729
   [junit4]   2> 240416 INFO  (Thread-603) [    ] o.a.s.c.ZkTestServer connecting to 127.0.0.1:33729 33729
   [junit4]   2> 240417 WARN  (Thread-603) [    ] o.a.s.c.ZkTestServer Watch limit violations: 
   [junit4]   2> Maximum concurrent create/delete watches above limit:
   [junit4]   2> 
   [junit4]   2> 	4	/solr/aliases.json
   [junit4]   2> 	3	/solr/security.json
   [junit4]   2> 
   [junit4]   2> Maximum concurrent data watches above limit:
   [junit4]   2> 
   [junit4]   2> 	5	/solr/collections/testcore/state.json
   [junit4]   2> 	4	/solr/clusterstate.json
   [junit4]   2> 	4	/solr/clusterprops.json
   [junit4]   2> 
   [junit4]   2> Maximum concurrent children watches above limit:
   [junit4]   2> 
   [junit4]   2> 	4	/solr/live_nodes
   [junit4]   2> 	4	/solr/collections
   [junit4]   2> 
   [junit4]   2> NOTE: leaving temporary files on disk at: /home/jenkins/workspace/Lucene-Solr-master-Linux/solr/build/solr-core/test/J1/temp/solr.cloud.ClusterStateUpdateTest_25A18B9435646E6C-001
   [junit4]   2> Jun 21, 2017 6:00:05 PM com.carrotsearch.randomizedtesting.ThreadLeakControl checkThreadLeaks
   [junit4]   2> WARNING: Will linger awaiting termination of 1 leaked thread(s).
   [junit4]   2> NOTE: test params are: codec=Asserting(Lucene70): {}, docValues:{}, maxPointsInLeafNode=315, maxMBSortInHeap=6.051725824725412, sim=RandomSimilarity(queryNorm=false): {}, locale=rm-CH, timezone=America/Metlakatla
   [junit4]   2> NOTE: Linux 4.10.0-21-generic i386/Oracle Corporation 9-ea (32-bit)/cpus=8,threads=1,free=161084776,total=536870912
   [junit4]   2> NOTE: All tests run in this JVM: [DeleteNodeTest, IndexSchemaTest, TestInitParams, TestRTimerTree, TestRawTransformer, LeaderInitiatedRecoveryOnCommitTest, TestCoreContainer, TestMacroExpander, ClassificationUpdateProcessorIntegrationTest, TestNumericRangeQuery64, AnalyticsQueryTest, TestCloudNestedDocsSort, UpdateLogTest, UtilsToolTest, TestScoreJoinQPScore, SimplePostToolTest, SpellCheckComponentTest, HdfsWriteToMultipleCollectionsTest, TestCloudSchemaless, TestLegacyFieldCache, SegmentsInfoRequestHandlerTest, CollectionsAPIAsyncDistributedZkTest, SampleTest, TestFieldResource, MoreLikeThisHandlerTest, HttpSolrCallGetCoreTest, SystemInfoHandlerTest, TestStandardQParsers, HdfsDirectoryFactoryTest, OverseerStatusTest, DirectSolrSpellCheckerTest, AutoScalingHandlerTest, CollectionReloadTest, TestDynamicFieldCollectionResource, QueryParsingTest, TestPerFieldSimilarity, TestEmbeddedSolrServerSchemaAPI, SolrMetricManagerTest, IndexBasedSpellCheckerTest, DistributedFacetPivotSmallTest, TestSolrCloudWithDelegationTokens, TestBulkSchemaConcurrent, TestSortByMinMaxFunction, SSLMigrationTest, ClusterStateUpdateTest]
   [junit4] Completed [95/725 (1!)] on J1 in 5.41s, 1 test, 1 failure <<< FAILURES!

[...truncated 28 lines...]
   [junit4] Suite: org.apache.solr.cloud.CollectionsAPISolrJTest
   [junit4]   2> Creating dataDir: /home/jenkins/workspace/Lucene-Solr-master-Linux/solr/build/solr-core/test/J2/temp/solr.cloud.CollectionsAPISolrJTest_25A18B9435646E6C-001/init-core-data-001
   [junit4]   2> 248277 WARN  (SUITE-CollectionsAPISolrJTest-seed#[25A18B9435646E6C]-worker) [    ] o.a.s.SolrTestCaseJ4 startTrackingSearchers: numOpens=1 numCloses=1
   [junit4]   2> 248278 INFO  (SUITE-CollectionsAPISolrJTest-seed#[25A18B9435646E6C]-worker) [    ] o.a.s.SolrTestCaseJ4 Using PointFields
   [junit4]   2> 248278 INFO  (SUITE-CollectionsAPISolrJTest-seed#[25A18B9435646E6C]-worker) [    ] o.a.s.SolrTestCaseJ4 Randomized ssl (true) and clientAuth (true) via: @org.apache.solr.util.RandomizeSSL(reason="", ssl=0.0/0.0, value=0.0/0.0, clientAuth=0.0/0.0)
   [junit4]   2> 248279 INFO  (SUITE-CollectionsAPISolrJTest-seed#[25A18B9435646E6C]-worker) [    ] o.a.s.c.MiniSolrCloudCluster Starting cluster of 4 servers in /home/jenkins/workspace/Lucene-Solr-master-Linux/solr/build/solr-core/test/J2/temp/solr.cloud.CollectionsAPISolrJTest_25A18B9435646E6C-001/tempDir-001
   [junit4]   2> 248279 INFO  (SUITE-CollectionsAPISolrJTest-seed#[25A18B9435646E6C]-worker) [    ] o.a.s.c.ZkTestServer STARTING ZK TEST SERVER
   [junit4]   2> 248279 INFO  (Thread-532) [    ] o.a.s.c.ZkTestServer client port:0.0.0.0/0.0.0.0:0
   [junit4]   2> 248279 INFO  (Thread-532) [    ] o.a.s.c.ZkTestServer Starting server
   [junit4]   2> 248284 ERROR (Thread-532) [    ] o.a.z.s.ZooKeeperServer ZKShutdownHandler is not registered, so ZooKeeper server won't take any action on ERROR or SHUTDOWN server state changes
   [junit4]   2> 248379 INFO  (SUITE-CollectionsAPISolrJTest-seed#[25A18B9435646E6C]-worker) [    ] o.a.s.c.ZkTestServer start zk server on port:35467
   [junit4]   2> 248384 INFO  (jetty-launcher-424-thread-1) [    ] o.e.j.s.Server jetty-9.3.14.v20161028
   [junit4]   2> 248385 INFO  (jetty-launcher-424-thread-2) [    ] o.e.j.s.Server jetty-9.3.14.v20161028
   [junit4]   2> 248386 INFO  (jetty-launcher-424-thread-3) [    ] o.e.j.s.Server jetty-9.3.14.v20161028
   [junit4]   2> 248392 INFO  (jetty-launcher-424-thread-4) [    ] o.e.j.s.Server jetty-9.3.14.v20161028
   [junit4]   2> 248397 INFO  (jetty-launcher-424-thread-2) [    ] o.e.j.s.h.ContextHandler Started o.e.j.s.ServletContextHandler@a89c5e{/solr,null,AVAILABLE}
   [junit4]   2> 248397 INFO  (jetty-launcher-424-thread-1) [    ] o.e.j.s.h.ContextHandler Started o.e.j.s.ServletContextHandler@8e9efc{/solr,null,AVAILABLE}
   [junit4]   2> 248398 INFO  (jetty-launcher-424-thread-2) [    ] o.e.j.s.AbstractConnector Started ServerConnector@5e2c61{SSL,[ssl, http/1.1]}{127.0.0.1:37067}
   [junit4]   2> 248398 INFO  (jetty-launcher-424-thread-2) [    ] o.e.j.s.Server Started @250324ms
   [junit4]   2> 248398 INFO  (jetty-launcher-424-thread-2) [    ] o.a.s.c.s.e.JettySolrRunner Jetty properties: {hostContext=/solr, hostPort=37067}
   [junit4]   2> 248398 ERROR (jetty-launcher-424-thread-2) [    ] o.a.s.s.StartupLoggingUtils Missing Java Option solr.log.dir. Logging may be missing or incomplete.
   [junit4]   2> 248398 INFO  (jetty-launcher-424-thread-2) [    ] o.a.s.s.SolrDispatchFilter  ___      _       Welcome to Apache Solr™ version 7.0.0
   [junit4]   2> 248398 INFO  (jetty-launcher-424-thread-2) [    ] o.a.s.s.SolrDispatchFilter / __| ___| |_ _   Starting in cloud mode on port null
   [junit4]   2> 248398 INFO  (jetty-launcher-424-thread-2) [    ] o.a.s.s.SolrDispatchFilter \__ \/ _ \ | '_|  Install dir: null
   [junit4]   2> 248398 INFO  (jetty-launcher-424-thread-2) [    ] o.a.s.s.SolrDispatchFilter |___/\___/_|_|    Start time: 2017-06-21T18:00:12.425404Z
   [junit4]   2> 248398 INFO  (jetty-launcher-424-thread-4) [    ] o.e.j.s.h.ContextHandler Started o.e.j.s.ServletContextHandler@5d93eb{/solr,null,AVAILABLE}
   [junit4]   2> 248398 INFO  (jetty-launcher-424-thread-4) [    ] o.e.j.s.AbstractConnector Started ServerConnector@118829d{SSL,[ssl, http/1.1]}{127.0.0.1:36693}
   [junit4]   2> 248398 INFO  (jetty-launcher-424-thread-4) [    ] o.e.j.s.Server Started @250325ms
   [junit4]   2> 248398 INFO  (jetty-launcher-424-thread-4) [    ] o.a.s.c.s.e.JettySolrRunner Jetty properties: {hostContext=/solr, hostPort=36693}
   [junit4]   2> 248399 ERROR (jetty-launcher-424-thread-4) [    ] o.a.s.s.StartupLoggingUtils Missing Java Option solr.log.dir. Logging may be missing or incomplete.
   [junit4]   2> 248399 INFO  (jetty-launcher-424-thread-4) [    ] o.a.s.s.SolrDispatchFilter  ___      _       Welcome to Apache Solr™ version 7.0.0
   [junit4]   2> 248399 INFO  (jetty-launcher-424-thread-4) [    ] o.a.s.s.SolrDispatchFilter / __| ___| |_ _   Starting in cloud mode on port null
   [junit4]   2> 248399 INFO  (jetty-launcher-424-thread-4) [    ] o.a.s.s.SolrDispatchFilter \__ \/ _ \ | '_|  Install dir: null
   [junit4]   2> 248399 INFO  (jetty-launcher-424-thread-4) [    ] o.a.s.s.SolrDispatchFilter |___/\___/_|_|    Start time: 2017-06-21T18:00:12.426175Z
   [junit4]   2> 248401 INFO  (jetty-launcher-424-thread-1) [    ] o.e.j.s.AbstractConnector Started ServerConnector@d5127a{SSL,[ssl, http/1.1]}{127.0.0.1:32909}
   [junit4]   2> 248401 INFO  (jetty-launcher-424-thread-1) [    ] o.e.j.s.Server Started @250327ms
   [junit4]   2> 248401 INFO  (jetty-launcher-424-thread-1) [    ] o.a.s.c.s.e.JettySolrRunner Jetty properties: {hostContext=/solr, hostPort=32909}
   [junit4]   2> 248401 INFO  (jetty-launcher-424-thread-3) [    ] o.e.j.s.h.ContextHandler Started o.e.j.s.ServletContextHandler@42c940{/solr,null,AVAILABLE}
   [junit4]   2> 248401 ERROR (jetty-launcher-424-thread-1) [    ] o.a.s.s.StartupLoggingUtils Missing Java Option solr.log.dir. Logging may be missing or incomplete.
   [junit4]   2> 248401 INFO  (jetty-launcher-424-thread-1) [    ] o.a.s.s.SolrDispatchFilter  ___      _       Welcome to Apache Solr™ version 7.0.0
   [junit4]   2> 248401 INFO  (jetty-launcher-424-thread-1) [    ] o.a.s.s.SolrDispatchFilter / __| ___| |_ _   Starting in cloud mode on port null
   [junit4]   2> 248401 INFO  (jetty-launcher-424-thread-1) [    ] o.a.s.s.SolrDispatchFilter \__ \/ _ \ | '_|  Install dir: null
   [junit4]   2> 248401 INFO  (jetty-launcher-424-thread-1) [    ] o.a.s.s.SolrDispatchFilter |___/\___/_|_|    Start time: 2017-06-21T18:00:12.428716Z
   [junit4]   2> 248401 INFO  (jetty-launcher-424-thread-2) [    ] o.a.s.s.SolrDispatchFilter solr.xml found in ZooKeeper. Loading...
   [junit4]   2> 248401 INFO  (jetty-launcher-424-thread-3) [    ] o.e.j.s.AbstractConnector Started ServerConnector@1723f98{SSL,[ssl, http/1.1]}{127.0.0.1:38941}
   [junit4]   2> 248402 INFO  (jetty-launcher-424-thread-3) [    ] o.e.j.s.Server Started @250328ms
   [junit4]   2> 248402 INFO  (jetty-launcher-424-thread-3) [    ] o.a.s.c.s.e.JettySolrRunner Jetty properties: {hostContext=/solr, hostPort=38941}
   [junit4]   2> 248402 ERROR (jetty-launcher-424-thread-3) [    ] o.a.s.s.StartupLoggingUtils Missing Java Option solr.log.dir. Logging may be missing or incomplete.
   [junit4]   2> 248402 INFO  (jetty-launcher-424-thread-3) [    ] o.a.s.s.SolrDispatchFilter  ___      _       Welcome to Apache Solr™ version 7.0.0
   [junit4]   2> 248402 INFO  (jetty-launcher-424-thread-3) [    ] o.a.s.s.SolrDispatchFilter / __| ___| |_ _   Starting in cloud mode on port null
   [junit4]   2> 248402 INFO  (jetty-launcher-424-thread-3) [    ] o.a.s.s.SolrDispatchFilter \__ \/ _ \ | '_|  Install dir: null
   [junit4]   2> 248402 INFO  (jetty-launcher-424-thread-3) [    ] o.a.s.s.SolrDispatchFilter |___/\___/_|_|    Start time: 2017-06-21T18:00:12.429583Z
   [junit4]   2> 248404 WARN  (NIOServerCxn.Factory:0.0.0.0/0.0.0.0:0) [    ] o.a.z.s.NIOServerCnxn caught end of stream exception
   [junit4]   2> EndOfStreamException: Unable to read additional data from client sessionid 0x15ccbcfcd130001, likely client has closed socket
   [junit4]   2> 	at org.apache.zookeeper.server.NIOServerCnxn.doIO(NIOServerCnxn.java:239)
   [junit4]   2> 	at org.apache.zookeeper.server.NIOServerCnxnFactory.run(NIOServerCnxnFactory.java:203)
   [junit4]   2> 	at java.base/java.lang.Thread.run(Thread.java:844)
   [junit4]   2> 248405 INFO  (jetty-launcher-424-thread-1) [    ] o.a.s.s.SolrDispatchFilter solr.xml found in ZooKeeper. Loading...
   [junit4]   2> 248405 INFO  (jetty-launcher-424-thread-3) [    ] o.a.s.s.SolrDispatchFilter solr.xml found in ZooKeeper. Loading...
   [junit4]   2> 248405 INFO  (jetty-launcher-424-thread-4) [    ] o.a.s.s.SolrDispatchFilter solr.xml found in ZooKeeper. Loading...
   [junit4]   2> 248406 INFO  (jetty-launcher-424-thread-2) [    ] o.a.s.c.ZkContainer Zookeeper client=127.0.0.1:35467/solr
   [junit4]   2> 248409 INFO  (jetty-launcher-424-thread-4) [    ] o.a.s.c.ZkContainer Zookeeper client=127.0.0.1:35467/solr
   [junit4]   2> 248415 INFO  (jetty-launcher-424-thread-3) [    ] o.a.s.c.ZkContainer Zookeeper client=127.0.0.1:35467/solr
   [junit4]   2> 248418 INFO  (jetty-launcher-424-thread-1) [    ] o.a.s.c.ZkContainer Zookeeper client=127.0.0.1:35467/solr
   [junit4]   2> 248419 INFO  (jetty-launcher-424-thread-2) [    ] o.a.s.c.Overseer Overseer (id=null) closing
   [junit4]   2> 248422 INFO  (jetty-launcher-424-thread-2) [    ] o.a.s.c.OverseerElectionContext I am going to be the leader 127.0.0.1:37067_solr
   [junit4]   2> 248423 INFO  (jetty-launcher-424-thread-2) [    ] o.a.s.c.Overseer Overseer (id=98177385254551558-127.0.0.1:37067_solr-n_0000000000) starting
   [junit4]   2> 248423 WARN  (NIOServerCxn.Factory:0.0.0.0/0.0.0.0:0) [    ] o.a.z.s.NIOServerCnxn caught end of stream exception
   [junit4]   2> EndOfStreamException: Unable to read additional data from client sessionid 0x15ccbcfcd13000a, likely client has closed socket
   [junit4]   2> 	at org.apache.zookeeper.server.NIOServerCnxn.doIO(NIOServerCnxn.java:239)
   [junit4]   2> 	at org.apache.zookeeper.server.NIOServerCnxnFactory.run(NIOServerCnxnFactory.java:203)
   [junit4]   2> 	at java.base/java.lang.Thread.run(Thread.java:844)
   [junit4]   2> 248425 INFO  (jetty-launcher-424-thread-4) [    ] o.a.s.c.Overseer Overseer (id=null) closing
   [junit4]   2> 248425 INFO  (jetty-launcher-424-thread-4) [    ] o.a.s.c.ZkController Register node as live in ZooKeeper:/live_nodes/127.0.0.1:36693_solr
   [junit4]   2> 248426 INFO  (zkCallback-434-thread-1) [    ] o.a.s.c.c.ZkStateReader Updated live nodes from ZooKeeper... (0) -> (1)
   [junit4]   2> 248426 INFO  (zkCallback-439-thread-1) [    ] o.a.s.c.c.ZkStateReader Updated live nodes from ZooKeeper... (0) -> (1)
   [junit4]   2> 248427 INFO  (jetty-launcher-424-thread-3) [    ] o.a.s.c.c.ZkStateReader Updated live nodes from ZooKeeper... (0) -> (1)
   [junit4]   2> 248428 INFO  (jetty-launcher-424-thread-3) [    ] o.a.s.c.Overseer Overseer (id=null) closing
   [junit4]   2> 248429 INFO  (jetty-launcher-424-thread-3) [    ] o.a.s.c.ZkController Register node as live in ZooKeeper:/live_nodes/127.0.0.1:38941_solr
   [junit4]   2> 248429 INFO  (zkCallback-439-thread-1) [    ] o.a.s.c.c.ZkStateReader Updated live nodes from ZooKeeper... (1) -> (2)
   [junit4]   2> 248429 INFO  (zkCallback-434-thread-1) [    ] o.a.s.c.c.ZkStateReader Updated live nodes from ZooKeeper... (1) -> (2)
   [junit4]   2> 248432 INFO  (jetty-launcher-424-thread-2) [    ] o.a.s.c.ZkController Register node as live in ZooKeeper:/live_nodes/127.0.0.1:37067_solr
   [junit4]   2> 248433 INFO  (zkCallback-439-thread-1) [    ] o.a.s.c.c.ZkStateReader Updated live nodes from ZooKeeper... (2) -> (3)
   [junit4]   2> 248433 INFO  (zkCallback-434-thread-1) [    ] o.a.s.c.c.ZkStateReader Updated live nodes from ZooKeeper... (2) -> (3)
   [junit4]   2> 248434 INFO  (zkCallback-446-thread-1) [    ] o.a.s.c.c.ZkStateReader Updated live nodes from ZooKeeper... (1) -> (2)
   [junit4]   2> 248434 INFO  (jetty-launcher-424-thread-1) [    ] o.a.s.c.c.ZkStateReader Updated live nodes from ZooKeeper... (0) -> (3)
   [junit4]   2> 248434 INFO  (jetty-launcher-424-thread-1) [    ] o.a.s.c.Overseer Overseer (id=null) closing
   [junit4]   2> 248438 INFO  (zkCallback-446-thread-2) [    ] o.a.s.c.c.ZkStateReader Updated live nodes from ZooKeeper... (2) -> (3)
   [junit4]   2> 248439 INFO  (jetty-launcher-424-thread-1) [    ] o.a.s.c.ZkController Register node as live in ZooKeeper:/live_nodes/127.0.0.1:32909_solr
   [junit4]   2> 248439 INFO  (zkCallback-434-thread-1) [    ] o.a.s.c.c.ZkStateReader Updated live nodes from ZooKeeper... (3) -> (4)
   [junit4]   2> 248440 INFO  (zkCallback-447-thread-1) [    ] o.a.s.c.c.ZkStateReader Updated live nodes from ZooKeeper... (3) -> (4)
   [junit4]   2> 248440 INFO  (zkCallback-446-thread-2) [    ] o.a.s.c.c.ZkStateReader Updated live nodes from ZooKeeper... (3) -> (4)
   [junit4]   2> 248440 INFO  (zkCallback-439-thread-1) [    ] o.a.s.c.c.ZkStateReader Updated live nodes from ZooKeeper... (3) -> (4)
   [junit4]   2> 248491 INFO  (jetty-launcher-424-thread-3) [    ] o.a.s.m.r.SolrJmxReporter JMX monitoring for 'solr_38941.solr.node' (registry 'solr.node') enabled at server: com.sun.jmx.mbeanserver.JmxMBeanServer@adebe8
   [junit4]   2> 248495 INFO  (jetty-launcher-424-thread-3) [    ] o.a.s.m.r.SolrJmxReporter JMX monitoring for 'solr_38941.solr.jvm' (registry 'solr.jvm') enabled at server: com.sun.jmx.mbeanserver.JmxMBeanServer@adebe8
   [junit4]   2> 248495 INFO  (jetty-launcher-424-thread-3) [    ] o.a.s.m.r.SolrJmxReporter JMX monitoring for 'solr_38941.solr.jetty' (registry 'solr.jetty') enabled at server: com.sun.jmx.mbeanserver.JmxMBeanServer@adebe8
   [junit4]   2> 248496 INFO  (jetty-launcher-424-thread-3) [    ] o.a.s.c.CorePropertiesLocator Found 0 core definitions underneath /home/jenkins/workspace/Lucene-Solr-master-Linux/solr/build/solr-core/test/J2/temp/solr.cloud.CollectionsAPISolrJTest_25A18B9435646E6C-001/tempDir-001/node3/.
   [junit4]   2> 248513 INFO  (jetty-launcher-424-thread-2) [    ] o.a.s.m.r.SolrJmxReporter JMX monitoring for 'solr_37067.solr.node' (registry 'solr.node') enabled at server: com.sun.jmx.mbeanserver.JmxMBeanServer@adebe8
   [junit4]   2> 248516 INFO  (jetty-launcher-424-thread-2) [    ] o.a.s.m.r.SolrJmxReporter JMX monitoring for 'solr_37067.solr.jvm' (registry 'solr.jvm') enabled at server: com.sun.jmx.mbeanserver.JmxMBeanServer@adebe8
   [junit4]   2> 248516 INFO  (jetty-launcher-424-thread-2) [    ] o.a.s.m.r.SolrJmxReporter JMX monitoring for 'solr_37067.solr.jetty' (registry 'solr.jetty') enabled at server: com.sun.jmx.mbeanserver.JmxMBeanServer@adebe8
   [junit4]   2> 248516 INFO  (jetty-launcher-424-thread-2) [    ] o.a.s.c.CorePropertiesLocator Found 0 core definitions underneath /home/jenkins/workspace/Lucene-Solr-master-Linux/solr/build/solr-core/test/J2/temp/solr.cloud.CollectionsAPISolrJTest_25A18B9435646E6C-001/tempDir-001/node2/.
   [junit4]   2> 248539 INFO  (jetty-launcher-424-thread-1) [    ] o.a.s.m.r.SolrJmxReporter JMX monitoring for 'solr_32909.solr.node' (registry 'solr.node') enabled at server: com.sun.jmx.mbeanserver.JmxMBeanServer@adebe8
   [junit4]   2> 248541 INFO  (jetty-launcher-424-thread-1) [    ] o.a.s.m.r.SolrJmxReporter JMX monitoring for 'solr_32909.solr.jvm' (registry 'solr.jvm') enabled at server: com.sun.jmx.mbeanserver.JmxMBeanServer@adebe8
   [junit4]   2> 248541 INFO  (jetty-launcher-424-thread-1) [    ] o.a.s.m.r.SolrJmxReporter JMX monitoring for 'solr_32909.solr.jetty' (registry 'solr.jetty') enabled at server: com.sun.jmx.mbeanserver.JmxMBeanServer@adebe8
   [junit4]   2> 248542 INFO  (jetty-launcher-424-thread-1) [    ] o.a.s.c.CorePropertiesLocator Found 0 core definitions underneath /home/jenkins/workspace/Lucene-Solr-master-Linux/solr/build/solr-core/test/J2/temp/solr.cloud.CollectionsAPISolrJTest_25A18B9435646E6C-001/tempDir-001/node1/.
   [junit4]   2> 248561 INFO  (jetty-launcher-424-thread-4) [    ] o.a.s.m.r.SolrJmxReporter JMX monitoring for 'solr_36693.solr.node' (registry 'solr.node') enabled at server: com.sun.jmx.mbeanserver.JmxMBeanServer@adebe8
   [junit4]   2> 248564 INFO  (jetty-launcher-424-thread-4) [    ] o.a.s.m.r.SolrJmxReporter JMX monitoring for 'solr_36693.solr.jvm' (registry 'solr.jvm') enabled at server: com.sun.jmx.mbeanserver.JmxMBeanServer@adebe8
   [junit4]   2> 248564 INFO  (jetty-launcher-424-thread-4) [    ] o.a.s.m.r.SolrJmxReporter JMX monitoring for 'solr_36693.solr.jetty' (registry 'solr.jetty') enabled at server: com.sun.jmx.mbeanserver.JmxMBeanServer@adebe8
   [junit4]   2> 248565 INFO  (jetty-launcher-424-thread-4) [    ] o.a.s.c.CorePropertiesLocator Found 0 core definitions underneath /home/jenkins/workspace/Lucene-Solr-master-Linux/solr/build/solr-core/test/J2/temp/solr.cloud.CollectionsAPISolrJTest_25A18B9435646E6C-001/tempDir-001/node4/.
   [junit4]   2> 248584 INFO  (SUITE-CollectionsAPISolrJTest-seed#[25A18B9435646E6C]-worker) [    ] o.a.s.c.c.ZkStateReader Updated live nodes from ZooKeeper... (0) -> (4)
   [junit4]   2> 248584 INFO  (SUITE-CollectionsAPISolrJTest-seed#[25A18B9435646E6C]-worker) [    ] o.a.s.c.s.i.ZkClientClusterStateProvider Cluster at 127.0.0.1:35467/solr ready
   [junit4]   2> 248596 INFO  (TEST-CollectionsAPISolrJTest.testCreateAndDeleteAlias-seed#[25A18B9435646E6C]) [    ] o.a.s.SolrTestCaseJ4 ###Starting testCreateAndDeleteAlias
   [junit4]   2> 248630 INFO  (qtp2120941-2512) [    ] o.a.s.h.a.CollectionsHandler Invoked Collection Action :create with params replicationFactor=1&collection.configName=conf&name=aliasedCollection&nrtReplicas=1&action=CREATE&numShards=1&wt=javabin&version=2 and sendToOCPQueue=true
   [junit4]   2> 248631 INFO  (OverseerThreadFactory-971-thread-1) [    ] o.a.s.c.CreateCollectionCmd Create collection aliasedCollection
   [junit4]   2> 248734 INFO  (OverseerStateUpdate-98177385254551558-127.0.0.1:37067_solr-n_0000000000) [    ] o.a.s.c.o.SliceMutator createReplica() {
   [junit4]   2>   "operation":"ADDREPLICA",
   [junit4]   2>   "collection":"aliasedCollection",
   [junit4]   2>   "shard":"shard1",
   [junit4]   2>   "core":"aliasedCollection_shard1_replica_n1",
   [junit4]   2>   "state":"down",
   [junit4]   2>   "base_url":"https://127.0.0.1:32909/solr",
   [junit4]   2>   "type":"NRT"} 
   [junit4]   2> 248966 INFO  (qtp7184994-2513) [    ] o.a.s.h.a.CoreAdminOperation core create command qt=/admin/cores&coreNodeName=core_node1&collection.configName=conf&newCollection=true&name=aliasedCollection_shard1_replica_n1&action=CREATE&numShards=1&collection=aliasedCollection&shard=shard1&wt=javabin&version=2&replicaType=NRT
   [junit4]   2> 248966 INFO  (qtp7184994-2513) [    ] o.a.s.c.TransientSolrCoreCacheDefault Allocating transient cache for 2147483647 transient cores
   [junit4]   2> 249072 INFO  (zkCallback-447-thread-1) [    ] o.a.s.c.c.ZkStateReader A cluster state change: [WatchedEvent state:SyncConnected type:NodeDataChanged path:/collections/aliasedCollection/state.json] for collection [aliasedCollection] has occurred - updating... (live nodes size: [4])
   [junit4]   2> 249072 INFO  (zkCallback-447-thread-2) [    ] o.a.s.c.c.ZkStateReader A cluster state change: [WatchedEvent state:SyncConnected type:NodeDataChanged path:/collections/aliasedCollection/state.json] for collection [aliasedCollection] has occurred - updating... (live nodes size: [4])
   [junit4]   2> 249972 INFO  (qtp7184994-2513) [    ] o.a.s.c.SolrConfig Using Lucene MatchVersion: 7.0.0
   [junit4]   2> 249977 INFO  (qtp7184994-2513) [    ] o.a.s.s.IndexSchema [aliasedCollection_shard1_replica_n1] Schema name=minimal
   [junit4]   2> 249979 INFO  (qtp7184994-2513) [    ] o.a.s.s.IndexSchema Loaded schema minimal/1.1 with uniqueid field id
   [junit4]   2> 249979 INFO  (qtp7184994-2513) [    ] o.a.s.c.CoreContainer Creating

[...truncated too long message...]

2> 10088 INFO  (jetty-closer-2-thread-1) [    ] o.a.s.c.CoreContainer Shutting down CoreContainer instance=345454
   [junit4]   2> 10088 INFO  (jetty-closer-2-thread-1) [    ] o.a.s.m.SolrMetricManager Closing metric reporters for registry=solr.node, tag=null
   [junit4]   2> 10093 INFO  (jetty-closer-2-thread-2) [    ] o.e.j.s.AbstractConnector Stopped ServerConnector@b78aee{HTTP/1.1,[http/1.1]}{127.0.0.1:0}
   [junit4]   2> 10093 INFO  (jetty-closer-2-thread-2) [    ] o.a.s.c.CoreContainer Shutting down CoreContainer instance=9148861
   [junit4]   2> 10097 INFO  (jetty-closer-2-thread-1) [    ] o.a.s.m.SolrMetricManager Closing metric reporters for registry=solr.jvm, tag=null
   [junit4]   2> 10102 INFO  (jetty-closer-2-thread-2) [    ] o.a.s.m.SolrMetricManager Closing metric reporters for registry=solr.node, tag=null
   [junit4]   2> 10104 INFO  (jetty-closer-2-thread-1) [    ] o.a.s.m.SolrMetricManager Closing metric reporters for registry=solr.jetty, tag=null
   [junit4]   2> 10121 INFO  (jetty-closer-2-thread-2) [    ] o.a.s.m.SolrMetricManager Closing metric reporters for registry=solr.jvm, tag=null
   [junit4]   2> 10126 INFO  (jetty-closer-2-thread-2) [    ] o.a.s.m.SolrMetricManager Closing metric reporters for registry=solr.jetty, tag=null
   [junit4]   2> 10126 INFO  (jetty-closer-2-thread-1) [    ] o.a.s.m.SolrMetricManager Closing metric reporters for registry=solr.cluster, tag=null
   [junit4]   2> 10126 INFO  (jetty-closer-2-thread-3) [    ] o.e.j.s.AbstractConnector Stopped ServerConnector@37b8fb{HTTP/1.1,[http/1.1]}{127.0.0.1:0}
   [junit4]   2> 10130 INFO  (jetty-closer-2-thread-3) [    ] o.a.s.c.CoreContainer Shutting down CoreContainer instance=20552433
   [junit4]   2> 10130 INFO  (jetty-closer-2-thread-3) [    ] o.a.s.m.SolrMetricManager Closing metric reporters for registry=solr.node, tag=null
   [junit4]   2> 10144 INFO  (zkCallback-16-thread-1) [    ] o.a.s.c.c.ZkStateReader A cluster state change: [WatchedEvent state:SyncConnected type:NodeDataChanged path:/collections/collection1/state.json] for collection [collection1] has occurred - updating... (live nodes size: [3])
   [junit4]   2> 10144 INFO  (zkCallback-16-thread-2) [    ] o.a.s.c.c.ZkStateReader A cluster state change: [WatchedEvent state:SyncConnected type:NodeDataChanged path:/collections/collection1/state.json] for collection [collection1] has occurred - updating... (live nodes size: [3])
   [junit4]   2> 10156 INFO  (jetty-closer-2-thread-3) [    ] o.a.s.m.SolrMetricManager Closing metric reporters for registry=solr.jvm, tag=null
   [junit4]   2> 10162 INFO  (jetty-closer-2-thread-2) [    ] o.a.s.m.SolrMetricManager Closing metric reporters for registry=solr.cluster, tag=null
   [junit4]   2> 10162 INFO  (jetty-closer-2-thread-2) [    ] o.a.s.c.TransientSolrCoreCacheDefault Allocating transient cache for 2147483647 transient cores
   [junit4]   2> 10182 INFO  (coreCloseExecutor-33-thread-1) [    ] o.a.s.c.SolrCore [collection1_shard1_replica_n1]  CLOSING SolrCore org.apache.solr.core.SolrCore@108b6b4
   [junit4]   2> 10184 INFO  (jetty-closer-2-thread-3) [    ] o.a.s.m.SolrMetricManager Closing metric reporters for registry=solr.jetty, tag=null
   [junit4]   2> 10184 INFO  (jetty-closer-2-thread-2) [    ] o.a.s.c.Overseer Overseer (id=98177472014450697-127.0.0.1:43883_solr-n_0000000000) closing
   [junit4]   2> 10185 INFO  (OverseerStateUpdate-98177472014450697-127.0.0.1:43883_solr-n_0000000000) [    ] o.a.s.c.Overseer Overseer Loop exiting : 127.0.0.1:43883_solr
   [junit4]   2> 10199 INFO  (jetty-closer-2-thread-3) [    ] o.a.s.m.SolrMetricManager Closing metric reporters for registry=solr.cluster, tag=null
   [junit4]   2> 10199 INFO  (jetty-closer-2-thread-3) [    ] o.a.s.c.TransientSolrCoreCacheDefault Allocating transient cache for 2147483647 transient cores
   [junit4]   2> 10218 INFO  (coreCloseExecutor-33-thread-1) [    ] o.a.s.m.SolrMetricManager Closing metric reporters for registry=solr.core.collection1.shard1.replica_n1, tag=17348276
   [junit4]   2> 10225 INFO  (coreCloseExecutor-33-thread-1) [    ] o.a.s.m.SolrMetricManager Closing metric reporters for registry=solr.collection.collection1.shard1.leader, tag=17348276
   [junit4]   2> 10226 WARN  (NIOServerCxn.Factory:0.0.0.0/0.0.0.0:0) [    ] o.a.z.s.NIOServerCnxn caught end of stream exception
   [junit4]   2> EndOfStreamException: Unable to read additional data from client sessionid 0x15ccbe4005e0008, likely client has closed socket
   [junit4]   2> 	at org.apache.zookeeper.server.NIOServerCnxn.doIO(NIOServerCnxn.java:239)
   [junit4]   2> 	at org.apache.zookeeper.server.NIOServerCnxnFactory.run(NIOServerCnxnFactory.java:203)
   [junit4]   2> 	at java.base/java.lang.Thread.run(Thread.java:844)
   [junit4]   2> 10226 INFO  (jetty-closer-2-thread-3) [    ] o.e.j.s.h.ContextHandler Stopped o.e.j.s.ServletContextHandler@557d58{/solr,null,UNAVAILABLE}
   [junit4]   2> 10227 INFO  (zkCallback-16-thread-1) [    ] o.a.s.c.OverseerElectionContext I am going to be the leader 127.0.0.1:42323_solr
   [junit4]   2> 10226 WARN  (zkCallback-18-thread-1) [    ] o.a.s.c.c.ZkStateReader ZooKeeper watch triggered, but Solr cannot talk to ZK: [KeeperErrorCode = Session expired for /live_nodes]
   [junit4]   2> 10227 INFO  (zkCallback-16-thread-2) [    ] o.a.s.c.c.ZkStateReader Updated live nodes from ZooKeeper... (3) -> (1)
   [junit4]   2> 10227 INFO  (jetty-closer-2-thread-2) [    ] o.e.j.s.h.ContextHandler Stopped o.e.j.s.ServletContextHandler@2d875a{/solr,null,UNAVAILABLE}
   [junit4]   2> 11730 WARN  (zkCallback-16-thread-1) [    ] o.a.s.c.c.ZkStateReader ZooKeeper watch triggered, but Solr cannot talk to ZK: [KeeperErrorCode = Session expired for /live_nodes]
   [junit4]   2> 11730 INFO  (jetty-closer-2-thread-1) [    ] o.e.j.s.h.ContextHandler Stopped o.e.j.s.ServletContextHandler@1f5358{/solr,null,UNAVAILABLE}
   [junit4]   2> 11731 ERROR (TEST-TestLTROnSolrCloud.testSimpleQuery-seed#[DB6C43B805DBF997]) [    ] o.a.z.s.ZooKeeperServer ZKShutdownHandler is not registered, so ZooKeeper server won't take any action on ERROR or SHUTDOWN server state changes
   [junit4]   2> 11731 INFO  (TEST-TestLTROnSolrCloud.testSimpleQuery-seed#[DB6C43B805DBF997]) [    ] o.a.s.c.ZkTestServer connecting to 127.0.0.1:36767 36767
   [junit4]   2> 11763 INFO  (Thread-0) [    ] o.a.s.c.ZkTestServer connecting to 127.0.0.1:36767 36767
   [junit4]   2> 11764 WARN  (Thread-0) [    ] o.a.s.c.ZkTestServer Watch limit violations: 
   [junit4]   2> Maximum concurrent create/delete watches above limit:
   [junit4]   2> 
   [junit4]   2> 	5	/solr/aliases.json
   [junit4]   2> 	5	/solr/clusterprops.json
   [junit4]   2> 	4	/solr/security.json
   [junit4]   2> 
   [junit4]   2> Maximum concurrent data watches above limit:
   [junit4]   2> 
   [junit4]   2> 	6	/solr/collections/collection1/state.json
   [junit4]   2> 	5	/solr/clusterstate.json
   [junit4]   2> 
   [junit4]   2> Maximum concurrent children watches above limit:
   [junit4]   2> 
   [junit4]   2> 	5	/solr/live_nodes
   [junit4]   2> 	5	/solr/collections
   [junit4]   2> 
   [junit4]   2> 11764 INFO  (TEST-TestLTROnSolrCloud.testSimpleQuery-seed#[DB6C43B805DBF997]) [    ] o.a.s.SolrTestCaseJ4 ###Ending testSimpleQuery
   [junit4]   2> NOTE: reproduce with: ant test  -Dtestcase=TestLTROnSolrCloud -Dtests.method=testSimpleQuery -Dtests.seed=DB6C43B805DBF997 -Dtests.multiplier=3 -Dtests.slow=true -Dtests.locale=nb-SJ -Dtests.timezone=Antarctica/South_Pole -Dtests.asserts=true -Dtests.file.encoding=ISO-8859-1
   [junit4] ERROR   11.2s J0 | TestLTROnSolrCloud.testSimpleQuery <<<
   [junit4]    > Throwable #1: java.lang.RuntimeException: Path not found: /responseHeader/status
   [junit4]    > 	at __randomizedtesting.SeedInfo.seed([DB6C43B805DBF997:AE6183A415C13F42]:0)
   [junit4]    > 	at org.apache.solr.util.RestTestBase.assertJPut(RestTestBase.java:329)
   [junit4]    > 	at org.apache.solr.util.RestTestBase.assertJPut(RestTestBase.java:271)
   [junit4]    > 	at org.apache.solr.ltr.TestRerankBase.loadFeature(TestRerankBase.java:286)
   [junit4]    > 	at org.apache.solr.ltr.TestLTROnSolrCloud.loadModelsAndFeatures(TestLTROnSolrCloud.java:184)
   [junit4]    > 	at org.apache.solr.ltr.TestLTROnSolrCloud.setupSolrCluster(TestLTROnSolrCloud.java:138)
   [junit4]    > 	at org.apache.solr.ltr.TestLTROnSolrCloud.setUp(TestLTROnSolrCloud.java:58)
   [junit4]    > 	at java.base/jdk.internal.reflect.NativeMethodAccessorImpl.invoke0(Native Method)
   [junit4]    > 	at java.base/jdk.internal.reflect.NativeMethodAccessorImpl.invoke(NativeMethodAccessorImpl.java:62)
   [junit4]    > 	at java.base/jdk.internal.reflect.DelegatingMethodAccessorImpl.invoke(DelegatingMethodAccessorImpl.java:43)
   [junit4]    > 	at java.base/java.lang.reflect.Method.invoke(Method.java:564)
   [junit4]    > 	at java.base/java.lang.Thread.run(Thread.java:844)
   [junit4]   2> NOTE: leaving temporary files on disk at: /home/jenkins/workspace/Lucene-Solr-master-Linux/solr/build/contrib/solr-ltr/test/J0/temp/solr.ltr.TestLTROnSolrCloud_DB6C43B805DBF997-001
   [junit4]   2> Jun 21, 2017 6:22:27 PM com.carrotsearch.randomizedtesting.ThreadLeakControl checkThreadLeaks
   [junit4]   2> WARNING: Will linger awaiting termination of 1 leaked thread(s).
   [junit4]   2> NOTE: test params are: codec=Asserting(Lucene70): {_version_=FST50, popularity=PostingsFormat(name=Memory), description=BlockTreeOrds(blocksize=128), id=PostingsFormat(name=Memory), text=PostingsFormat(name=LuceneFixedGap), title=BlockTreeOrds(blocksize=128)}, docValues:{}, maxPointsInLeafNode=468, maxMBSortInHeap=6.262882225670827, sim=RandomSimilarity(queryNorm=true): {}, locale=nb-SJ, timezone=Antarctica/South_Pole
   [junit4]   2> NOTE: Linux 4.10.0-21-generic i386/Oracle Corporation 9-ea (32-bit)/cpus=8,threads=1,free=35463816,total=75497472
   [junit4]   2> NOTE: All tests run in this JVM: [TestLTROnSolrCloud]
   [junit4] Completed [16/33 (1!)] on J0 in 13.19s, 1 test, 1 error <<< FAILURES!

[...truncated 29945 lines...]

Mime
View raw message