lucene-dev mailing list archives

Site index · List index
Message view « Date » · « Thread »
Top « Date » · « Thread »
From Apache Jenkins Server <jenk...@builds.apache.org>
Subject [JENKINS] Lucene-Solr-NightlyTests-master - Build # 1320 - Still Unstable
Date Fri, 09 Jun 2017 21:27:24 GMT
Build: https://builds.apache.org/job/Lucene-Solr-NightlyTests-master/1320/

2 tests failed.
FAILED:  org.apache.lucene.index.TestIndexSorting.testRandom3

Error Message:
Test abandoned because suite timeout was reached.

Stack Trace:
java.lang.Exception: Test abandoned because suite timeout was reached.
	at __randomizedtesting.SeedInfo.seed([6E326D7A40C000D9]:0)


FAILED:  junit.framework.TestSuite.org.apache.lucene.index.TestIndexSorting

Error Message:
Suite timeout exceeded (>= 7200000 msec).

Stack Trace:
java.lang.Exception: Suite timeout exceeded (>= 7200000 msec).
	at __randomizedtesting.SeedInfo.seed([6E326D7A40C000D9]:0)




Build Log:
[...truncated 1847 lines...]
   [junit4] Suite: org.apache.lucene.index.TestIndexSorting
   [junit4]   2> jun 09, 2017 1:58:50 PM com.carrotsearch.randomizedtesting.ThreadLeakControl$2
evaluate
   [junit4]   2> WARNING: Suite execution timed out: org.apache.lucene.index.TestIndexSorting
   [junit4]   2>    1) Thread[id=8576, name=SUITE-TestIndexSorting-seed#[6E326D7A40C000D9],
state=RUNNABLE, group=TGRP-TestIndexSorting]
   [junit4]   2>         at java.lang.Thread.getStackTrace(Thread.java:1556)
   [junit4]   2>         at com.carrotsearch.randomizedtesting.ThreadLeakControl$4.run(ThreadLeakControl.java:696)
   [junit4]   2>         at com.carrotsearch.randomizedtesting.ThreadLeakControl$4.run(ThreadLeakControl.java:693)
   [junit4]   2>         at java.security.AccessController.doPrivileged(Native Method)
   [junit4]   2>         at com.carrotsearch.randomizedtesting.ThreadLeakControl.getStackTrace(ThreadLeakControl.java:693)
   [junit4]   2>         at com.carrotsearch.randomizedtesting.ThreadLeakControl.getThreadsWithTraces(ThreadLeakControl.java:709)
   [junit4]   2>         at com.carrotsearch.randomizedtesting.ThreadLeakControl.formatThreadStacksFull(ThreadLeakControl.java:689)
   [junit4]   2>         at com.carrotsearch.randomizedtesting.ThreadLeakControl.access$1000(ThreadLeakControl.java:65)
   [junit4]   2>         at com.carrotsearch.randomizedtesting.ThreadLeakControl$2.evaluate(ThreadLeakControl.java:415)
   [junit4]   2>         at com.carrotsearch.randomizedtesting.RandomizedRunner.runSuite(RandomizedRunner.java:678)
   [junit4]   2>         at com.carrotsearch.randomizedtesting.RandomizedRunner.access$200(RandomizedRunner.java:140)
   [junit4]   2>         at com.carrotsearch.randomizedtesting.RandomizedRunner$2.run(RandomizedRunner.java:598)
   [junit4]   2>    2) Thread[id=1, name=main, state=WAITING, group=main]
   [junit4]   2>         at java.lang.Object.wait(Native Method)
   [junit4]   2>         at java.lang.Thread.join(Thread.java:1249)
   [junit4]   2>         at java.lang.Thread.join(Thread.java:1323)
   [junit4]   2>         at com.carrotsearch.randomizedtesting.RandomizedRunner.runSuite(RandomizedRunner.java:608)
   [junit4]   2>         at com.carrotsearch.randomizedtesting.RandomizedRunner.run(RandomizedRunner.java:457)
   [junit4]   2>         at com.carrotsearch.ant.tasks.junit4.slave.SlaveMain.execute(SlaveMain.java:244)
   [junit4]   2>         at com.carrotsearch.ant.tasks.junit4.slave.SlaveMain.main(SlaveMain.java:355)
   [junit4]   2>         at com.carrotsearch.ant.tasks.junit4.slave.SlaveMainSafe.main(SlaveMainSafe.java:13)
   [junit4]   2>    3) Thread[id=9, name=JUnit4-serializer-daemon, state=TIMED_WAITING,
group=main]
   [junit4]   2>         at java.lang.Thread.sleep(Native Method)
   [junit4]   2>         at com.carrotsearch.ant.tasks.junit4.events.Serializer$1.run(Serializer.java:50)
   [junit4]   2>    4) Thread[id=8577, name=TEST-TestIndexSorting.testRandom3-seed#[6E326D7A40C000D9],
state=RUNNABLE, group=TGRP-TestIndexSorting]
   [junit4]   2>         at sun.nio.ch.NativeThread.current(Native Method)
   [junit4]   2>         at sun.nio.ch.NativeThreadSet.add(NativeThreadSet.java:46)
   [junit4]   2>         at sun.nio.ch.FileChannelImpl.position(FileChannelImpl.java:284)
   [junit4]   2>         at sun.nio.ch.FileChannelImpl.position(FileChannelImpl.java:50)
   [junit4]   2>         at org.apache.lucene.mockfile.FilterSeekableByteChannel.position(FilterSeekableByteChannel.java:74)
   [junit4]   2>         at org.apache.lucene.mockfile.FilterSeekableByteChannel.position(FilterSeekableByteChannel.java:74)
   [junit4]   2>         at org.apache.lucene.store.SimpleFSDirectory$SimpleFSIndexInput.readInternal(SimpleFSDirectory.java:171)
   [junit4]   2>         at org.apache.lucene.store.BufferedIndexInput.refill(BufferedIndexInput.java:342)
   [junit4]   2>         at org.apache.lucene.store.BufferedIndexInput.readByte(BufferedIndexInput.java:54)
   [junit4]   2>         at org.apache.lucene.store.DataInput.readInt(DataInput.java:102)
   [junit4]   2>         at org.apache.lucene.store.BufferedIndexInput.readInt(BufferedIndexInput.java:183)
   [junit4]   2>         at org.apache.lucene.store.MockIndexInputWrapper.readInt(MockIndexInputWrapper.java:165)
   [junit4]   2>         at org.apache.lucene.store.IndexInput$1.readInt(IndexInput.java:144)
   [junit4]   2>         at org.apache.lucene.util.packed.DirectReader$DirectPackedReader28.get(DirectReader.java:248)
   [junit4]   2>         at org.apache.lucene.codecs.lucene70.Lucene70DocValuesProducer$13.get(Lucene70DocValuesProducer.java:643)
   [junit4]   2>         at org.apache.lucene.codecs.lucene70.Lucene70DocValuesProducer$22.nextValue(Lucene70DocValuesProducer.java:1271)
   [junit4]   2>         at org.apache.lucene.codecs.DocValuesConsumer$3$1.nextValue(DocValuesConsumer.java:446)
   [junit4]   2>         at org.apache.lucene.codecs.lucene70.Lucene70DocValuesConsumer.writeValuesSingleBlock(Lucene70DocValuesConsumer.java:275)
   [junit4]   2>         at org.apache.lucene.codecs.lucene70.Lucene70DocValuesConsumer.writeValues(Lucene70DocValuesConsumer.java:263)
   [junit4]   2>         at org.apache.lucene.codecs.lucene70.Lucene70DocValuesConsumer.addSortedNumericField(Lucene70DocValuesConsumer.java:530)
   [junit4]   2>         at org.apache.lucene.codecs.DocValuesConsumer.mergeSortedNumericField(DocValuesConsumer.java:371)
   [junit4]   2>         at org.apache.lucene.codecs.DocValuesConsumer.merge(DocValuesConsumer.java:143)
   [junit4]   2>         at org.apache.lucene.codecs.perfield.PerFieldDocValuesFormat$FieldsWriter.merge(PerFieldDocValuesFormat.java:151)
   [junit4]   2>         at org.apache.lucene.index.SegmentMerger.mergeDocValues(SegmentMerger.java:181)
   [junit4]   2>         at org.apache.lucene.index.SegmentMerger.merge(SegmentMerger.java:125)
   [junit4]   2>         at org.apache.lucene.index.IndexWriter.mergeMiddle(IndexWriter.java:4361)
   [junit4]   2>         at org.apache.lucene.index.IndexWriter.merge(IndexWriter.java:3933)
   [junit4]   2>         at org.apache.lucene.index.SerialMergeScheduler.merge(SerialMergeScheduler.java:40)
   [junit4]   2>         at org.apache.lucene.index.IndexWriter.maybeMerge(IndexWriter.java:2082)
   [junit4]   2>         at org.apache.lucene.index.IndexWriter.doAfterSegmentFlushed(IndexWriter.java:4992)
   [junit4]   2>         at org.apache.lucene.index.DocumentsWriter$MergePendingEvent.process(DocumentsWriter.java:731)
   [junit4]   2>         at org.apache.lucene.index.IndexWriter.processEvents(IndexWriter.java:5030)
   [junit4]   2>         at org.apache.lucene.index.IndexWriter.processEvents(IndexWriter.java:5021)
   [junit4]   2>         at org.apache.lucene.index.IndexWriter.updateDocument(IndexWriter.java:1573)
   [junit4]   2>         at org.apache.lucene.index.IndexWriter.addDocument(IndexWriter.java:1315)
   [junit4]   2>         at org.apache.lucene.index.TestIndexSorting.testRandom3(TestIndexSorting.java:2301)
   [junit4]   2>         at sun.reflect.NativeMethodAccessorImpl.invoke0(Native Method)
   [junit4]   2>         at sun.reflect.NativeMethodAccessorImpl.invoke(NativeMethodAccessorImpl.java:62)
   [junit4]   2>         at sun.reflect.DelegatingMethodAccessorImpl.invoke(DelegatingMethodAccessorImpl.java:43)
   [junit4]   2>         at java.lang.reflect.Method.invoke(Method.java:498)
   [junit4]   2>         at com.carrotsearch.randomizedtesting.RandomizedRunner.invoke(RandomizedRunner.java:1713)
   [junit4]   2>         at com.carrotsearch.randomizedtesting.RandomizedRunner$8.evaluate(RandomizedRunner.java:907)
   [junit4]   2>         at com.carrotsearch.randomizedtesting.RandomizedRunner$9.evaluate(RandomizedRunner.java:943)
   [junit4]   2>         at com.carrotsearch.randomizedtesting.RandomizedRunner$10.evaluate(RandomizedRunner.java:957)
   [junit4]   2>         at org.apache.lucene.util.TestRuleSetupTeardownChained$1.evaluate(TestRuleSetupTeardownChained.java:49)
   [junit4]   2>         at org.apache.lucene.util.AbstractBeforeAfterRule$1.evaluate(AbstractBeforeAfterRule.java:45)
   [junit4]   2>         at org.apache.lucene.util.TestRuleThreadAndTestName$1.evaluate(TestRuleThreadAndTestName.java:48)
   [junit4]   2>         at org.apache.lucene.util.TestRuleIgnoreAfterMaxFailures$1.evaluate(TestRuleIgnoreAfterMaxFailures.java:64)
   [junit4]   2>         at org.apache.lucene.util.TestRuleMarkFailure$1.evaluate(TestRuleMarkFailure.java:47)
   [junit4]   2>         at com.carrotsearch.randomizedtesting.rules.StatementAdapter.evaluate(StatementAdapter.java:36)
   [junit4]   2>         at com.carrotsearch.randomizedtesting.ThreadLeakControl$StatementRunner.run(ThreadLeakControl.java:368)
   [junit4]   2>         at com.carrotsearch.randomizedtesting.ThreadLeakControl.forkTimeoutingTask(ThreadLeakControl.java:817)
   [junit4]   2>         at com.carrotsearch.randomizedtesting.ThreadLeakControl$3.evaluate(ThreadLeakControl.java:468)
   [junit4]   2>         at com.carrotsearch.randomizedtesting.RandomizedRunner.runSingleTest(RandomizedRunner.java:916)
   [junit4]   2>         at com.carrotsearch.randomizedtesting.RandomizedRunner$5.evaluate(RandomizedRunner.java:802)
   [junit4]   2>         at com.carrotsearch.randomizedtesting.RandomizedRunner$6.evaluate(RandomizedRunner.java:852)
   [junit4]   2>         at com.carrotsearch.randomizedtesting.RandomizedRunner$7.evaluate(RandomizedRunner.java:863)
   [junit4]   2>         at org.apache.lucene.util.AbstractBeforeAfterRule$1.evaluate(AbstractBeforeAfterRule.java:45)
   [junit4]   2>         at com.carrotsearch.randomizedtesting.rules.StatementAdapter.evaluate(StatementAdapter.java:36)
   [junit4]   2>         at org.apache.lucene.util.TestRuleStoreClassName$1.evaluate(TestRuleStoreClassName.java:41)
   [junit4]   2>         at com.carrotsearch.randomizedtesting.rules.NoShadowingOrOverridesOnMethodsRule$1.evaluate(NoShadowingOrOverridesOnMethodsRule.java:40)
   [junit4]   2>         at com.carrotsearch.randomizedtesting.rules.NoShadowingOrOverridesOnMethodsRule$1.evaluate(NoShadowingOrOverridesOnMethodsRule.java:40)
   [junit4]   2>         at com.carrotsearch.randomizedtesting.rules.StatementAdapter.evaluate(StatementAdapter.java:36)
   [junit4]   2>         at com.carrotsearch.randomizedtesting.rules.StatementAdapter.evaluate(StatementAdapter.java:36)
   [junit4]   2>         at com.carrotsearch.randomizedtesting.rules.StatementAdapter.evaluate(StatementAdapter.java:36)
   [junit4]   2>         at org.apache.lucene.util.TestRuleAssertionsRequired$1.evaluate(TestRuleAssertionsRequired.java:53)
   [junit4]   2>         at org.apache.lucene.util.TestRuleMarkFailure$1.evaluate(TestRuleMarkFailure.java:47)
   [junit4]   2>         at org.apache.lucene.util.TestRuleIgnoreAfterMaxFailures$1.evaluate(TestRuleIgnoreAfterMaxFailures.java:64)
   [junit4]   2>         at org.apache.lucene.util.TestRuleIgnoreTestSuites$1.evaluate(TestRuleIgnoreTestSuites.java:54)
   [junit4]   2>         at com.carrotsearch.randomizedtesting.rules.StatementAdapter.evaluate(StatementAdapter.java:36)
   [junit4]   2>         at com.carrotsearch.randomizedtesting.ThreadLeakControl$StatementRunner.run(ThreadLeakControl.java:368)
   [junit4]   2>         at java.lang.Thread.run(Thread.java:745)
   [junit4]   2> NOTE: download the large Jenkins line-docs file by running 'ant get-jenkins-line-docs'
in the lucene directory.
   [junit4]   2> NOTE: reproduce with: ant test  -Dtestcase=TestIndexSorting -Dtests.method=testRandom3
-Dtests.seed=6E326D7A40C000D9 -Dtests.multiplier=2 -Dtests.nightly=true -Dtests.slow=true
-Dtests.linedocsfile=/home/jenkins/jenkins-slave/workspace/Lucene-Solr-NightlyTests-master/test-data/enwiki.random.lines.txt
-Dtests.locale=es-AR -Dtests.timezone=America/Indiana/Vevay -Dtests.asserts=true -Dtests.file.encoding=UTF-8
   [junit4] ERROR   7200s J0 | TestIndexSorting.testRandom3 <<<
   [junit4]    > Throwable #1: java.lang.Exception: Test abandoned because suite timeout
was reached.
   [junit4]    > 	at __randomizedtesting.SeedInfo.seed([6E326D7A40C000D9]:0)
   [junit4]   2> jun 09, 2017 1:58:50 PM com.carrotsearch.randomizedtesting.ThreadLeakControl
checkThreadLeaks
   [junit4]   2> WARNING: Will linger awaiting termination of 1 leaked thread(s).
   [junit4]   2> jun 09, 2017 1:59:10 PM com.carrotsearch.randomizedtesting.ThreadLeakControl
checkThreadLeaks
   [junit4]   2> SEVERE: 1 thread leaked from SUITE scope at org.apache.lucene.index.TestIndexSorting:

   [junit4]   2>    1) Thread[id=8577, name=TEST-TestIndexSorting.testRandom3-seed#[6E326D7A40C000D9],
state=RUNNABLE, group=TGRP-TestIndexSorting]
   [junit4]   2>         at org.apache.lucene.util.PriorityQueue.downHeap(PriorityQueue.java:276)
   [junit4]   2>         at org.apache.lucene.util.PriorityQueue.updateTop(PriorityQueue.java:211)
   [junit4]   2>         at org.apache.lucene.index.DocIDMerger$SortedDocIDMerger.next(DocIDMerger.java:188)
   [junit4]   2>         at org.apache.lucene.codecs.DocValuesConsumer$3$1.nextDoc(DocValuesConsumer.java:414)
   [junit4]   2>         at org.apache.lucene.codecs.LegacyDocValuesIterables$6$1.next(LegacyDocValuesIterables.java:295)
   [junit4]   2>         at org.apache.lucene.codecs.LegacyDocValuesIterables$6$1.next(LegacyDocValuesIterables.java:283)
   [junit4]   2>         at org.apache.lucene.codecs.memory.DirectDocValuesConsumer$1$1.next(DirectDocValuesConsumer.java:330)
   [junit4]   2>         at org.apache.lucene.codecs.memory.DirectDocValuesConsumer$1$1.next(DirectDocValuesConsumer.java:315)
   [junit4]   2>         at org.apache.lucene.codecs.memory.DirectDocValuesConsumer.addNumericFieldValues(DirectDocValuesConsumer.java:83)
   [junit4]   2>         at org.apache.lucene.codecs.memory.DirectDocValuesConsumer.addSortedNumericField(DirectDocValuesConsumer.java:262)
   [junit4]   2>         at org.apache.lucene.codecs.DocValuesConsumer.mergeSortedNumericField(DocValuesConsumer.java:371)
   [junit4]   2>         at org.apache.lucene.codecs.DocValuesConsumer.merge(DocValuesConsumer.java:143)
   [junit4]   2>         at org.apache.lucene.codecs.perfield.PerFieldDocValuesFormat$FieldsWriter.merge(PerFieldDocValuesFormat.java:151)
   [junit4]   2>         at org.apache.lucene.index.SegmentMerger.mergeDocValues(SegmentMerger.java:181)
   [junit4]   2>         at org.apache.lucene.index.SegmentMerger.merge(SegmentMerger.java:125)
   [junit4]   2>         at org.apache.lucene.index.IndexWriter.mergeMiddle(IndexWriter.java:4361)
   [junit4]   2>         at org.apache.lucene.index.IndexWriter.merge(IndexWriter.java:3933)
   [junit4]   2>         at org.apache.lucene.index.SerialMergeScheduler.merge(SerialMergeScheduler.java:40)
   [junit4]   2>         at org.apache.lucene.index.IndexWriter.maybeMerge(IndexWriter.java:2082)
   [junit4]   2>         at org.apache.lucene.index.IndexWriter.doAfterSegmentFlushed(IndexWriter.java:4992)
   [junit4]   2>         at org.apache.lucene.index.DocumentsWriter$MergePendingEvent.process(DocumentsWriter.java:731)
   [junit4]   2>         at org.apache.lucene.index.IndexWriter.processEvents(IndexWriter.java:5030)
   [junit4]   2>         at org.apache.lucene.index.IndexWriter.processEvents(IndexWriter.java:5021)
   [junit4]   2>         at org.apache.lucene.index.IndexWriter.updateDocument(IndexWriter.java:1573)
   [junit4]   2>         at org.apache.lucene.index.IndexWriter.addDocument(IndexWriter.java:1315)
   [junit4]   2>         at org.apache.lucene.index.TestIndexSorting.testRandom3(TestIndexSorting.java:2301)
   [junit4]   2>         at sun.reflect.NativeMethodAccessorImpl.invoke0(Native Method)
   [junit4]   2>         at sun.reflect.NativeMethodAccessorImpl.invoke(NativeMethodAccessorImpl.java:62)
   [junit4]   2>         at sun.reflect.DelegatingMethodAccessorImpl.invoke(DelegatingMethodAccessorImpl.java:43)
   [junit4]   2>         at java.lang.reflect.Method.invoke(Method.java:498)
   [junit4]   2>         at com.carrotsearch.randomizedtesting.RandomizedRunner.invoke(RandomizedRunner.java:1713)
   [junit4]   2>         at com.carrotsearch.randomizedtesting.RandomizedRunner$8.evaluate(RandomizedRunner.java:907)
   [junit4]   2>         at com.carrotsearch.randomizedtesting.RandomizedRunner$9.evaluate(RandomizedRunner.java:943)
   [junit4]   2>         at com.carrotsearch.randomizedtesting.RandomizedRunner$10.evaluate(RandomizedRunner.java:957)
   [junit4]   2>         at org.apache.lucene.util.TestRuleSetupTeardownChained$1.evaluate(TestRuleSetupTeardownChained.java:49)
   [junit4]   2>         at org.apache.lucene.util.AbstractBeforeAfterRule$1.evaluate(AbstractBeforeAfterRule.java:45)
   [junit4]   2>         at org.apache.lucene.util.TestRuleThreadAndTestName$1.evaluate(TestRuleThreadAndTestName.java:48)
   [junit4]   2>         at org.apache.lucene.util.TestRuleIgnoreAfterMaxFailures$1.evaluate(TestRuleIgnoreAfterMaxFailures.java:64)
   [junit4]   2>         at org.apache.lucene.util.TestRuleMarkFailure$1.evaluate(TestRuleMarkFailure.java:47)
   [junit4]   2>         at com.carrotsearch.randomizedtesting.rules.StatementAdapter.evaluate(StatementAdapter.java:36)
   [junit4]   2>         at com.carrotsearch.randomizedtesting.ThreadLeakControl$StatementRunner.run(ThreadLeakControl.java:368)
   [junit4]   2>         at com.carrotsearch.randomizedtesting.ThreadLeakControl.forkTimeoutingTask(ThreadLeakControl.java:817)
   [junit4]   2>         at com.carrotsearch.randomizedtesting.ThreadLeakControl$3.evaluate(ThreadLeakControl.java:468)
   [junit4]   2>         at com.carrotsearch.randomizedtesting.RandomizedRunner.runSingleTest(RandomizedRunner.java:916)
   [junit4]   2>         at com.carrotsearch.randomizedtesting.RandomizedRunner$5.evaluate(RandomizedRunner.java:802)
   [junit4]   2>         at com.carrotsearch.randomizedtesting.RandomizedRunner$6.evaluate(RandomizedRunner.java:852)
   [junit4]   2>         at com.carrotsearch.randomizedtesting.RandomizedRunner$7.evaluate(RandomizedRunner.java:863)
   [junit4]   2>         at org.apache.lucene.util.AbstractBeforeAfterRule$1.evaluate(AbstractBeforeAfterRule.java:45)
   [junit4]   2>         at com.carrotsearch.randomizedtesting.rules.StatementAdapter.evaluate(StatementAdapter.java:36)
   [junit4]   2>         at org.apache.lucene.util.TestRuleStoreClassName$1.evaluate(TestRuleStoreClassName.java:41)
   [junit4]   2>         at com.carrotsearch.randomizedtesting.rules.NoShadowingOrOverridesOnMethodsRule$1.evaluate(NoShadowingOrOverridesOnMethodsRule.java:40)
   [junit4]   2>         at com.carrotsearch.randomizedtesting.rules.NoShadowingOrOverridesOnMethodsRule$1.evaluate(NoShadowingOrOverridesOnMethodsRule.java:40)
   [junit4]   2>         at com.carrotsearch.randomizedtesting.rules.StatementAdapter.evaluate(StatementAdapter.java:36)
   [junit4]   2>         at com.carrotsearch.randomizedtesting.rules.StatementAdapter.evaluate(StatementAdapter.java:36)
   [junit4]   2>         at com.carrotsearch.randomizedtesting.rules.StatementAdapter.evaluate(StatementAdapter.java:36)
   [junit4]   2>         at org.apache.lucene.util.TestRuleAssertionsRequired$1.evaluate(TestRuleAssertionsRequired.java:53)
   [junit4]   2>         at org.apache.lucene.util.TestRuleMarkFailure$1.evaluate(TestRuleMarkFailure.java:47)
   [junit4]   2>         at org.apache.lucene.util.TestRuleIgnoreAfterMaxFailures$1.evaluate(TestRuleIgnoreAfterMaxFailures.java:64)
   [junit4]   2>         at org.apache.lucene.util.TestRuleIgnoreTestSuites$1.evaluate(TestRuleIgnoreTestSuites.java:54)
   [junit4]   2>         at com.carrotsearch.randomizedtesting.rules.StatementAdapter.evaluate(StatementAdapter.java:36)
   [junit4]   2>         at com.carrotsearch.randomizedtesting.ThreadLeakControl$StatementRunner.run(ThreadLeakControl.java:368)
   [junit4]   2>         at java.lang.Thread.run(Thread.java:745)
   [junit4]   2> jun 09, 2017 1:59:10 PM com.carrotsearch.randomizedtesting.ThreadLeakControl
tryToInterruptAll
   [junit4]   2> INFO: Starting to interrupt leaked threads:
   [junit4]   2>    1) Thread[id=8577, name=TEST-TestIndexSorting.testRandom3-seed#[6E326D7A40C000D9],
state=RUNNABLE, group=TGRP-TestIndexSorting]
   [junit4]   2> NOTE: leaving temporary files on disk at: /x1/jenkins/jenkins-slave/workspace/Lucene-Solr-NightlyTests-master/checkout/lucene/build/core/test/J0/temp/lucene.index.TestIndexSorting_6E326D7A40C000D9-001
   [junit4]   2> Jun 09, 2017 5:59:10 PM com.carrotsearch.randomizedtesting.ThreadLeakControl
tryToInterruptAll
   [junit4]   2> INFO: All leaked threads terminated.
   [junit4]   2> NOTE: test params are: codec=Asserting(Lucene70): {id=FSTOrd50}, docValues:{multi_valued_double=DocValuesFormat(name=Direct),
multi_valued_long=DocValuesFormat(name=Asserting), bytes=DocValuesFormat(name=Direct), double=DocValuesFormat(name=Lucene70),
foo=DocValuesFormat(name=Asserting), id=DocValuesFormat(name=Direct), multi_valued_int=DocValuesFormat(name=Lucene70),
float=DocValuesFormat(name=Lucene70), multi_valued_bytes=DocValuesFormat(name=Lucene70), multi_valued_float=DocValuesFormat(name=Lucene70),
int=DocValuesFormat(name=Direct), long=DocValuesFormat(name=Lucene70)}, maxPointsInLeafNode=437,
maxMBSortInHeap=7.084589868215948, sim=RandomSimilarity(queryNorm=false): {}, locale=es-AR,
timezone=America/Indiana/Vevay
   [junit4]   2> NOTE: Linux 3.13.0-88-generic amd64/Oracle Corporation 1.8.0_121 (64-bit)/cpus=4,threads=1,free=168345616,total=333447168
   [junit4]   2> NOTE: All tests run in this JVM: [TestDocValuesQueries, TestExitableDirectoryReader,
TestTragicIndexWriterDeadlock, TestBM25Similarity, TestDocCount, TestWildcardRandom, TestBagOfPositions,
TestCodecHoldsOpenFiles, TestCachingCollector, TestUniqueTermCount, TestBooleanMinShouldMatch,
TestNewestSegment, TestFixedBitDocIdSet, LimitedFiniteStringsIteratorTest, TestIndexWriterExceptions,
TestDocIDMerger, TestIndexWriterWithThreads, TestIndexWriterConfig, TestBinaryDocValuesUpdates,
TestIndexWriterOutOfFileDescriptors, TestIndexWriter, TestIndexWriterNRTIsCurrent, TestPerSegmentDeletes,
TestBlendedTermQuery, TestBooleanScorer, TestSnapshotDeletionPolicy, TestCodecs, TestBytesRef,
TestForceMergeForever, TestSloppyPhraseQuery, TestSimilarityProvider, TestSPIClassIterator,
TestMultiPhraseQuery, TestRateLimiter, TestNeverDelete, TestDateTools, TestTerm, TestConstantScoreQuery,
TestNumericDocValuesUpdates, TestBlockPostingsFormat2, TestPerFieldPostingsFormat, TestTimSorter,
TestSpanOrQuery, TestMaxPosition, TestOmitNorms, TestSimpleAttributeImpl, TestNamedSPILoader,
TestSwappedIndexFiles, TestSmallFloat, TestMmapDirectory, TestNearSpansOrdered, TestIntroSorter,
TestIntBlockPool, TestSimpleSearchEquivalence, Test4GBStoredFields, TestMixedDocValuesUpdates,
TestNGramPhraseQuery, TestSpanContainQuery, TestFilterSpans, TestLucene70SegmentInfoFormat,
TestGeoUtils, TestMSBRadixSorter, TestLucene50TermVectorsFormat, TestSingleInstanceLockFactory,
TestBufferedChecksum, TestMultiThreadTermVectors, TestSearch, TestWordlistLoader, TestBoolean2,
TestMultiPhraseEnum, TestMatchNoDocsQuery, TestFieldMaskingSpanQuery, TestRegExp, TestAutomatonQuery,
TestDeletionPolicy, TestFlushByRamOrCountsPolicy, TestNRTThreads, TestTopDocsMerge, TestLongPostings,
TestStressIndexing, TestRollingUpdates, TestTieredMergePolicy, TestIndexWriterForceMerge,
TestLevenshteinAutomata, TestBufferedIndexInput, TestTermsEnum, TestConsistentFieldNumbers,
TestSimpleExplanations, TestDirectoryReader, TestSegmentMerger, TestPhraseQuery, TestCollectionUtil,
TestFixedBitSet, TestNRTCachingDirectory, TestFastDecompressionMode, TestPagedBytes, TestTransactions,
TestCrash, TestSort, TestMultiDocValues, TestFieldsReader, TestDocValuesIndexing, TestSimilarityBase,
TestHugeRamFile, TestDeterminizeLexicon, Test2BDocs, TestIndexWriterOnDiskFull, TestPostingsOffsets,
TestTransactionRollback, TestFlex, TestUTF32ToUTF8, TestSpanExplanations, TestFastCompressionMode,
TestLazyProxSkipping, TestDocsAndPositions, TestMergeSchedulerExternal, TestBagOfPostings,
TestTermVectorsWriter, TestBytesRefHash, TestThreadedForceMerge, TestStressNRT, TestIndexInput,
TestOmitTf, TestSameScoresWithThreads, TestMultiFields, TestTermRangeQuery, TestDocumentsWriterDeleteQueue,
TestDocumentWriter, TestCrashCausesCorruptIndex, TestMultiTermConstantScore, TestLiveFieldValues,
TestForTooMuchCloning, TestSpanSearchEquivalence, TestIndexedDISI, TestGeoEncodingUtils, TestPolygon,
TestPolygon2D, Test2BPoints, Test2BSortedDocValuesOrds, TestAllFilesCheckIndexHeader, TestExceedMaxTermLength,
TestFieldInvertState, TestFilterCodecReader, TestFilterDirectoryReader, TestIndexSorting]
   [junit4]   2> NOTE: download the large Jenkins line-docs file by running 'ant get-jenkins-line-docs'
in the lucene directory.
   [junit4]   2> NOTE: reproduce with: ant test  -Dtestcase=TestIndexSorting -Dtests.seed=6E326D7A40C000D9
-Dtests.multiplier=2 -Dtests.nightly=true -Dtests.slow=true -Dtests.linedocsfile=/home/jenkins/jenkins-slave/workspace/Lucene-Solr-NightlyTests-master/test-data/enwiki.random.lines.txt
-Dtests.locale=es-AR -Dtests.timezone=America/Indiana/Vevay -Dtests.asserts=true -Dtests.file.encoding=UTF-8
   [junit4] ERROR   0.00s J0 | TestIndexSorting (suite) <<<
   [junit4]    > Throwable #1: java.lang.Exception: Suite timeout exceeded (>= 7200000
msec).
   [junit4]    > 	at __randomizedtesting.SeedInfo.seed([6E326D7A40C000D9]:0)
   [junit4] Completed [453/453 (1!)] on J0 in 7220.15s, 3 tests, 2 errors <<< FAILURES!

[...truncated 55296 lines...]

Mime
View raw message