lucene-dev mailing list archives

Site index · List index
Message view « Date » · « Thread »
Top « Date » · « Thread »
From Apache Jenkins Server <jenk...@builds.apache.org>
Subject [JENKINS] Lucene-Solr-Tests-master - Build # 1879 - Still Unstable
Date Mon, 19 Jun 2017 15:05:19 GMT
Build: https://builds.apache.org/job/Lucene-Solr-Tests-master/1879/

3 tests failed.
FAILED:  junit.framework.TestSuite.org.apache.solr.core.TestLazyCores

Error Message:
ObjectTracker found 6 object(s) that were not released!!! [MMapDirectory, SolrCore, MMapDirectory, MDCAwareThreadPoolExecutor, SolrIndexSearcher, MMapDirectory] org.apache.solr.common.util.ObjectReleaseTracker$ObjectTrackerException: org.apache.lucene.store.MMapDirectory  at org.apache.solr.common.util.ObjectReleaseTracker.track(ObjectReleaseTracker.java:42)  at org.apache.solr.core.CachingDirectoryFactory.get(CachingDirectoryFactory.java:347)  at org.apache.solr.update.SolrIndexWriter.create(SolrIndexWriter.java:92)  at org.apache.solr.core.SolrCore.initIndex(SolrCore.java:753)  at org.apache.solr.core.SolrCore.<init>(SolrCore.java:948)  at org.apache.solr.core.SolrCore.<init>(SolrCore.java:855)  at org.apache.solr.core.CoreContainer.create(CoreContainer.java:979)  at org.apache.solr.core.CoreContainer.lambda$load$7(CoreContainer.java:611)  at com.codahale.metrics.InstrumentedExecutorService$InstrumentedCallable.call(InstrumentedExecutorService.java:197)  at java.util.concurrent.FutureTask.run(FutureTask.java:266)  at org.apache.solr.common.util.ExecutorUtil$MDCAwareThreadPoolExecutor.lambda$execute$0(ExecutorUtil.java:188)  at java.util.concurrent.ThreadPoolExecutor.runWorker(ThreadPoolExecutor.java:1142)  at java.util.concurrent.ThreadPoolExecutor$Worker.run(ThreadPoolExecutor.java:617)  at java.lang.Thread.run(Thread.java:748)  org.apache.solr.common.util.ObjectReleaseTracker$ObjectTrackerException: org.apache.solr.core.SolrCore  at org.apache.solr.common.util.ObjectReleaseTracker.track(ObjectReleaseTracker.java:42)  at org.apache.solr.core.SolrCore.<init>(SolrCore.java:1033)  at org.apache.solr.core.SolrCore.<init>(SolrCore.java:855)  at org.apache.solr.core.CoreContainer.create(CoreContainer.java:979)  at org.apache.solr.core.CoreContainer.lambda$load$7(CoreContainer.java:611)  at com.codahale.metrics.InstrumentedExecutorService$InstrumentedCallable.call(InstrumentedExecutorService.java:197)  at java.util.concurrent.FutureTask.run(FutureTask.java:266)  at org.apache.solr.common.util.ExecutorUtil$MDCAwareThreadPoolExecutor.lambda$execute$0(ExecutorUtil.java:188)  at java.util.concurrent.ThreadPoolExecutor.runWorker(ThreadPoolExecutor.java:1142)  at java.util.concurrent.ThreadPoolExecutor$Worker.run(ThreadPoolExecutor.java:617)  at java.lang.Thread.run(Thread.java:748)  org.apache.solr.common.util.ObjectReleaseTracker$ObjectTrackerException: org.apache.lucene.store.MMapDirectory  at org.apache.solr.common.util.ObjectReleaseTracker.track(ObjectReleaseTracker.java:42)  at org.apache.solr.core.CachingDirectoryFactory.get(CachingDirectoryFactory.java:347)  at org.apache.solr.core.SolrCore.initSnapshotMetaDataManager(SolrCore.java:490)  at org.apache.solr.core.SolrCore.<init>(SolrCore.java:942)  at org.apache.solr.core.SolrCore.<init>(SolrCore.java:855)  at org.apache.solr.core.CoreContainer.create(CoreContainer.java:979)  at org.apache.solr.core.CoreContainer.lambda$load$7(CoreContainer.java:611)  at com.codahale.metrics.InstrumentedExecutorService$InstrumentedCallable.call(InstrumentedExecutorService.java:197)  at java.util.concurrent.FutureTask.run(FutureTask.java:266)  at org.apache.solr.common.util.ExecutorUtil$MDCAwareThreadPoolExecutor.lambda$execute$0(ExecutorUtil.java:188)  at java.util.concurrent.ThreadPoolExecutor.runWorker(ThreadPoolExecutor.java:1142)  at java.util.concurrent.ThreadPoolExecutor$Worker.run(ThreadPoolExecutor.java:617)  at java.lang.Thread.run(Thread.java:748)  org.apache.solr.common.util.ObjectReleaseTracker$ObjectTrackerException: org.apache.solr.common.util.ExecutorUtil$MDCAwareThreadPoolExecutor  at org.apache.solr.common.util.ObjectReleaseTracker.track(ObjectReleaseTracker.java:42)  at org.apache.solr.core.SolrCore.<init>(SolrCore.java:884)  at org.apache.solr.core.SolrCore.<init>(SolrCore.java:855)  at org.apache.solr.core.CoreContainer.create(CoreContainer.java:979)  at org.apache.solr.core.CoreContainer.lambda$load$7(CoreContainer.java:611)  at com.codahale.metrics.InstrumentedExecutorService$InstrumentedCallable.call(InstrumentedExecutorService.java:197)  at java.util.concurrent.FutureTask.run(FutureTask.java:266)  at org.apache.solr.common.util.ExecutorUtil$MDCAwareThreadPoolExecutor.lambda$execute$0(ExecutorUtil.java:188)  at java.util.concurrent.ThreadPoolExecutor.runWorker(ThreadPoolExecutor.java:1142)  at java.util.concurrent.ThreadPoolExecutor$Worker.run(ThreadPoolExecutor.java:617)  at java.lang.Thread.run(Thread.java:748)  org.apache.solr.common.util.ObjectReleaseTracker$ObjectTrackerException: org.apache.solr.search.SolrIndexSearcher  at org.apache.solr.common.util.ObjectReleaseTracker.track(ObjectReleaseTracker.java:42)  at org.apache.solr.search.SolrIndexSearcher.<init>(SolrIndexSearcher.java:323)  at org.apache.solr.core.SolrCore.openNewSearcher(SolrCore.java:2047)  at org.apache.solr.core.SolrCore.getSearcher(SolrCore.java:2199)  at org.apache.solr.core.SolrCore.initSearcher(SolrCore.java:1085)  at org.apache.solr.core.SolrCore.<init>(SolrCore.java:974)  at org.apache.solr.core.SolrCore.<init>(SolrCore.java:855)  at org.apache.solr.core.CoreContainer.create(CoreContainer.java:979)  at org.apache.solr.core.CoreContainer.lambda$load$7(CoreContainer.java:611)  at com.codahale.metrics.InstrumentedExecutorService$InstrumentedCallable.call(InstrumentedExecutorService.java:197)  at java.util.concurrent.FutureTask.run(FutureTask.java:266)  at org.apache.solr.common.util.ExecutorUtil$MDCAwareThreadPoolExecutor.lambda$execute$0(ExecutorUtil.java:188)  at java.util.concurrent.ThreadPoolExecutor.runWorker(ThreadPoolExecutor.java:1142)  at java.util.concurrent.ThreadPoolExecutor$Worker.run(ThreadPoolExecutor.java:617)  at java.lang.Thread.run(Thread.java:748)  org.apache.solr.common.util.ObjectReleaseTracker$ObjectTrackerException: org.apache.lucene.store.MMapDirectory  at org.apache.solr.common.util.ObjectReleaseTracker.track(ObjectReleaseTracker.java:42)  at org.apache.solr.core.CachingDirectoryFactory.get(CachingDirectoryFactory.java:347)  at org.apache.solr.core.SolrCore.getNewIndexDir(SolrCore.java:361)  at org.apache.solr.core.SolrCore.initIndex(SolrCore.java:721)  at org.apache.solr.core.SolrCore.<init>(SolrCore.java:948)  at org.apache.solr.core.SolrCore.<init>(SolrCore.java:855)  at org.apache.solr.core.CoreContainer.create(CoreContainer.java:979)  at org.apache.solr.core.CoreContainer.lambda$load$7(CoreContainer.java:611)  at com.codahale.metrics.InstrumentedExecutorService$InstrumentedCallable.call(InstrumentedExecutorService.java:197)  at java.util.concurrent.FutureTask.run(FutureTask.java:266)  at org.apache.solr.common.util.ExecutorUtil$MDCAwareThreadPoolExecutor.lambda$execute$0(ExecutorUtil.java:188)  at java.util.concurrent.ThreadPoolExecutor.runWorker(ThreadPoolExecutor.java:1142)  at java.util.concurrent.ThreadPoolExecutor$Worker.run(ThreadPoolExecutor.java:617)  at java.lang.Thread.run(Thread.java:748)  

Stack Trace:
java.lang.AssertionError: ObjectTracker found 6 object(s) that were not released!!! [MMapDirectory, SolrCore, MMapDirectory, MDCAwareThreadPoolExecutor, SolrIndexSearcher, MMapDirectory]
org.apache.solr.common.util.ObjectReleaseTracker$ObjectTrackerException: org.apache.lucene.store.MMapDirectory
	at org.apache.solr.common.util.ObjectReleaseTracker.track(ObjectReleaseTracker.java:42)
	at org.apache.solr.core.CachingDirectoryFactory.get(CachingDirectoryFactory.java:347)
	at org.apache.solr.update.SolrIndexWriter.create(SolrIndexWriter.java:92)
	at org.apache.solr.core.SolrCore.initIndex(SolrCore.java:753)
	at org.apache.solr.core.SolrCore.<init>(SolrCore.java:948)
	at org.apache.solr.core.SolrCore.<init>(SolrCore.java:855)
	at org.apache.solr.core.CoreContainer.create(CoreContainer.java:979)
	at org.apache.solr.core.CoreContainer.lambda$load$7(CoreContainer.java:611)
	at com.codahale.metrics.InstrumentedExecutorService$InstrumentedCallable.call(InstrumentedExecutorService.java:197)
	at java.util.concurrent.FutureTask.run(FutureTask.java:266)
	at org.apache.solr.common.util.ExecutorUtil$MDCAwareThreadPoolExecutor.lambda$execute$0(ExecutorUtil.java:188)
	at java.util.concurrent.ThreadPoolExecutor.runWorker(ThreadPoolExecutor.java:1142)
	at java.util.concurrent.ThreadPoolExecutor$Worker.run(ThreadPoolExecutor.java:617)
	at java.lang.Thread.run(Thread.java:748)

org.apache.solr.common.util.ObjectReleaseTracker$ObjectTrackerException: org.apache.solr.core.SolrCore
	at org.apache.solr.common.util.ObjectReleaseTracker.track(ObjectReleaseTracker.java:42)
	at org.apache.solr.core.SolrCore.<init>(SolrCore.java:1033)
	at org.apache.solr.core.SolrCore.<init>(SolrCore.java:855)
	at org.apache.solr.core.CoreContainer.create(CoreContainer.java:979)
	at org.apache.solr.core.CoreContainer.lambda$load$7(CoreContainer.java:611)
	at com.codahale.metrics.InstrumentedExecutorService$InstrumentedCallable.call(InstrumentedExecutorService.java:197)
	at java.util.concurrent.FutureTask.run(FutureTask.java:266)
	at org.apache.solr.common.util.ExecutorUtil$MDCAwareThreadPoolExecutor.lambda$execute$0(ExecutorUtil.java:188)
	at java.util.concurrent.ThreadPoolExecutor.runWorker(ThreadPoolExecutor.java:1142)
	at java.util.concurrent.ThreadPoolExecutor$Worker.run(ThreadPoolExecutor.java:617)
	at java.lang.Thread.run(Thread.java:748)

org.apache.solr.common.util.ObjectReleaseTracker$ObjectTrackerException: org.apache.lucene.store.MMapDirectory
	at org.apache.solr.common.util.ObjectReleaseTracker.track(ObjectReleaseTracker.java:42)
	at org.apache.solr.core.CachingDirectoryFactory.get(CachingDirectoryFactory.java:347)
	at org.apache.solr.core.SolrCore.initSnapshotMetaDataManager(SolrCore.java:490)
	at org.apache.solr.core.SolrCore.<init>(SolrCore.java:942)
	at org.apache.solr.core.SolrCore.<init>(SolrCore.java:855)
	at org.apache.solr.core.CoreContainer.create(CoreContainer.java:979)
	at org.apache.solr.core.CoreContainer.lambda$load$7(CoreContainer.java:611)
	at com.codahale.metrics.InstrumentedExecutorService$InstrumentedCallable.call(InstrumentedExecutorService.java:197)
	at java.util.concurrent.FutureTask.run(FutureTask.java:266)
	at org.apache.solr.common.util.ExecutorUtil$MDCAwareThreadPoolExecutor.lambda$execute$0(ExecutorUtil.java:188)
	at java.util.concurrent.ThreadPoolExecutor.runWorker(ThreadPoolExecutor.java:1142)
	at java.util.concurrent.ThreadPoolExecutor$Worker.run(ThreadPoolExecutor.java:617)
	at java.lang.Thread.run(Thread.java:748)

org.apache.solr.common.util.ObjectReleaseTracker$ObjectTrackerException: org.apache.solr.common.util.ExecutorUtil$MDCAwareThreadPoolExecutor
	at org.apache.solr.common.util.ObjectReleaseTracker.track(ObjectReleaseTracker.java:42)
	at org.apache.solr.core.SolrCore.<init>(SolrCore.java:884)
	at org.apache.solr.core.SolrCore.<init>(SolrCore.java:855)
	at org.apache.solr.core.CoreContainer.create(CoreContainer.java:979)
	at org.apache.solr.core.CoreContainer.lambda$load$7(CoreContainer.java:611)
	at com.codahale.metrics.InstrumentedExecutorService$InstrumentedCallable.call(InstrumentedExecutorService.java:197)
	at java.util.concurrent.FutureTask.run(FutureTask.java:266)
	at org.apache.solr.common.util.ExecutorUtil$MDCAwareThreadPoolExecutor.lambda$execute$0(ExecutorUtil.java:188)
	at java.util.concurrent.ThreadPoolExecutor.runWorker(ThreadPoolExecutor.java:1142)
	at java.util.concurrent.ThreadPoolExecutor$Worker.run(ThreadPoolExecutor.java:617)
	at java.lang.Thread.run(Thread.java:748)

org.apache.solr.common.util.ObjectReleaseTracker$ObjectTrackerException: org.apache.solr.search.SolrIndexSearcher
	at org.apache.solr.common.util.ObjectReleaseTracker.track(ObjectReleaseTracker.java:42)
	at org.apache.solr.search.SolrIndexSearcher.<init>(SolrIndexSearcher.java:323)
	at org.apache.solr.core.SolrCore.openNewSearcher(SolrCore.java:2047)
	at org.apache.solr.core.SolrCore.getSearcher(SolrCore.java:2199)
	at org.apache.solr.core.SolrCore.initSearcher(SolrCore.java:1085)
	at org.apache.solr.core.SolrCore.<init>(SolrCore.java:974)
	at org.apache.solr.core.SolrCore.<init>(SolrCore.java:855)
	at org.apache.solr.core.CoreContainer.create(CoreContainer.java:979)
	at org.apache.solr.core.CoreContainer.lambda$load$7(CoreContainer.java:611)
	at com.codahale.metrics.InstrumentedExecutorService$InstrumentedCallable.call(InstrumentedExecutorService.java:197)
	at java.util.concurrent.FutureTask.run(FutureTask.java:266)
	at org.apache.solr.common.util.ExecutorUtil$MDCAwareThreadPoolExecutor.lambda$execute$0(ExecutorUtil.java:188)
	at java.util.concurrent.ThreadPoolExecutor.runWorker(ThreadPoolExecutor.java:1142)
	at java.util.concurrent.ThreadPoolExecutor$Worker.run(ThreadPoolExecutor.java:617)
	at java.lang.Thread.run(Thread.java:748)

org.apache.solr.common.util.ObjectReleaseTracker$ObjectTrackerException: org.apache.lucene.store.MMapDirectory
	at org.apache.solr.common.util.ObjectReleaseTracker.track(ObjectReleaseTracker.java:42)
	at org.apache.solr.core.CachingDirectoryFactory.get(CachingDirectoryFactory.java:347)
	at org.apache.solr.core.SolrCore.getNewIndexDir(SolrCore.java:361)
	at org.apache.solr.core.SolrCore.initIndex(SolrCore.java:721)
	at org.apache.solr.core.SolrCore.<init>(SolrCore.java:948)
	at org.apache.solr.core.SolrCore.<init>(SolrCore.java:855)
	at org.apache.solr.core.CoreContainer.create(CoreContainer.java:979)
	at org.apache.solr.core.CoreContainer.lambda$load$7(CoreContainer.java:611)
	at com.codahale.metrics.InstrumentedExecutorService$InstrumentedCallable.call(InstrumentedExecutorService.java:197)
	at java.util.concurrent.FutureTask.run(FutureTask.java:266)
	at org.apache.solr.common.util.ExecutorUtil$MDCAwareThreadPoolExecutor.lambda$execute$0(ExecutorUtil.java:188)
	at java.util.concurrent.ThreadPoolExecutor.runWorker(ThreadPoolExecutor.java:1142)
	at java.util.concurrent.ThreadPoolExecutor$Worker.run(ThreadPoolExecutor.java:617)
	at java.lang.Thread.run(Thread.java:748)


	at __randomizedtesting.SeedInfo.seed([342C810C6A05F56C]:0)
	at org.junit.Assert.fail(Assert.java:93)
	at org.junit.Assert.assertTrue(Assert.java:43)
	at org.junit.Assert.assertNull(Assert.java:551)
	at org.apache.solr.SolrTestCaseJ4.teardownTestCases(SolrTestCaseJ4.java:295)
	at sun.reflect.NativeMethodAccessorImpl.invoke0(Native Method)
	at sun.reflect.NativeMethodAccessorImpl.invoke(NativeMethodAccessorImpl.java:62)
	at sun.reflect.DelegatingMethodAccessorImpl.invoke(DelegatingMethodAccessorImpl.java:43)
	at java.lang.reflect.Method.invoke(Method.java:498)
	at com.carrotsearch.randomizedtesting.RandomizedRunner.invoke(RandomizedRunner.java:1713)
	at com.carrotsearch.randomizedtesting.RandomizedRunner$7.evaluate(RandomizedRunner.java:870)
	at com.carrotsearch.randomizedtesting.rules.StatementAdapter.evaluate(StatementAdapter.java:36)
	at com.carrotsearch.randomizedtesting.rules.SystemPropertiesRestoreRule$1.evaluate(SystemPropertiesRestoreRule.java:57)
	at org.apache.lucene.util.AbstractBeforeAfterRule$1.evaluate(AbstractBeforeAfterRule.java:45)
	at com.carrotsearch.randomizedtesting.rules.StatementAdapter.evaluate(StatementAdapter.java:36)
	at org.apache.lucene.util.TestRuleStoreClassName$1.evaluate(TestRuleStoreClassName.java:41)
	at com.carrotsearch.randomizedtesting.rules.NoShadowingOrOverridesOnMethodsRule$1.evaluate(NoShadowingOrOverridesOnMethodsRule.java:40)
	at com.carrotsearch.randomizedtesting.rules.NoShadowingOrOverridesOnMethodsRule$1.evaluate(NoShadowingOrOverridesOnMethodsRule.java:40)
	at com.carrotsearch.randomizedtesting.rules.StatementAdapter.evaluate(StatementAdapter.java:36)
	at com.carrotsearch.randomizedtesting.rules.StatementAdapter.evaluate(StatementAdapter.java:36)
	at com.carrotsearch.randomizedtesting.rules.StatementAdapter.evaluate(StatementAdapter.java:36)
	at org.apache.lucene.util.TestRuleAssertionsRequired$1.evaluate(TestRuleAssertionsRequired.java:53)
	at org.apache.lucene.util.TestRuleMarkFailure$1.evaluate(TestRuleMarkFailure.java:47)
	at org.apache.lucene.util.TestRuleIgnoreAfterMaxFailures$1.evaluate(TestRuleIgnoreAfterMaxFailures.java:64)
	at org.apache.lucene.util.TestRuleIgnoreTestSuites$1.evaluate(TestRuleIgnoreTestSuites.java:54)
	at com.carrotsearch.randomizedtesting.rules.StatementAdapter.evaluate(StatementAdapter.java:36)
	at com.carrotsearch.randomizedtesting.ThreadLeakControl$StatementRunner.run(ThreadLeakControl.java:368)
	at java.lang.Thread.run(Thread.java:748)


FAILED:  junit.framework.TestSuite.org.apache.solr.core.TestLazyCores

Error Message:
1 thread leaked from SUITE scope at org.apache.solr.core.TestLazyCores:     1) Thread[id=199, name=searcherExecutor-203-thread-1, state=WAITING, group=TGRP-TestLazyCores]         at sun.misc.Unsafe.park(Native Method)         at java.util.concurrent.locks.LockSupport.park(LockSupport.java:175)         at java.util.concurrent.locks.AbstractQueuedSynchronizer$ConditionObject.await(AbstractQueuedSynchronizer.java:2039)         at java.util.concurrent.LinkedBlockingQueue.take(LinkedBlockingQueue.java:442)         at java.util.concurrent.ThreadPoolExecutor.getTask(ThreadPoolExecutor.java:1067)         at java.util.concurrent.ThreadPoolExecutor.runWorker(ThreadPoolExecutor.java:1127)         at java.util.concurrent.ThreadPoolExecutor$Worker.run(ThreadPoolExecutor.java:617)         at java.lang.Thread.run(Thread.java:748)

Stack Trace:
com.carrotsearch.randomizedtesting.ThreadLeakError: 1 thread leaked from SUITE scope at org.apache.solr.core.TestLazyCores: 
   1) Thread[id=199, name=searcherExecutor-203-thread-1, state=WAITING, group=TGRP-TestLazyCores]
        at sun.misc.Unsafe.park(Native Method)
        at java.util.concurrent.locks.LockSupport.park(LockSupport.java:175)
        at java.util.concurrent.locks.AbstractQueuedSynchronizer$ConditionObject.await(AbstractQueuedSynchronizer.java:2039)
        at java.util.concurrent.LinkedBlockingQueue.take(LinkedBlockingQueue.java:442)
        at java.util.concurrent.ThreadPoolExecutor.getTask(ThreadPoolExecutor.java:1067)
        at java.util.concurrent.ThreadPoolExecutor.runWorker(ThreadPoolExecutor.java:1127)
        at java.util.concurrent.ThreadPoolExecutor$Worker.run(ThreadPoolExecutor.java:617)
        at java.lang.Thread.run(Thread.java:748)
	at __randomizedtesting.SeedInfo.seed([342C810C6A05F56C]:0)


FAILED:  junit.framework.TestSuite.org.apache.solr.core.TestLazyCores

Error Message:
There are still zombie threads that couldn't be terminated:    1) Thread[id=199, name=searcherExecutor-203-thread-1, state=WAITING, group=TGRP-TestLazyCores]         at sun.misc.Unsafe.park(Native Method)         at java.util.concurrent.locks.LockSupport.park(LockSupport.java:175)         at java.util.concurrent.locks.AbstractQueuedSynchronizer$ConditionObject.await(AbstractQueuedSynchronizer.java:2039)         at java.util.concurrent.LinkedBlockingQueue.take(LinkedBlockingQueue.java:442)         at java.util.concurrent.ThreadPoolExecutor.getTask(ThreadPoolExecutor.java:1067)         at java.util.concurrent.ThreadPoolExecutor.runWorker(ThreadPoolExecutor.java:1127)         at java.util.concurrent.ThreadPoolExecutor$Worker.run(ThreadPoolExecutor.java:617)         at java.lang.Thread.run(Thread.java:748)

Stack Trace:
com.carrotsearch.randomizedtesting.ThreadLeakError: There are still zombie threads that couldn't be terminated:
   1) Thread[id=199, name=searcherExecutor-203-thread-1, state=WAITING, group=TGRP-TestLazyCores]
        at sun.misc.Unsafe.park(Native Method)
        at java.util.concurrent.locks.LockSupport.park(LockSupport.java:175)
        at java.util.concurrent.locks.AbstractQueuedSynchronizer$ConditionObject.await(AbstractQueuedSynchronizer.java:2039)
        at java.util.concurrent.LinkedBlockingQueue.take(LinkedBlockingQueue.java:442)
        at java.util.concurrent.ThreadPoolExecutor.getTask(ThreadPoolExecutor.java:1067)
        at java.util.concurrent.ThreadPoolExecutor.runWorker(ThreadPoolExecutor.java:1127)
        at java.util.concurrent.ThreadPoolExecutor$Worker.run(ThreadPoolExecutor.java:617)
        at java.lang.Thread.run(Thread.java:748)
	at __randomizedtesting.SeedInfo.seed([342C810C6A05F56C]:0)




Build Log:
[...truncated 10927 lines...]
   [junit4] Suite: org.apache.solr.core.TestLazyCores
   [junit4]   2> Creating dataDir: /x1/jenkins/jenkins-slave/workspace/Lucene-Solr-Tests-master/solr/build/solr-core/test/J0/temp/solr.core.TestLazyCores_342C810C6A05F56C-001/init-core-data-001
   [junit4]   2> 0    INFO  (SUITE-TestLazyCores-seed#[342C810C6A05F56C]-worker) [    ] o.a.s.SolrTestCaseJ4 Using TrieFields
   [junit4]   2> 32   INFO  (SUITE-TestLazyCores-seed#[342C810C6A05F56C]-worker) [    ] o.e.j.u.log Logging initialized @2361ms
   [junit4]   2> 40   INFO  (SUITE-TestLazyCores-seed#[342C810C6A05F56C]-worker) [    ] o.a.s.SolrTestCaseJ4 Randomized ssl (false) and clientAuth (false) via: @org.apache.solr.util.RandomizeSSL(reason=, ssl=NaN, value=NaN, clientAuth=NaN)
   [junit4]   2> 63   INFO  (TEST-TestLazyCores.testLazySearch-seed#[342C810C6A05F56C]) [    ] o.a.s.SolrTestCaseJ4 ###Starting testLazySearch
   [junit4]   2> 155  INFO  (TEST-TestLazyCores.testLazySearch-seed#[342C810C6A05F56C]) [    ] o.a.s.c.SolrResourceLoader solr home defaulted to 'solr/' (could not find system property or JNDI)
   [junit4]   2> 162  INFO  (TEST-TestLazyCores.testLazySearch-seed#[342C810C6A05F56C]) [    ] o.a.s.c.SolrXmlConfig Loading container configuration from /x1/jenkins/jenkins-slave/workspace/Lucene-Solr-Tests-master/solr/build/solr-core/test/J0/temp/solr.core.TestLazyCores_342C810C6A05F56C-001/tempDir-001/solr.xml
   [junit4]   2> 1061 INFO  (TEST-TestLazyCores.testLazySearch-seed#[342C810C6A05F56C]) [    ] o.a.s.c.TransientSolrCoreCacheDefault Allocating transient cache for 4 transient cores
   [junit4]   2> 1134 INFO  (coreLoadExecutor-6-thread-1) [    x:collection1] o.a.s.c.SolrConfig Using Lucene MatchVersion: 7.0.0
   [junit4]   2> 1136 INFO  (coreLoadExecutor-6-thread-3) [    x:collection5] o.a.s.c.SolrConfig Using Lucene MatchVersion: 7.0.0
   [junit4]   2> 1151 INFO  (coreLoadExecutor-6-thread-2) [    x:collection2] o.a.s.c.SolrConfig Using Lucene MatchVersion: 7.0.0
   [junit4]   2> 1259 INFO  (coreLoadExecutor-6-thread-1) [    x:collection1] o.a.s.s.IndexSchema [collection1] Schema name=tiny
   [junit4]   2> 1264 INFO  (coreLoadExecutor-6-thread-2) [    x:collection2] o.a.s.s.IndexSchema [collection2] Schema name=tiny
   [junit4]   2> 1277 INFO  (coreLoadExecutor-6-thread-3) [    x:collection5] o.a.s.s.IndexSchema [collection5] Schema name=tiny
   [junit4]   2> 1431 INFO  (coreLoadExecutor-6-thread-1) [    x:collection1] o.a.s.s.IndexSchema Loaded schema tiny/1.1 with uniqueid field id
   [junit4]   2> 1432 INFO  (coreLoadExecutor-6-thread-1) [    x:collection1] o.a.s.c.CoreContainer Creating SolrCore 'collection1' using configuration from instancedir /x1/jenkins/jenkins-slave/workspace/Lucene-Solr-Tests-master/solr/build/solr-core/test/J0/temp/solr.core.TestLazyCores_342C810C6A05F56C-001/tempDir-001/./collection1, trusted=true
   [junit4]   2> 1437 INFO  (coreLoadExecutor-6-thread-2) [    x:collection2] o.a.s.s.IndexSchema Loaded schema tiny/1.1 with uniqueid field id
   [junit4]   2> 1437 INFO  (coreLoadExecutor-6-thread-2) [    x:collection2] o.a.s.c.CoreContainer Creating SolrCore 'collection2' using configuration from instancedir /x1/jenkins/jenkins-slave/workspace/Lucene-Solr-Tests-master/solr/build/solr-core/test/J0/temp/solr.core.TestLazyCores_342C810C6A05F56C-001/tempDir-001/./collection2, trusted=true
   [junit4]   2> 1438 INFO  (coreLoadExecutor-6-thread-3) [    x:collection5] o.a.s.s.IndexSchema Loaded schema tiny/1.1 with uniqueid field id
   [junit4]   2> 1439 INFO  (coreLoadExecutor-6-thread-3) [    x:collection5] o.a.s.c.CoreContainer Creating SolrCore 'collection5' using configuration from instancedir /x1/jenkins/jenkins-slave/workspace/Lucene-Solr-Tests-master/solr/build/solr-core/test/J0/temp/solr.core.TestLazyCores_342C810C6A05F56C-001/tempDir-001/./collection5, trusted=true
   [junit4]   2> 1601 INFO  (coreLoadExecutor-6-thread-1) [    x:collection1] o.a.s.c.SolrCore solr.RecoveryStrategy.Builder
   [junit4]   2> 1602 INFO  (coreLoadExecutor-6-thread-2) [    x:collection2] o.a.s.c.SolrCore solr.RecoveryStrategy.Builder
   [junit4]   2> 1602 INFO  (coreLoadExecutor-6-thread-3) [    x:collection5] o.a.s.c.SolrCore solr.RecoveryStrategy.Builder
   [junit4]   2> 1612 INFO  (coreLoadExecutor-6-thread-2) [    x:collection2] o.a.s.c.SolrCore [[collection2] ] Opening new SolrCore at [/x1/jenkins/jenkins-slave/workspace/Lucene-Solr-Tests-master/solr/build/solr-core/test/J0/temp/solr.core.TestLazyCores_342C810C6A05F56C-001/tempDir-001/collection2], dataDir=[/x1/jenkins/jenkins-slave/workspace/Lucene-Solr-Tests-master/solr/build/solr-core/test/J0/temp/solr.core.TestLazyCores_342C810C6A05F56C-001/tempDir-001/./collection2/data/]
   [junit4]   2> 1613 INFO  (coreLoadExecutor-6-thread-3) [    x:collection5] o.a.s.c.SolrCore [[collection5] ] Opening new SolrCore at [/x1/jenkins/jenkins-slave/workspace/Lucene-Solr-Tests-master/solr/build/solr-core/test/J0/temp/solr.core.TestLazyCores_342C810C6A05F56C-001/tempDir-001/collection5], dataDir=[/x1/jenkins/jenkins-slave/workspace/Lucene-Solr-Tests-master/solr/build/solr-core/test/J0/temp/solr.core.TestLazyCores_342C810C6A05F56C-001/tempDir-001/./collection5/data/]
   [junit4]   2> 1623 INFO  (coreLoadExecutor-6-thread-1) [    x:collection1] o.a.s.c.SolrCore [[collection1] ] Opening new SolrCore at [/x1/jenkins/jenkins-slave/workspace/Lucene-Solr-Tests-master/solr/build/solr-core/test/J0/temp/solr.core.TestLazyCores_342C810C6A05F56C-001/tempDir-001/collection1], dataDir=[/x1/jenkins/jenkins-slave/workspace/Lucene-Solr-Tests-master/solr/build/solr-core/test/J0/temp/solr.core.TestLazyCores_342C810C6A05F56C-001/tempDir-001/./collection1/data/]
   [junit4]   2> 1676 INFO  (coreLoadExecutor-6-thread-3) [    x:collection5] o.a.s.u.RandomMergePolicy RandomMergePolicy wrapping class org.apache.lucene.index.LogDocMergePolicy: [LogDocMergePolicy: minMergeSize=1000, mergeFactor=50, maxMergeSize=9223372036854775807, maxMergeSizeForForcedMerge=9223372036854775807, calibrateSizeByDeletes=true, maxMergeDocs=2147483647, maxCFSSegmentSizeMB=8.796093022207999E12, noCFSRatio=0.36459640234102664]
   [junit4]   2> 1678 INFO  (coreLoadExecutor-6-thread-1) [    x:collection1] o.a.s.u.RandomMergePolicy RandomMergePolicy wrapping class org.apache.lucene.index.LogDocMergePolicy: [LogDocMergePolicy: minMergeSize=1000, mergeFactor=50, maxMergeSize=9223372036854775807, maxMergeSizeForForcedMerge=9223372036854775807, calibrateSizeByDeletes=true, maxMergeDocs=2147483647, maxCFSSegmentSizeMB=8.796093022207999E12, noCFSRatio=0.36459640234102664]
   [junit4]   2> 1692 INFO  (coreLoadExecutor-6-thread-2) [    x:collection2] o.a.s.u.RandomMergePolicy RandomMergePolicy wrapping class org.apache.lucene.index.LogDocMergePolicy: [LogDocMergePolicy: minMergeSize=1000, mergeFactor=50, maxMergeSize=9223372036854775807, maxMergeSizeForForcedMerge=9223372036854775807, calibrateSizeByDeletes=true, maxMergeDocs=2147483647, maxCFSSegmentSizeMB=8.796093022207999E12, noCFSRatio=0.36459640234102664]
   [junit4]   2> 2489 INFO  (coreLoadExecutor-6-thread-3) [    x:collection5] o.a.s.u.CommitTracker Hard AutoCommit: disabled
   [junit4]   2> 2489 INFO  (coreLoadExecutor-6-thread-3) [    x:collection5] o.a.s.u.CommitTracker Soft AutoCommit: disabled
   [junit4]   2> 2490 INFO  (coreLoadExecutor-6-thread-1) [    x:collection1] o.a.s.u.CommitTracker Hard AutoCommit: disabled
   [junit4]   2> 2497 INFO  (coreLoadExecutor-6-thread-1) [    x:collection1] o.a.s.u.CommitTracker Soft AutoCommit: disabled
   [junit4]   2> 2502 INFO  (coreLoadExecutor-6-thread-2) [    x:collection2] o.a.s.u.CommitTracker Hard AutoCommit: disabled
   [junit4]   2> 2502 INFO  (coreLoadExecutor-6-thread-2) [    x:collection2] o.a.s.u.CommitTracker Soft AutoCommit: disabled
   [junit4]   2> 2518 INFO  (coreLoadExecutor-6-thread-3) [    x:collection5] o.a.s.u.RandomMergePolicy RandomMergePolicy wrapping class org.apache.lucene.index.AlcoholicMergePolicy: [AlcoholicMergePolicy: minMergeSize=0, mergeFactor=10, maxMergeSize=330678612, maxMergeSizeForForcedMerge=9223372036854775807, calibrateSizeByDeletes=true, maxMergeDocs=2147483647, maxCFSSegmentSizeMB=8.796093022207999E12, noCFSRatio=0.1]
   [junit4]   2> 2522 INFO  (coreLoadExecutor-6-thread-1) [    x:collection1] o.a.s.u.RandomMergePolicy RandomMergePolicy wrapping class org.apache.lucene.index.AlcoholicMergePolicy: [AlcoholicMergePolicy: minMergeSize=0, mergeFactor=10, maxMergeSize=330678612, maxMergeSizeForForcedMerge=9223372036854775807, calibrateSizeByDeletes=true, maxMergeDocs=2147483647, maxCFSSegmentSizeMB=8.796093022207999E12, noCFSRatio=0.1]
   [junit4]   2> 2526 INFO  (coreLoadExecutor-6-thread-2) [    x:collection2] o.a.s.u.RandomMergePolicy RandomMergePolicy wrapping class org.apache.lucene.index.AlcoholicMergePolicy: [AlcoholicMergePolicy: minMergeSize=0, mergeFactor=10, maxMergeSize=330678612, maxMergeSizeForForcedMerge=9223372036854775807, calibrateSizeByDeletes=true, maxMergeDocs=2147483647, maxCFSSegmentSizeMB=8.796093022207999E12, noCFSRatio=0.1]
   [junit4]   2> 2552 INFO  (coreLoadExecutor-6-thread-1) [    x:collection1] o.a.s.s.SolrIndexSearcher Opening [Searcher@1398ff2b[collection1] main]
   [junit4]   2> 2556 INFO  (coreLoadExecutor-6-thread-3) [    x:collection5] o.a.s.s.SolrIndexSearcher Opening [Searcher@23519c82[collection5] main]
   [junit4]   2> 2556 INFO  (coreLoadExecutor-6-thread-2) [    x:collection2] o.a.s.s.SolrIndexSearcher Opening [Searcher@615ea52e[collection2] main]
   [junit4]   2> 2581 INFO  (coreLoadExecutor-6-thread-2) [    x:collection2] o.a.s.r.ManagedResourceStorage File-based storage initialized to use dir: /x1/jenkins/jenkins-slave/workspace/Lucene-Solr-Tests-master/solr/build/solr-core/test/J0/temp/solr.core.TestLazyCores_342C810C6A05F56C-001/tempDir-001/collection2/conf
   [junit4]   2> 2590 INFO  (coreLoadExecutor-6-thread-3) [    x:collection5] o.a.s.r.ManagedResourceStorage File-based storage initialized to use dir: /x1/jenkins/jenkins-slave/workspace/Lucene-Solr-Tests-master/solr/build/solr-core/test/J0/temp/solr.core.TestLazyCores_342C810C6A05F56C-001/tempDir-001/collection5/conf
   [junit4]   2> 2590 INFO  (coreLoadExecutor-6-thread-1) [    x:collection1] o.a.s.r.ManagedResourceStorage File-based storage initialized to use dir: /x1/jenkins/jenkins-slave/workspace/Lucene-Solr-Tests-master/solr/build/solr-core/test/J0/temp/solr.core.TestLazyCores_342C810C6A05F56C-001/tempDir-001/collection1/conf
   [junit4]   2> 2613 INFO  (coreLoadExecutor-6-thread-2) [    x:collection2] o.a.s.h.ReplicationHandler Commits will be reserved for  10000
   [junit4]   2> 2613 INFO  (coreLoadExecutor-6-thread-3) [    x:collection5] o.a.s.h.ReplicationHandler Commits will be reserved for  10000
   [junit4]   2> 2613 INFO  (coreLoadExecutor-6-thread-1) [    x:collection1] o.a.s.h.ReplicationHandler Commits will be reserved for  10000
   [junit4]   2> 2761 INFO  (searcherExecutor-8-thread-1-processing-x:collection1) [    x:collection1] o.a.s.c.SolrCore [collection1] Registered new searcher Searcher@1398ff2b[collection1] main{ExitableDirectoryReader(UninvertingDirectoryReader())}
   [junit4]   2> 2767 INFO  (searcherExecutor-9-thread-1-processing-x:collection2) [    x:collection2] o.a.s.c.SolrCore [collection2] Registered new searcher Searcher@615ea52e[collection2] main{ExitableDirectoryReader(UninvertingDirectoryReader())}
   [junit4]   2> 2774 INFO  (searcherExecutor-7-thread-1-processing-x:collection5) [    x:collection5] o.a.s.c.SolrCore [collection5] Registered new searcher Searcher@23519c82[collection5] main{ExitableDirectoryReader(UninvertingDirectoryReader())}
   [junit4]   2> 2807 INFO  (TEST-TestLazyCores.testLazySearch-seed#[342C810C6A05F56C]) [    x:collection4] o.a.s.c.SolrConfig Using Lucene MatchVersion: 7.0.0
   [junit4]   2> 2853 INFO  (TEST-TestLazyCores.testLazySearch-seed#[342C810C6A05F56C]) [    x:collection4] o.a.s.s.IndexSchema [collection4] Schema name=tiny
   [junit4]   2> 2857 INFO  (TEST-TestLazyCores.testLazySearch-seed#[342C810C6A05F56C]) [    x:collection4] o.a.s.s.IndexSchema Loaded schema tiny/1.1 with uniqueid field id
   [junit4]   2> 2857 INFO  (TEST-TestLazyCores.testLazySearch-seed#[342C810C6A05F56C]) [    x:collection4] o.a.s.c.CoreContainer Creating SolrCore 'collection4' using configuration from instancedir /x1/jenkins/jenkins-slave/workspace/Lucene-Solr-Tests-master/solr/build/solr-core/test/J0/temp/solr.core.TestLazyCores_342C810C6A05F56C-001/tempDir-001/./collection4, trusted=true
   [junit4]   2> 2858 INFO  (TEST-TestLazyCores.testLazySearch-seed#[342C810C6A05F56C]) [    x:collection4] o.a.s.c.SolrCore solr.RecoveryStrategy.Builder
   [junit4]   2> 2858 INFO  (TEST-TestLazyCores.testLazySearch-seed#[342C810C6A05F56C]) [    x:collection4] o.a.s.c.SolrCore [[collection4] ] Opening new SolrCore at [/x1/jenkins/jenkins-slave/workspace/Lucene-Solr-Tests-master/solr/build/solr-core/test/J0/temp/solr.core.TestLazyCores_342C810C6A05F56C-001/tempDir-001/collection4], dataDir=[/x1/jenkins/jenkins-slave/workspace/Lucene-Solr-Tests-master/solr/build/solr-core/test/J0/temp/solr.core.TestLazyCores_342C810C6A05F56C-001/tempDir-001/./collection4/data/]
   [junit4]   2> 2861 INFO  (TEST-TestLazyCores.testLazySearch-seed#[342C810C6A05F56C]) [    x:collection4] o.a.s.u.RandomMergePolicy RandomMergePolicy wrapping class org.apache.lucene.index.LogDocMergePolicy: [LogDocMergePolicy: minMergeSize=1000, mergeFactor=35, maxMergeSize=9223372036854775807, maxMergeSizeForForcedMerge=9223372036854775807, calibrateSizeByDeletes=false, maxMergeDocs=2147483647, maxCFSSegmentSizeMB=8.796093022207999E12, noCFSRatio=0.0]
   [junit4]   2> 2976 INFO  (TEST-TestLazyCores.testLazySearch-seed#[342C810C6A05F56C]) [    x:collection4] o.a.s.u.CommitTracker Hard AutoCommit: disabled
   [junit4]   2> 2977 INFO  (TEST-TestLazyCores.testLazySearch-seed#[342C810C6A05F56C]) [    x:collection4] o.a.s.u.CommitTracker Soft AutoCommit: disabled
   [junit4]   2> 2979 INFO  (TEST-TestLazyCores.testLazySearch-seed#[342C810C6A05F56C]) [    x:collection4] o.a.s.u.RandomMergePolicy RandomMergePolicy wrapping class org.apache.lucene.index.TieredMergePolicy: [TieredMergePolicy: maxMergeAtOnce=36, maxMergeAtOnceExplicit=17, maxMergedSegmentMB=32.8564453125, floorSegmentMB=0.2958984375, forceMergeDeletesPctAllowed=19.604767483566363, segmentsPerTier=24.0, maxCFSSegmentSizeMB=8.796093022207999E12, noCFSRatio=1.0
   [junit4]   2> 2991 INFO  (TEST-TestLazyCores.testLazySearch-seed#[342C810C6A05F56C]) [    x:collection4] o.a.s.s.SolrIndexSearcher Opening [Searcher@6b1b5350[collection4] main]
   [junit4]   2> 2992 INFO  (TEST-TestLazyCores.testLazySearch-seed#[342C810C6A05F56C]) [    x:collection4] o.a.s.r.ManagedResourceStorage File-based storage initialized to use dir: /x1/jenkins/jenkins-slave/workspace/Lucene-Solr-Tests-master/solr/build/solr-core/test/J0/temp/solr.core.TestLazyCores_342C810C6A05F56C-001/tempDir-001/collection4/conf
   [junit4]   2> 2992 INFO  (TEST-TestLazyCores.testLazySearch-seed#[342C810C6A05F56C]) [    x:collection4] o.a.s.h.ReplicationHandler Commits will be reserved for  10000
   [junit4]   2> 2993 INFO  (searcherExecutor-19-thread-1-processing-x:collection4) [    x:collection4] o.a.s.c.SolrCore [collection4] Registered new searcher Searcher@6b1b5350[collection4] main{ExitableDirectoryReader(UninvertingDirectoryReader())}
   [junit4]   2> 3160 INFO  (TEST-TestLazyCores.testLazySearch-seed#[342C810C6A05F56C]) [    x:collection4] o.a.s.u.DirectUpdateHandler2 start commit{,optimize=false,openSearcher=true,waitSearcher=true,expungeDeletes=false,softCommit=false,prepareCommit=false}
   [junit4]   2> 3160 INFO  (TEST-TestLazyCores.testLazySearch-seed#[342C810C6A05F56C]) [    x:collection4] o.a.s.u.SolrIndexWriter Calling setCommitData with IW:org.apache.solr.update.SolrIndexWriter@54cedeb9 commitCommandVersion:0
   [junit4]   2> 3624 INFO  (TEST-TestLazyCores.testLazySearch-seed#[342C810C6A05F56C]) [    x:collection4] o.a.s.s.SolrIndexSearcher Opening [Searcher@1412feed[collection4] main]
   [junit4]   2> 3625 INFO  (TEST-TestLazyCores.testLazySearch-seed#[342C810C6A05F56C]) [    x:collection4] o.a.s.u.DirectUpdateHandler2 end_commit_flush
   [junit4]   2> 3627 INFO  (searcherExecutor-19-thread-1-processing-x:collection4) [    x:collection4] o.a.s.c.SolrCore [collection4] Registered new searcher Searcher@1412feed[collection4] main{ExitableDirectoryReader(UninvertingDirectoryReader(Uninverting(_0(7.0.0):C7)))}
   [junit4]   2> 3758 INFO  (TEST-TestLazyCores.testLazySearch-seed#[342C810C6A05F56C]) [    x:collection4] o.a.s.c.S.Request [collection4]  webapp=null path=null params={q={!prefix+f%3Dv_t}hel&wt=xml} hits=2 status=0 QTime=127
   [junit4]   2> 3817 INFO  (TEST-TestLazyCores.testLazySearch-seed#[342C810C6A05F56C]) [    x:collection4] o.a.s.c.S.Request [collection4]  webapp=null path=null params={q={!raw+f%3Dv_t}hello&wt=xml} hits=2 status=0 QTime=9
   [junit4]   2> 3831 INFO  (TEST-TestLazyCores.testLazySearch-seed#[342C810C6A05F56C]) [    x:collection4] o.a.s.c.S.Request [collection4]  webapp=null path=null params={q={!raw+f%3Dv_t}Hello&wt=xml} hits=0 status=0 QTime=0
   [junit4]   2> 3833 INFO  (TEST-TestLazyCores.testLazySearch-seed#[342C810C6A05F56C]) [    x:collection4] o.a.s.c.S.Request [collection4]  webapp=null path=null params={q={!raw+f%3Dv_f}1.5&wt=xml} hits=0 status=0 QTime=1
   [junit4]   2> 3839 INFO  (TEST-TestLazyCores.testLazySearch-seed#[342C810C6A05F56C]) [    x:collection4] o.a.s.c.S.Request [collection1]  webapp=null path=null params={q={!raw+f%3Dv_t}hello&wt=xml} hits=0 status=0 QTime=0
   [junit4]   2> 3840 INFO  (TEST-TestLazyCores.testLazySearch-seed#[342C810C6A05F56C]) [    x:collection4] o.a.s.c.CoreContainer Shutting down CoreContainer instance=1429744939
   [junit4]   2> 3840 INFO  (TEST-TestLazyCores.testLazySearch-seed#[342C810C6A05F56C]) [    x:collection4] o.a.s.m.SolrMetricManager Closing metric reporters for registry=solr.node, tag=null
   [junit4]   2> 3841 INFO  (TEST-TestLazyCores.testLazySearch-seed#[342C810C6A05F56C]) [    x:collection4] o.a.s.m.SolrMetricManager Closing metric reporters for registry=solr.jvm, tag=null
   [junit4]   2> 3841 INFO  (TEST-TestLazyCores.testLazySearch-seed#[342C810C6A05F56C]) [    x:collection4] o.a.s.m.SolrMetricManager Closing metric reporters for registry=solr.jetty, tag=null
   [junit4]   2> 3898 INFO  (coreCloseExecutor-23-thread-1-processing-x:collection4) [    x:collection1] o.a.s.c.SolrCore [collection1]  CLOSING SolrCore org.apache.solr.core.SolrCore@5efda4c1
   [junit4]   2> 3902 INFO  (coreCloseExecutor-23-thread-2-processing-x:collection4) [    x:collection5] o.a.s.c.SolrCore [collection5]  CLOSING SolrCore org.apache.solr.core.SolrCore@216a96a
   [junit4]   2> 3904 INFO  (coreCloseExecutor-23-thread-3-processing-x:collection4) [    x:collection4] o.a.s.c.SolrCore [collection4]  CLOSING SolrCore org.apache.solr.core.SolrCore@7f4f649c
   [junit4]   2> 3924 INFO  (coreCloseExecutor-23-thread-2-processing-x:collection4) [    x:collection5] o.a.s.m.SolrMetricManager Closing metric reporters for registry=solr.core.collection5, tag=35039594
   [junit4]   2> 3934 INFO  (coreCloseExecutor-23-thread-4-processing-x:collection4) [    x:collection2] o.a.s.c.SolrCore [collection2]  CLOSING SolrCore org.apache.solr.core.SolrCore@6a53ea43
   [junit4]   2> 3943 INFO  (coreCloseExecutor-23-thread-4-processing-x:collection4) [    x:collection2] o.a.s.m.SolrMetricManager Closing metric reporters for registry=solr.core.collection2, tag=1783884355
   [junit4]   2> 3974 INFO  (coreCloseExecutor-23-thread-3-processing-x:collection4) [    x:collection4] o.a.s.m.SolrMetricManager Closing metric reporters for registry=solr.core.collection4, tag=2135909532
   [junit4]   2> 3984 INFO  (coreCloseExecutor-23-thread-1-processing-x:collection4) [    x:collection1] o.a.s.m.SolrMetricManager Closing metric reporters for registry=solr.core.collection1, tag=1593681089
   [junit4]   2> 3985 INFO  (TEST-TestLazyCores.testLazySearch-seed#[342C810C6A05F56C]) [    x:collection4] o.a.s.SolrTestCaseJ4 ###Ending testLazySearch
   [junit4]   2> 3990 INFO  (TEST-TestLazyCores.testMidUseUnload-seed#[342C810C6A05F56C]) [    x:collection4] o.a.s.SolrTestCaseJ4 ###Starting testMidUseUnload
   [junit4]   2> 4012 INFO  (TEST-TestLazyCores.testMidUseUnload-seed#[342C810C6A05F56C]) [    x:collection4] o.a.s.c.SolrXmlConfig Loading container configuration from /x1/jenkins/jenkins-slave/workspace/Lucene-Solr-Tests-master/solr/build/solr-core/test/J0/temp/solr.core.TestLazyCores_342C810C6A05F56C-001/tempDir-002/solr.xml
   [junit4]   2> 4096 INFO  (TEST-TestLazyCores.testMidUseUnload-seed#[342C810C6A05F56C]) [    x:collection4] o.a.s.c.TransientSolrCoreCacheDefault Allocating transient cache for 4 transient cores
   [junit4]   2> 4170 INFO  (coreLoadExecutor-30-thread-3-processing-x:collection4) [    x:collection5] o.a.s.c.SolrConfig Using Lucene MatchVersion: 7.0.0
   [junit4]   2> 4183 INFO  (coreLoadExecutor-30-thread-1-processing-x:collection4) [    x:collection1] o.a.s.c.SolrConfig Using Lucene MatchVersion: 7.0.0
   [junit4]   2> 4216 INFO  (coreLoadExecutor-30-thread-2-processing-x:collection4) [    x:collection2] o.a.s.c.SolrConfig Using Lucene MatchVersion: 7.0.0
   [junit4]   2> 4239 INFO  (coreLoadExecutor-30-thread-3-processing-x:collection4) [    x:collection5] o.a.s.s.IndexSchema [collection5] Schema name=tiny
   [junit4]   2> 4271 INFO  (coreLoadExecutor-30-thread-3-processing-x:collection4) [    x:collection5] o.a.s.s.IndexSchema Loaded schema tiny/1.1 with uniqueid field id
   [junit4]   2> 4271 INFO  (coreLoadExecutor-30-thread-3-processing-x:collection4) [    x:collection5] o.a.s.c.CoreContainer Creating SolrCore 'collection5' using configuration from instancedir /x1/jenkins/jenkins-slave/workspace/Lucene-Solr-Tests-master/solr/build/solr-core/test/J0/temp/solr.core.TestLazyCores_342C810C6A05F56C-001/tempDir-002/./collection5, trusted=true
   [junit4]   2> 4272 INFO  (coreLoadExecutor-30-thread-3-processing-x:collection4) [    x:collection5] o.a.s.c.SolrCore solr.RecoveryStrategy.Builder
   [junit4]   2> 4272 INFO  (coreLoadExecutor-30-thread-3-processing-x:collection4) [    x:collection5] o.a.s.c.SolrCore [[collection5] ] Opening new SolrCore at [/x1/jenkins/jenkins-slave/workspace/Lucene-Solr-Tests-master/solr/build/solr-core/test/J0/temp/solr.core.TestLazyCores_342C810C6A05F56C-001/tempDir-002/collection5], dataDir=[/x1/jenkins/jenkins-slave/workspace/Lucene-Solr-Tests-master/solr/build/solr-core/test/J0/temp/solr.core.TestLazyCores_342C810C6A05F56C-001/tempDir-002/./collection5/data/]
   [junit4]   2> 4275 INFO  (coreLoadExecutor-30-thread-3-processing-x:collection4) [    x:collection5] o.a.s.u.RandomMergePolicy RandomMergePolicy wrapping class org.apache.lucene.index.LogDocMergePolicy: [LogDocMergePolicy: minMergeSize=1000, mergeFactor=50, maxMergeSize=9223372036854775807, maxMergeSizeForForcedMerge=9223372036854775807, calibrateSizeByDeletes=true, maxMergeDocs=2147483647, maxCFSSegmentSizeMB=8.796093022207999E12, noCFSRatio=0.36459640234102664]
   [junit4]   2> 4280 INFO  (coreLoadExecutor-30-thread-1-processing-x:collection4) [    x:collection1] o.a.s.s.IndexSchema [collection1] Schema name=tiny
   [junit4]   2> 4284 INFO  (coreLoadExecutor-30-thread-1-processing-x:collection4) [    x:collection1] o.a.s.s.IndexSchema Loaded schema tiny/1.1 with uniqueid field id
   [junit4]   2> 4284 INFO  (coreLoadExecutor-30-thread-1-processing-x:collection4) [    x:collection1] o.a.s.c.CoreContainer Creating SolrCore 'collection1' using configuration from instancedir /x1/jenkins/jenkins-slave/workspace/Lucene-Solr-Tests-master/solr/build/solr-core/test/J0/temp/solr.core.TestLazyCores_342C810C6A05F56C-001/tempDir-002/./collection1, trusted=true
   [junit4]   2> 4285 INFO  (coreLoadExecutor-30-thread-2-processing-x:collection4) [    x:collection2] o.a.s.s.IndexSchema [collection2] Schema name=tiny
   [junit4]   2> 4289 INFO  (coreLoadExecutor-30-thread-2-processing-x:collection4) [    x:collection2] o.a.s.s.IndexSchema Loaded schema tiny/1.1 with uniqueid field id
   [junit4]   2> 4289 INFO  (coreLoadExecutor-30-thread-2-processing-x:collection4) [    x:collection2] o.a.s.c.CoreContainer Creating SolrCore 'collection2' using configuration from instancedir /x1/jenkins/jenkins-slave/workspace/Lucene-Solr-Tests-master/solr/build/solr-core/test/J0/temp/solr.core.TestLazyCores_342C810C6A05F56C-001/tempDir-002/./collection2, trusted=true
   [junit4]   2> 4289 INFO  (coreLoadExecutor-30-thread-2-processing-x:collection4) [    x:collection2] o.a.s.c.SolrCore solr.RecoveryStrategy.Builder
   [junit4]   2> 4289 INFO  (coreLoadExecutor-30-thread-2-processing-x:collection4) [    x:collection2] o.a.s.c.SolrCore [[collection2] ] Opening new SolrCore at [/x1/jenkins/jenkins-slave/workspace/Lucene-Solr-Tests-master/solr/build/solr-core/test/J0/temp/solr.core.TestLazyCores_342C810C6A05F56C-001/tempDir-002/collection2], dataDir=[/x1/jenkins/jenkins-slave/workspace/Lucene-Solr-Tests-master/solr/build/solr-core/test/J0/temp/solr.core.TestLazyCores_342C810C6A05F56C-001/tempDir-002/./collection2/data/]
   [junit4]   2> 4306 INFO  (coreLoadExecutor-30-thread-1-processing-x:collection4) [    x:collection1] o.a.s.c.SolrCore solr.RecoveryStrategy.Builder
   [junit4]   2> 4307 INFO  (coreLoadExecutor-30-thread-1-processing-x:collection4) [    x:collection1] o.a.s.c.SolrCore [[collection1] ] Opening new SolrCore at [/x1/jenkins/jenkins-slave/workspace/Lucene-Solr-Tests-master/solr/build/solr-core/test/J0/temp/solr.core.TestLazyCores_342C810C6A05F56C-001/tempDir-002/collection1], dataDir=[/x1/jenkins/jenkins-slave/workspace/Lucene-Solr-Tests-master/solr/build/solr-core/test/J0/temp/solr.core.TestLazyCores_342C810C6A05F56C-001/tempDir-002/./collection1/data/]
   [junit4]   2> 4309 INFO  (coreLoadExecutor-30-thread-2-processing-x:collection4) [    x:collection2] o.a.s.u.RandomMergePolicy RandomMergePolicy wrapping class org.apache.lucene.index.LogDocMergePolicy: [LogDocMergePolicy: minMergeSize=1000, mergeFactor=50, maxMergeSize=9223372036854775807, maxMergeSizeForForcedMerge=9223372036854775807, calibrateSizeByDeletes=true, maxMergeDocs=2147483647, maxCFSSegmentSizeMB=8.796093022207999E12, noCFSRatio=0.36459640234102664]
   [junit4]   2> 4322 INFO  (coreLoadExecutor-30-thread-1-processing-x:collection4) [    x:collection1] o.a.s.u.RandomMergePolicy RandomMergePolicy wrapping class org.apache.lucene.index.LogDocMergePolicy: [LogDocMergePolicy: minMergeSize=1000, mergeFactor=50, maxMergeSize=9223372036854775807, maxMergeSizeForForcedMerge=9223372036854775807, calibrateSizeByDeletes=true, maxMergeDocs=2147483647, maxCFSSegmentSizeMB=8.796093022207999E12, noCFSRatio=0.36459640234102664]
   [junit4]   2> 4402 INFO  (coreLoadExecutor-30-thread-3-processing-x:collection4) [    x:collection5] o.a.s.u.CommitTracker Hard AutoCommit: disabled
   [junit4]   2> 4402 INFO  (coreLoadExecutor-30-thread-3-processing-x:collection4) [    x:collection5] o.a.s.u.CommitTracker Soft AutoCommit: disabled
   [junit4]   2> 4403 INFO  (coreLoadExecutor-30-thread-3-processing-x:collection4) [    x:collection5] o.a.s.u.RandomMergePolicy RandomMergePolicy wrapping class org.apache.lucene.index.AlcoholicMergePolicy: [AlcoholicMergePolicy: minMergeSize=0, mergeFactor=10, maxMergeSize=330678612, maxMergeSizeForForcedMerge=9223372036854775807, calibrateSizeByDeletes=true, maxMergeDocs=2147483647, maxCFSSegmentSizeMB=8.796093022207999E12, noCFSRatio=0.1]
   [junit4]   2> 4418 INFO  (coreLoadExecutor-30-thread-2-processing-x:collection4) [    x:collection2] o.a.s.u.CommitTracker Hard AutoCommit: disabled
   [junit4]   2> 4418 INFO  (coreLoadExecutor-30-thread-2-processing-x:collection4) [    x:collection2] o.a.s.u.CommitTracker Soft AutoCommit: disabled
   [junit4]   2> 4419 INFO  (coreLoadExecutor-30-thread-2-processing-x:collection4) [    x:collection2] o.a.s.u.RandomMergePolicy RandomMergePolicy wrapping class org.apache.lucene.index.AlcoholicMergePolicy: [AlcoholicMergePolicy: minMergeSize=0, mergeFactor=10, maxMergeSize=330678612, maxMergeSizeForForcedMerge=9223372036854775807, calibrateSizeByDeletes=true, maxMergeDocs=2147483647, maxCFSSegmentSizeMB=8.796093022207999E12, noCFSRatio=0.1]
   [junit4]   2> 4423 INFO  (coreLoadExecutor-30-thread-3-processing-x:collection4) [    x:collection5] o.a.s.s.SolrIndexSearcher Opening [Searcher@6a38969d[collection5] main]
   [junit4]   2> 4424 INFO  (coreLoadExecutor-30-thread-3-processing-x:collection4) [    x:collection5] o.a.s.r.ManagedResourceStorage File-based storage initialized to use dir: /x1/jenkins/jenkins-slave/workspace/Lucene-Solr-Tests-master/solr/build/solr-core/test/J0/temp/solr.core.TestLazyCores_342C810C6A05F56C-001/tempDir-002/collection5/conf
   [junit4]   2> 4425 INFO  (coreLoadExecutor-30-thread-3-processing-x:collection4) [    x:collection5] o.a.s.h.ReplicationHandler Commits will be reserved for  10000
   [junit4]   2> 4426 INFO  (coreLoadExecutor-30-thread-2-processing-x:collection4) [    x:collection2] o.a.s.s.SolrIndexSearcher Opening [Searcher@209c1e6c[collection2] main]
   [junit4]   2> 4427 INFO  (coreLoadExecutor-30-thread-2-processing-x:collection4) [    x:collection2] o.a.s.r.ManagedResourceStorage File-based storage initialized to use dir: /x1/jenkins/jenkins-slave/workspace/Lucene-Solr-Tests-master/solr/build/solr-core/test/J0/temp/solr.core.TestLazyCores_342C810C6A05F56C-001/tempDir-002/collection2/conf
   [junit4]   2> 4427 INFO  (coreLoadExecutor-30-thread-2-processing-x:collection4) [    x:collection2] o.a.s.h.ReplicationHandler Commits will be reserved for  10000
   [junit4]   2> 4446 INFO  (searcherExecutor-31-thread-1-processing-x:collection5) [    x:collection5] o.a.s.c.SolrCore [collection5] Registered new searcher Searcher@6a38969d[collection5] main{ExitableDirectoryReader(UninvertingDirectoryReader())}
   [junit4]   2> 4457 INFO  (searcherExecutor-33-thread-1-processing-x:collection2) [    x:collection2] o.a.s.c.SolrCore [collection2] Registered new searcher Searcher@209c1e6c[collection2] main{ExitableDirectoryReader(UninvertingDirectoryReader())}
   [junit4]   2> 4459 INFO  (coreLoadExecutor-30-thread-1-processing-x:collection4) [    x:collection1] o.a.s.u.CommitTracker Hard AutoCommit: disabled
   [junit4]   2> 4459 INFO  (coreLoadExecutor-30-thread-1-processing-x:collection4) [    x:collection1] o.a.s.u.CommitTracker Soft AutoCommit: disabled
   [junit4]   2> 4460 INFO  (coreLoadExecutor-30-thread-1-processing-x:collection4) [    x:collection1] o.a.s.u.RandomMergePolicy RandomMergePolicy wrapping class org.apache.lucene.index.AlcoholicMergePolicy: [AlcoholicMergePolicy: minMergeSize=0, mergeFactor=10, maxMergeSize=330678612, maxMergeSizeForForcedMerge=9223372036854775807, calibrateSizeByDeletes=true, maxMergeDocs=2147483647, maxCFSSegmentSizeMB=8.796093022207999E12, noCFSRatio=0.1]
   [junit4]   2> 4462 INFO  (coreLoadExecutor-30-thread-1-processing-x:collection4) [    x:collection1] o.a.s.s.SolrIndexSearcher Opening [Searcher@7f261d84[collection1] main]
   [junit4]   2> 4462 INFO  (coreLoadExecutor-30-thread-1-processing-x:collection4) [    x:collection1] o.a.s.r.ManagedResourceStorage File-based storage initialized to use dir: /x1/jenkins/jenkins-slave/workspace/Lucene-Solr-Tests-master/solr/build/solr-core/test/J0/temp/solr.core.TestLazyCores_342C810C6A05F56C-001/tempDir-002/collection1/conf
   [junit4]   2> 4463 INFO  (coreLoadExecutor-30-thread-1-processing-x:collection4) [    x:collection1] o.a.s.h.ReplicationHandler Commits will be reserved for  10000
   [junit4]   2> 4465 INFO  (searcherExecutor-32-thread-1-processing-x:collection1) [    x:collection1] o.a.s.c.SolrCore [collection1] Registered new searcher Searcher@7f261d84[collection1] main{ExitableDirectoryReader(UninvertingDirectoryReader())}
   [junit4]   2> 4484 INFO  (TEST-TestLazyCores.testMidUseUnload-seed#[342C810C6A05F56C]) [    x:collection4] o.a.s.m.SolrMetricManager Closing metric reporters for registry=solr.core.collection1, tag=null
   [junit4]   2> 4485 INFO  (TEST-TestLazyCores.testMidUseUnload-seed#[342C810C6A05F56C]) [    x:collection4] o.a.s.c.SolrCore Core collection1 is not yet closed, waiting 100 ms before checking again.
   [junit4]   2> 4585 INFO  (TEST-TestLazyCores.testMidUseUnload-seed#[342C810C6A05F56C]) [    x:collection4] o.a.s.c.SolrCore Core collection1 is not yet closed, waiting 100 ms before checking again.
   [junit4]   2> 4685 INFO  (TEST-TestLazyCores.testMidUseUnload-seed#[342C810C6A05F56C]) [    x:collection4] o.a.s.c.SolrCore Core collection1 is not yet closed, waiting 100 ms before checking again.
   [junit4]   2> 4702 INFO  (Thread-3) [    x:collection4] o.a.s.c.SolrCore [collection1]  CLOSING SolrCore org.apache.solr.core.SolrCore@688c65b3
   [junit4]   2> 4704 INFO  (Thread-3) [    x:collection4] o.a.s.m.SolrMetricManager Closing metric reporters for registry=solr.core.collection1, tag=1754031539
   [junit4]   2> 4786 INFO  (TEST-TestLazyCores.testMidUseUnload-seed#[342C810C6A05F56C]) [    x:collection4] o.a.s.c.CoreContainer Shutting down CoreContainer instance=605487202
   [junit4]   2> 4786 INFO  (TEST-TestLazyCores.testMidUseUnload-seed#[342C810C6A05F56C]) [    x:collection4] o.a.s.m.SolrMetricManager Closing metric reporters for registry=solr.node, tag=null
   [junit4]   2> 4786 INFO  (TEST-TestLazyCores.testMidUseUnload-seed#[342C810C6A05F56C]) [    x:collection4] o.a.s.m.SolrMetricManager Closing metric reporters for registry=solr.jvm, tag=null
   [junit4]   2> 4786 INFO  (TEST-TestLazyCores.testMidUseUnload-seed#[342C810C6A05F56C]) [    x:collection4] o.a.s.m.SolrMetricManager Closing metric reporters for registry=solr.jetty, tag=null
   [junit4]   2> 4808 INFO  (coreCloseExecutor-44-thread-1-processing-x:collection4) [    x:collection5] o.a.s.c.SolrCore [collection5]  CLOSING SolrCore org.apache.solr.core.SolrCore@1c2e8e6f
   [junit4]   2> 4814 INFO  (coreCloseExecutor-44-thread-2-processing-x:collection4) [    x:collection2] o.a.s.c.SolrCore [collection2]  CLOSING SolrCore org.apache.solr.core.SolrCore@7d765a91
   [junit4]   2> 4816 INFO  (coreCloseExecutor-44-thread-2-processing-x:collection4) [    x:collection2] o.a.s.m.SolrMetricManager Closing metric reporters for registry=solr.core.collection2, tag=2104908433
   [junit4]   2> 4826 INFO  (coreCloseExecutor-44-thread-1-processing-x:collection4) [    x:collection5] o.a.s.m.SolrMetricManager Closing metric reporters for registry=solr.core.collection5, tag=472813167
   [junit4]   2> 4826 INFO  (TEST-TestLazyCores.testMidUseUnload-seed#[342C810C6A05F56C]) [    x:collection4] o.a.s.SolrTestCaseJ4 ###Ending testMidUseUnload
   [junit4]   2> 4839 INFO  (TEST-TestLazyCores.testCreateSame-seed#[342C810C6A05F56C]) [    x:collection4] o.a.s.SolrTestCaseJ4 ###Starting testCreateSame
   [junit4]   2> 4858 INFO  (TEST-TestLazyCores.testCreateSame-seed#[342C810C6A05F56C]) [    x:collection4] o.a.s.c.SolrXmlConfig Loading container configuration from /x1/jenkins/jenkins-slave/workspace/Lucene-Solr-Tests-master/solr/build/solr-core/test/J0/temp/solr.core.TestLazyCores_342C810C6A05F56C-001/tempDir-003/solr.xml
   [junit4]   2> 4984 INFO  (TEST-TestLazyCores.testCreateSame-seed#[342C810C6A05F56C]) [    x:collection4] o.a.s.c.TransientSolrCoreCacheDefault Allocating transient cache for 4 transient cores
   [junit4]   2> 5054 INFO  (coreLoadExecutor-51-thread-2-processing-x:collection4) [    x:collection2] o.a.s.c.SolrConfig Using Lucene MatchVersion: 7.0.0
   [junit4]   2> 5101 INFO  (coreLoadExecutor-51-thread-3-processing-x:collection4) [    x:collection5] o.a.s.c.SolrConfig Using Lucene MatchVersion: 7.0.0
   [junit4]   2> 5094 INFO  (coreLoadExecutor-51-thread-1-processing-x:collection4) [    x:collection1] o.a.s.c.SolrConfig Using Lucene MatchVersion: 7.0.0
   [junit4]   2> 5125 INFO  (coreLoadExecutor-51-thread-1-processing-x:collection4) [    x:collection1] o.a.s.s.IndexSchema [collection1] Schema name=tiny
   [junit4]   2> 5127 INFO  (coreLoadExecutor-51-thread-2-processing-x:collection4) [    x:collection2] o.a.s.s.IndexSchema [collection2] Schema name=tiny
   [junit4]   2> 5144 INFO  (coreLoadExecutor-51-thread-1-processing-x:collection4) [    x:collection1] o.a.s.s.IndexSchema Loaded schema tiny/1.1 with uniqueid field id
   [junit4]   2> 5144 INFO  (coreLoadExecutor-51-thread-1-processing-x:collection4) [    x:collection1] o.a.s.c.CoreContainer Creating SolrCore 'collection1' using configuration from instancedir /x1/jenkins/jenkins-slave/workspace/Lucene-Solr-Tests-master/solr/build/solr-core/test/J0/temp/solr.core.TestLazyCores_342C810C6A05F56C-001/tempDir-003/./collection1, trusted=true
   [junit4]   2> 5144 INFO  (coreLoadExecutor-51-thread-1-processing-x:collection4) [    x:collection1] o.a.s.c.SolrCore solr.RecoveryStrategy.Builder
   [junit4]   2> 5145 INFO  (coreLoadExecutor-51-thread-1-processing-x:collection4) [    x:collection1] o.a.s.c.SolrCore [[collection1] ] Opening new SolrCore at [/x1/jenkins/jenkins-slave/workspace/Lucene-Solr-Tests-master/solr/build/solr-core/test/J0/temp/solr.core.TestLazyCores_342C810C6A05F56C-001/tempDir-003/collection1], dataDir=[/x1/jenkins/jenkins-slave/workspace/Lucene-Solr-Tests-master/solr/build/solr-core/test/J0/temp/solr.core.TestLazyCores_342C810C6A05F56C-001/tempDir-003/./collection1/data/]
   [junit4]   2> 5159 INFO  (coreLoadExecutor-51-thread-3-processing-x:collection4) [    x:collection5] o.a.s.s.IndexSchema [collection5] Schema name=tiny
   [junit4]   2> 5160 INFO  (coreLoadExecutor-51-thread-2-processing-x:collection4) [    x:collection2] o.a.s.s.IndexSchema Loaded schema tiny/1.1 with uniqueid field id
   [junit4]   2> 5160 INFO  (coreLoadExecutor-51-thread-2-processing-x:collection4) [    x:collection2] o.a.s.c.CoreContainer Creating SolrCore 'collection2' using configuration from instancedir /x1/jenkins/jenkins-slave/workspace/Lucene-Solr-Tests-master/solr/build/solr-core/test/J0/temp/solr.core.TestLazyCores_342C810C6A05F56C-001/tempDir-003/./collection2, trusted=true
   [junit4]   2> 5164 INFO  (coreLoadExecutor-51-thread-2-processing-x:collection4) [    x:collection2] o.a.s.c.SolrCore solr.RecoveryStrategy.Builder
   [junit4]   2> 5164 INFO  (coreLoadExecutor-51-thread-2-processing-x:collection4) [    x:collection2] o.a.s.c.SolrCore [[collection2] ] Opening new SolrCore at [/x1/jenkins/jenkins-slave/workspace/Lucene-Solr-Tests-master/solr/build/solr-core/test/J0/temp/solr.core.TestLazyCores_342C810C6A05F56C-001/tempDir-003/collection2], dataDir=[/x1/jenkins/jenkins-slave/workspace/Lucene-Solr-Tests-master/solr/build/solr-core/test/J0/temp/solr.core.TestLazyCores_342C810C6A05F56C-001/tempDir-003/./collection2/data/]
   [junit4]   2> 5174 INFO  (coreLoadExecutor-51-thread-1-processing-x:collection4) [    x:collection1] o.a.s.u.RandomMergePolicy RandomMergePolicy wrapping class org.apache.lucene.index.LogDocMergePolicy: [LogDocMergePolicy: minMergeSize=1000, mergeFactor=50, maxMergeSize=9223372036854775807, maxMergeSizeForForcedMerge=9223372036854775807, calibrateSizeByDeletes=true, maxMergeDocs=2147483647, maxCFSSegmentSizeMB=8.796093022207999E12, noCFSRatio=0.36459640234102664]
   [junit4]   2> 5176 INFO  (coreLoadExecutor-51-thread-2-processing-x:collection4) [    x:collection2] o.a.s.u.RandomMergePolicy RandomMergePolicy wrapping class org.apache.lucene.index.LogDocMergePolicy: [LogDocMergePolicy: minMergeSize=1000, mergeFactor=50, maxMergeSize=9223372036854775807, maxMergeSizeForForcedMerge=9223372036854775807, calibrateSizeByDeletes=true, maxMergeDocs=2147483647, maxCFSSegmentSizeMB=8.796093022207999E12, noCFSRatio=0.36459640234102664]
   [junit4]   2> 5178 INFO  (coreLoadExecutor-51-thread-3-processing-x:collection4) [    x:collection5] o.a.s.s.IndexSchema Loaded schema tiny/1.1 with uniqueid field id
   [junit4]   2> 5178 INFO  (coreLoadExecutor-51-thread-3-processing-x:collection4) [    x:collection5] o.a.s.c.CoreContainer Creating SolrCore 'collection5' using configuration from instancedir /x1/jenkins/jenkins-slave/workspace/Lucene-Solr-Tests-master/solr/build/solr-core/test/J0/temp/solr.core.TestLazyCores_342C810C6A05F56C-001/tempDir-003/./collection5, trusted=true
   [junit4]   2> 5178 INFO  (coreLoadExecutor-51-thread-3-processing-x:collection4) [    x:collection5] o.a.s.c.SolrCore solr.RecoveryStrategy.Builder
   [junit4]   2> 5178 INFO  (coreLoadExecutor-51-thread-3-processing-x:collection4) [    x:collection5] o.a.s.c.SolrCore [[collection5] ] Opening new SolrCore at [/x1/jenkins/jenkins-slave/workspace/Lucene-Solr-Tests-master/solr/build/solr-core/test/J0/temp/solr.core.TestLazyCores_342C810C6A05F56C-001/tempDir-003/collection5], dataDir=[/x1/jenkins/jenkins-slave/workspace/Lucene-Solr-Tests-master/solr/build/solr-core/test/J0/temp/solr.core.TestLazyCores_342C810C6A05F56C-001/tempDir-003/./collection5/data/]
   [junit4]   2> 5182 INFO  (coreLoadExecutor-51-thread-3-processing-x:collection4) [    x:collection5] o.a.s.u.RandomMergePolicy RandomMergePolicy wrapping class org.apache.lucene.index.LogDocMergePolicy: [LogDocMergePolicy: minMergeSize=1000, mergeFactor=50, maxMergeSize=9223372036854775807, maxMergeSizeForForcedMerge=9223372036854775807, calibrateSizeByDeletes=true, maxMergeDocs=2147483647, maxCFSSegmentSizeMB=8.796093022207999E12, noCFSRatio=0.36459640234102664]
   [junit4]   2> 5330 INFO  (coreLoadExecutor-51-thread-2-processing-x:collection4) [    x:collection2] o.a.s.u.CommitTracker Hard AutoCommit: disabled
   [junit4]   2> 5330 INFO  (coreLoadExecutor-51-thread-2-processing-x:collection4) [    x:collection2] o.a.s.u.CommitTracker Soft AutoCommit: disabled
   [junit4]   2> 5331 INFO  (coreLoadExecutor-51-thread-2-processing-x:collection4) [    x:collection2] o.a.s.u.RandomMergePolicy RandomMergePolicy wrapping class org.apache.lucene.index.AlcoholicMergePolicy: [AlcoholicMergePolicy: minMergeSize=0, mergeFactor=10, maxMergeSize=330678612, maxMergeSizeForForcedMerge=9223372036854775807, calibrateSizeByDeletes=true, maxMergeDocs=2147483647, maxCFSSegmentSizeMB=8.796093022207999E12, noCFSRatio=0.1]
   [junit4]   2> 5412 INFO  (coreLoadExecutor-51-thread-1-processing-x:collection4) [    x:collection1] o.a.s.u.CommitTracker Hard AutoCommit: disabled
   [junit4]   2> 5412 INFO  (coreLoadExecutor-51-thread-1-processing-x:collection4) [    x:collection1] o.a.s.u.CommitTracker Soft AutoCommit: disabled
   [junit4]   2> 5413 INFO  (coreLoadExecutor-51-thread-1-processing-x:collection4) [    x:collection1] o.a.s.u.RandomMergePolicy RandomMergePolicy wrapping class org.apache.lucene.index.AlcoholicMergePolicy: [AlcoholicMergePolicy: minMergeSize=0, mergeFactor=10, maxMergeSize=330678612, maxMergeSizeForForcedMerge=9223372036854775807, calibrateSizeByDeletes=true, maxMergeDocs=2147483647, maxCFSSegmentSizeMB=8.796093022207999E12, noCFSRatio=0.1]
   [junit4]   2> 5414 INFO  (coreLoadExecutor-51-thread-1-processing-x:collection4) [    x:collection1] o.a.s.s.SolrIndexSearcher Opening [Searcher@10421f5[collection1] main]
   [junit4]   2> 5414 INFO  (coreLoadExecutor-51-thread-1-processing-x:collection4) [    x:collection1] o.a.s.r.ManagedResourceStorage File-based storage initialized to use dir: /x1/jenkins/jenkins-slave/workspace/Lucene-Solr-Tests-master/solr/build/solr-core/test/J0/temp/solr.core.TestLazyCores_342C810C6A05F56C-001/tempDir-003/collection1/conf
   [junit4]   2> 5432 INFO  (coreLoadExecutor-51-thread-1-processing-x:collection4) [    x:collection1] o.a.s.h.ReplicationHandler Commits will be reserved for  10000
   [junit4]   2> 5432 INFO  (coreLoadExecutor-51-thread-2-processing-x:collection4) [    x:collection2] o.a.s.s.SolrIndexSearcher Opening [Searcher@60cc3e9a[collection2] main]
   [junit4]   2> 5433 INFO  (coreLoadExecutor-51-thread-2-processing-x:collection4) [    x:collection2] o.a.s.r.ManagedResourceStorage File-based storage initialized to use dir: /x1/jenkins/jenkins-slave/workspace/Lucene-Solr-Tests-master/solr/build/solr-core/test/J0/temp/solr.core.TestLazyCores_342C810C6A05F56C-001/tempDir-003/collection2/conf
   [junit4]   2> 5433 INFO  (coreLoadExecutor-51-thread-2-processing-x:collection4) [    x:collection2] o.a.s.h.ReplicationHandler Commits will be reserved for  10000
   [junit4]   2> 5438 INFO  (searcherExecutor-52-thread-1-processing-x:collection1) [    x:collection1] o.a.s.c.SolrCore [collection1] Registered new searcher Searcher@10421f5[collection1] main{ExitableDirectoryReader(UninvertingDirectoryReader())}
   [junit4]   2> 5438 INFO  (searcherExecutor-53-thread-1-processing-x:collection2) [    x:collection2] o.a.s.c.SolrCore [collection2] Registered new searcher Searcher@60cc3e9a[collection2] main{ExitableDirectoryReader(UninvertingDirectoryReader())}
   [junit4]   2> 5443 INFO  (coreLoadExecutor-51-thread-3-processing-x:collection4) [    x:collection5] o.a.s.u.CommitTracker Hard AutoCommit: disabled
   [junit4]   2> 5443 INFO  (coreLoadExecutor-51-thread-3-processing-x:collection4) [    x:collection5] o.a.s.u.CommitTracker Soft AutoCommit: disabled
   [junit4]   2> 5444 INFO  (coreLoadExecutor-51-thread-3-processing-x:collection4) [    x:collection5] o.a.s.u.RandomMergePolicy RandomMergePolicy wrapping class org.apache.lucene.index.AlcoholicMergePolicy: [AlcoholicMergePolicy: minMergeSize=0, mergeFactor=10, maxMergeSize=330678612, maxMergeSizeForForcedMerge=9223372036854775807, calibrateSizeByDeletes=true, maxMergeDocs=2147483647, maxCFSSegmentSizeMB=8.796093022207999E12, noCFSRatio=0.1]
   [junit4]   2> 5445 INFO  (coreLoadExecutor-51-thread-3-processing-x:collection4) [    x:collection5] o.a.s.s.SolrIndexSearcher Opening [Searcher@444ddbc1[collection5] main]
   [junit4]   2> 5445 INFO  (coreLoadExecutor-51-thread-3-processing-x:collection4) [    x:collection5] o.a.s.r.ManagedResourceStorage File-based storage initialized to use dir: /x1/jenkins/jenkins-slave/workspace/Lucene-Solr-Tests-master/solr/build/solr-core/test/J0/temp/solr.core.TestLazyCores_342C810C6A05F56C-001/tempDir-003/collection5/conf
   [junit4]   2> 5446 INFO  (coreLoadExecutor-51-thread-3-processing-x:collection4) [    x:collection5] o.a.s.h.ReplicationHandler Commits will be reserved for  10000
   [junit4]   2> 5448 INFO  (searcherExecutor-54-thread-1-processing-x:collection5) [    x:collection5] o.a.s.c.SolrCore [collection5] Registered new searcher Searcher@444ddbc1[collection5] main{ExitableDirectoryReader(UninvertingDirectoryReader())}
   [junit4]   2> 5494 INFO  (TEST-TestLazyCores.testCreateSame-seed#[342C810C6A05F56C]) [    x:collection4] o.a.s.c.SolrConfig Using Lucene MatchVersion: 7.0.0
   [junit4]   2> 5537 INFO  (TEST-TestLazyCores.testCreateSame-seed#[342C810C6A05F56C]) [    x:collection4] o.a.s.s.IndexSchema [collection4] Schema name=tiny
   [junit4]   2> 5540 INFO  (TEST-TestLazyCores.testCreateSame-seed#[342C810C6A05F56C]) [    x:collection4] o.a.s.s.IndexSchema Loaded schema tiny/1.1 with uniqueid field id
   [junit4]   2> 5540 INFO  (TEST-TestLazyCores.testCreateSame-seed#[342C810C6A05F56C]) [    x:collection4] o.a.s.c.CoreContainer Creating SolrCore 'collection4' using configuration from instancedir /x1/jenkins/jenkins-slave/workspace/Lucene-Solr-Tests-master/solr/build/solr-core/test/J0/temp/solr.core.TestLazyCores_342C810C6A05F56C-001/tempDir-003/./collection4, trusted=true
   [junit4]   2> 5541 INFO  (TEST-TestLazyCores.testCreateSame-seed#[342C810C6A05F56C]) [    x:collection4] o.a.s.c.SolrCore solr.RecoveryStrategy.Builder
   [junit4]   2> 5541 INFO  (TEST-TestLazyCores.testCreateSame-seed#[342C810C6A05F56C]) [    x:collection4] o.a.s.c.SolrCore [[collection4] ] Opening new SolrCore at [/x1/jenkins/jenkins-slave/workspace/Lucene-Solr-Tests-master/solr/build/solr-core/test/J0/temp/solr.core.TestLazyCores_342C810C6A05F56C-001/tempDir-003/collection4], dataDir=[/x1/jenkins/jenkins-slave/workspace/Lucene-Solr-Tests-master/solr/build/solr-core/test/J0/temp/solr.core.TestLazyCores_342C810C6A05F56C-001/tempDir-003/./collection4/data/]
   [junit4]   2> 5578 INFO  (TEST-TestLazyCores.testCreateSame-seed#[342C810C6A05F56C]) [    x:collection4] o.a.s.u.RandomMergePolicy RandomMergePolicy wrapping class org.apache.lucene.index.TieredMergePolicy: [TieredMergePolicy: maxMergeAtOnce=16, maxMergeAtOnceExplicit=28, maxMergedSegmentMB=46.2880859375, floorSegmentMB=2.09375, forceMergeDeletesPctAllowed=12.094689855324546, segmentsPerTier=37.0, maxCFSSegmentSizeMB=8.796093022207999E12, noCFSRatio=1.0
   [junit4]   2> 5659 INFO  (TEST-TestLazyCores.testCreateSame-seed#[342C810C6A05F56C]) [    x:collection4] o.a.s.u.CommitTracker Hard AutoCommit: disabled
   [junit4]   2> 5659 INFO  (TEST-TestLazyCores.testCreateSame-seed#[342C810C6A05F56C]) [    x:collection4] o.a.s.u.CommitTracker Soft AutoCommit: disabled
   [junit4]   2> 5668 INFO  (TEST-TestLazyCores.testCreateSame-seed#[342C810C6A05F56C]) [    x:collection4] o.a.s.u.RandomMergePolicy RandomMergePolicy wrapping class org.apache.lucene.index.LogDocMergePolicy: [LogDocMergePolicy: minMergeSize=1000, mergeFactor=23, maxMergeSize=9223372036854775807, maxMergeSizeForForcedMerge=9223372036854775807, calibrateSizeByDeletes=true, maxMergeDocs=2147483647, maxCFSSegmentSizeMB=8.796093022207999E12, noCFSRatio=0.0]
   [junit4]   2> 5669 INFO  (TEST-TestLazyCores.testCreateSame-seed#[342C810C6A05F56C]) [    x:collection4] o.a.s.s.SolrIndexSearcher Opening [Searcher@51a92ac0[collection4] main]
   [junit4]   2> 5670 INFO  (TEST-TestLazyCores.testCreateSame-seed#[342C810C6A05F56C]) [    x:collection4] o.a.s.r.ManagedResourceStorage File-based storage initialized to use dir: /x1/jenkins/jenkins-slave/workspace/Lucene-Solr-Tests-master/solr/build/solr-core/test/J0/temp/solr.core.TestLazyCores_342C810C6A05F56C-001/tempDir-003/collection4/conf
   [junit4]   2> 5671 INFO  (TEST-TestLazyCores.testCreateSame-seed#[342C810C6A05F56C]) [    x:collection4] o.a.s.h.ReplicationHandler Commits will be reserved for  10000
   [junit4]   2> 5672 INFO  (searcherExecutor-65-thread-1-processing-x:collection4) [    x:collection4] o.a.s.c.SolrCore [collection4] Registered new searcher Searcher@51a92ac0[collection4] main{ExitableDirectoryReader(UninvertingDirectoryReader())}
   [junit4]   2> 5689 INFO  (TEST-TestLazyCores.testCreateSame-seed#[342C810C6A05F56C]) [    x:collection4] o.a.s.c.SolrConfig Using Lucene MatchVersion: 7.0.0
   [junit4]   2> 5700 INFO  (TEST-TestLazyCores.testCreateSame-seed#[342C810C6A05F56C]) [    x:collection4] o.a.s.s.IndexSchema [collection6] Schema name=tiny
   [junit4]   2> 5703 INFO  (TEST-TestLazyCores.testCreateSame-seed#[342C810C6A05F56C]) [    x:collection4] o.a.s.s.IndexSchema Loaded schema tiny/1.1 with uniqueid field id
   [junit4]   2> 5703 INFO  (TEST-TestLazyCores.testCreateSame-seed#[342C810C6A05F56C]) [    x:collection4] o.a.s.c.CoreContainer Creating SolrCore 'collection6' using configuration from instancedir /x1/jenkins/jenkins-slave/workspace/Lucene-Solr-Tests-master/solr/build/solr-core/test/J0/temp/solr.core.TestLazyCores_342C810C6A05F56C-001/tempDir-003/./collection6, trusted=true
   [junit4]   2> 5704 INFO  (TEST-TestLazyCores.testCreateSame-seed#[342C810C6A05F56C]) [    x:collection4] o.a.s.c.SolrCore solr.RecoveryStrategy.Builder
   [junit4]   2> 5704 INFO  (TEST-TestLazyCores.testCreateSame-seed#[342C810C6A05F56C]) [    x:collection4] o.a.s.c.SolrCore [[collection6] ] Opening new SolrCore at [/x1/jenkins/jenkins-slave/workspace/Lucene-Solr-Tests-master/solr/build/solr-core/test/J0/temp/solr.core.TestLazyCores_342C810C6A05F56C-001/tempDir-003/collection6], dataDir=[/x1/jenkins/jenkins-slave/workspace/Lucene-Solr-Tests-master/solr/build/solr-core/test/J0/temp/solr.core.TestLazyCores_342C810C6A05F56C-001/tempDir-003/./collection6/data/]
   [junit4]   2> 5706 INFO  (TEST-TestLazyCores.testCreateSame-seed#[342C810C6A05F56C]) [    x:collection4] o.a.s.u.RandomMergePolicy RandomMergePolicy wrapping class org.apache.lucene.index.TieredMergePolicy: [TieredMergePolicy: maxMergeAtOnce=41, maxMergeAtOnceExplicit=12, maxMergedSegmentMB=75.671875, floorSegmentMB=1.4111328125, forceMergeDeletesPctAllowed=20.84459916787219, segmentsPerTier=27.0, maxCFSSegmentSizeMB=8.796093022207999E12, noCFSRatio=1.0
   [junit4]   2> 5755 INFO  (TEST-TestLazyCores.testCreateSame-seed#[342C810C6A05F56C]) [    x:collection4] o.a.s.u.CommitTracker Hard AutoCommit: disabled
   [junit4]   2> 5755 INFO  (TEST-TestLazyCores.testCreateSame-seed#[342C810C6A05F56C]) [    x:collection4] o.a.s.u.CommitTracker Soft AutoCommit: disabled
   [junit4]   2> 5756 INFO  (TEST-TestLazyCores.testCreateSame-seed#[342C810C6A05F56C]) [    x:collection4] o.a.s.u.RandomMergePolicy RandomMergePolicy wrapping class org.apache.lucene.index.LogByteSizeMergePolicy: [LogByteSizeMergePolicy: minMergeSize=1677721, mergeFactor=18, maxMergeSize=2147483648, maxMergeSizeForForcedMerge=9223372036854775807, calibrateSizeByDeletes=true, maxMergeDocs=2147483647, maxCFSSegmentSizeMB=8.796093022207999E12, noCFSRatio=0.0]
   [junit4]   2> 5757 INFO  (TEST-TestLazyCores.testCreateSame-seed#[342C810C6A05F56C]) [    x:collection4] o.a.s.s.SolrIndexSearcher Opening [Searcher@65f4c814[collection6] main]
   [junit4]   2> 5758 INFO  (TEST-TestLazyCores.testCreateSame-seed#[342C810C6A05F56C]) [    x:collection4] o.a.s.r.ManagedResourceStorage File-based storage initialized to use dir: /x1/jenkins/jenkins-slave/workspace/Lucene-Solr-Tests-master/solr/build/solr-core/test/J0/temp/solr.core.TestLazyCores_342C810C6A05F56C-001/tempDir-003/collection6/conf
   [junit4]   2> 5758 INFO  (TEST-TestLazyCores.testCreateSame-seed#[342C810C6A05F56C]) [    x:collection4] o.a.s.h.ReplicationHandler Commits will be reserved for  10000
   [junit4]   2> 5764 INFO  (TEST-TestLazyCores.testCreateSame-seed#[342C810C6A05F56C]) [    x:collection4] o.a.s.h.a.CoreAdminOperation core create command schema=schema.xml&dataDir=t12&name=collection2&action=CREATE&config=solrconfig.xml&wt=xml
   [junit4]   2> 5766 WARN  (TEST-TestLazyCores.testCreateSame-seed#[342C810C6A05F56C]) [    x:collection4] o.a.s.c.CoreContainer Creating a core with existing name is not allowed
   [junit4]   2> 5766 INFO  (TEST-TestLazyCores.testCreateSame-seed#[342C810C6A05F56C]) [    x:collection4] o.a.s.h.a.CoreAdminOperation core create command schema=schema.xml&dataDir=t14&name=collection4&action=CREATE&config=solrconfig.xml&wt=xml
   [junit4]   2> 5766 WARN  (TEST-TestLazyCores.testCreateSame-seed#[342C810C6A05F56C]) [    x:collection4] o.a.s.c.CoreContainer Creating a core with existing name is not allowed
   [junit4]   2> 5766 INFO  (TEST-TestLazyCores.testCreateSame-seed#[342C810C6A05F56C]) [    x:collection4] o.a.s.h.a.CoreAdminOperation core create command schema=schema.xml&dataDir=t15&name=collection5&action=CREATE&config=solrconfig.xml&wt=xml
   [junit4]   2> 5767 WARN  (TEST-TestLazyCores.testCreateSame-seed#[342C810C6A05F56C]) [    x:collection4] o.a.s.c.CoreContainer Creating a core with existing name is not allowed
   [junit4]   2> 5767 INFO  (TEST-TestLazyCores.testCreateSame-seed#[342C810C6A05F56C]) [    x:collection4] o.a.s.h.a.CoreAdminOperation core create command schema=schema.xml&dataDir=t16&name=collection6&action=CREATE&config=solrconfig.xml&wt=xml
   [junit4]   2> 5767 WARN  (TEST-TestLazyCores.testCreateSame-seed#[342C810C6A05F56C]) [    x:collection4] o.a.s.c.CoreContainer Creating a core with existing name is not allowed
   [junit4]   2> 5767 INFO  (TEST-TestLazyCores.testCreateSame-seed#[342C810C6A05F56C]) [    x:collection4] o.a.s.c.CoreContainer Shutting down CoreContainer instance=1058591998
   [junit4]   2> 5767 INFO  (TEST-TestLazyCores.testCreateSame-seed#[342C810C6A05F56C]) [    x:collection4] o.a.s.m.SolrMetricManager Closing metric reporters for registry=solr.node, tag=null
   [junit4]   2> 5767 INFO  (TEST-TestLazyCores.testCreateSame-seed#[342C810C6A05F56C]) [    x:collection4] o.a.s.m.SolrMetricManager Closing metric reporters for registry=solr.jvm, tag=null
   [junit4]   2> 5767 INFO  (TEST-TestLazyCores.testCreateSame-seed#[342C810C6A05F56C]) [    x:collection4] o.a.s.m.SolrMetricManager Closing metric reporters for registry=solr.jetty, tag=null
   [junit4]   2> 5773 INFO  (searcherExecutor-69-thread-1-processing-x:collection4) [    x:collection4] o.a.s.c.SolrCore [collection6] Registered new searcher Searcher@65f4c814[collection6] main{ExitableDirectoryReader(UninvertingDirectoryReader())}
   [junit4]   2> 5787 INFO  (coreCloseExecutor-73-thread-1-processing-x:collection4) [    x:collection1] o.a.s.c.SolrCore [collection1]  CLOSING SolrCore org.apache.solr.core.SolrCore@d867d48
   [junit4]   2> 5787 INFO  (coreCloseExecutor-73-thread-2-processing-x:collection4) [    x:collection5] o.a.s.c.SolrCore [collection5]  CLOSING SolrCore org.apache.solr.core.SolrCore@35fc01d0
   [junit4]   2> 5788 INFO  (coreCloseExecutor-73-thread-3-processing-x:collection4) [    x:collection4] o.a.s.c.SolrCore [collection4]  CLOSING SolrCore org.apache.solr.core.SolrCore@38177256
   [junit4]   2> 5788 INFO  (coreCloseExecutor-73-thread-4-processing-x:collection4) [    x:collection2] o.a.s.c.SolrCore [collection2]  CLOSING SolrCore org.apache.solr.core.SolrCore@43a3a08d
   [junit4]   2> 5790 INFO  (coreCloseExecutor-73-thread-5-processing-x:collection4) [    x:collection6] o.a.s.c.SolrCore [collection6]  CLOSING SolrCore org.apache.solr.core.SolrCore@6484662
   [junit4]   2> 5802 INFO  (coreCloseExecutor-73-thread-3-processing-x:collection4) [    x:collection4] o.a.s.m.SolrMetricManager Closing metric reporters for registry=solr.core.collection4, tag=941060694
   [junit4]   2> 5811 INFO  (coreCloseExecutor-73-thread-2-processing-x:collection4) [    x:collection5] o.a.s.m.SolrMetricManager Closing metric reporters for registry=solr.core.collection5, tag=905707984
   [junit4]   2> 6014 INFO  (coreCloseExecutor-73-thread-1-processing-x:collection4) [    x:collection1] o.a.s.m.SolrMetricManager Closing metric reporters for registry=solr.core.collection1, tag=226917704
   [junit4]   2> 6031 INFO  (coreCloseExecutor-73-thread-4-processing-x:collection4) [    x:collection2] o.a.s.m.SolrMetricManager Closing metric reporters for registry=solr.core.collection2, tag=1134796941
   [junit4]   2> 6046 INFO  (coreCloseExecutor-73-thread-5-processing-x:collection4) [    x:collection6] o.a.s.m.SolrMetricManager Closing metric reporters for registry=solr.core.collection6, tag=105399906
   [junit4]   2> 6046 INFO  (TEST-TestLazyCores.testCreateSame-seed#[342C810C6A05F56C]) [    x:collection4] o.a.s.SolrTestCaseJ4 ###Ending testCreateSame
   [junit4]   2> 6049 INFO  (TEST-TestLazyCores.testCreateTransientFromAdmin-seed#[342C810C6A05F56C]) [    x:collection4] o.a.s.SolrTestCaseJ4 ###Starting testCreateTransientFromAdmin
   [junit4]   2> 6071 INFO  (TEST-TestLazyCores.testCreateTransientFromAdmin-seed#[342C810C6A05F56C]) [    x:collection4] o.a.s.c.SolrXmlConfig Loading container configuration from /x1/jenkins/jenkins-slave/workspace/Lucene-Solr-Tests-master/solr/build/solr-core/test/J0/temp/solr.core.TestLazyCores_342C810C6A05F56C-001/tempDir-004/solr.xml
   [junit4]   2> 6162 INFO  (TEST-TestLazyCores.testCreateTransientFromAdmin-seed#[342C810C6A05F56C]) [    x:collection4] o.a.s.c.TransientSolrCoreCacheDefault Allocating transient cache for 4 transient cores
   [junit4]   2> 6207 INFO  (coreLoadExecutor-80-thread-2-processing-x:collection4) [    x:collection2] o.a.s.c.SolrConfig Using Lucene MatchVersion: 7.0.0
   [junit4]   2> 6220 INFO  (coreLoadExecutor-80-thread-1-processing-x:collection4) [    x:collection1] o.a.s.c.SolrConfig Using Lucene MatchVersion: 7.0.0
   [junit4]   2> 6210 INFO  (coreLoadExecutor-80-thread-3-processing-x:collection4) [    x:collection5] o.a.s.c.SolrConfig Using Lucene MatchVersion: 7.0.0
   [junit4]   2> 6282 INFO  (coreLoadExecutor-80-thread-2-processing-x:collection4) [    x:collection2] o.a.s.s.IndexSchema [collection2] Schema name=tiny
   [junit4]   2> 6288 INFO  (coreLoadExecutor-80-thread-3-processing-x:collection4) [    x:collection5] o.a.s.s.IndexSchema [collection5] Schema name=tiny
   [junit4]   2> 6301 INFO  (coreLoadExecutor-80-thread-1-processing-x:collection4) [    x:collection1] o.a.s.s.IndexSchema [collection1] Schema name=tiny
   [junit4]   2> 6305 INFO  (coreLoadExecutor-80-thread-2-processing-x:collection4) [    x:collection2] o.a.s.s.IndexSchema Loaded schema tiny/1.1 with uniqueid field id
   [junit4]   2> 6305 INFO  (coreLoadExecutor-80-thread-2-processing-x:collection4) [    x:collection2] o.a.s.c.CoreContainer Creating SolrCore 'collection2' using configuration from instancedir /x1/jenkins/jenkins-slave/workspace/Lucene-Solr-Tests-master/solr/build/solr-core/test/J0/temp/solr.core.TestLazyCores_342C810C6A05F56C-001/tempDir-004/./collection2, trusted=true
   [junit4]   2> 6305 INFO  (coreLoadExecutor-80-thread-2-processing-x:collection4) [    x:collection2] o.a.s.c.SolrCore solr.RecoveryStrategy.Builder
   [junit4]   2> 6305 INFO  (coreLoadExecutor-80-thread-2-processing-x:collection4) [    x:collection2] o.a.s.c.SolrCore [[collection2] ] Opening new SolrCore at [/x1/jenkins/jenkins-slave/workspace/Lucene-Solr-Tests-master/solr/build/solr-core/test/J0/temp/solr.core.TestLazyCores_342C810C6A05F56C-001/tempDir-004/collection2], dataDir=[/x1/jenkins/jenkins-slave/workspace/Lucene-Solr-Tests-master/solr/build/solr-core/test/J0/temp/solr.core.TestLazyCores_342C810C6A05F56C-001/tempDir-004/./collection2/data/]
   [junit4]   2> 6307 INFO  (coreLoadExecutor-80-thread-2-processing-x:collection4) [    x:collection2] o.a.s.u.RandomMergePolicy RandomMergePolicy wrapping class org.apache.lucene.index.LogDocMergePolicy: [LogDocMergePolicy: minMergeSize=1000, mergeFactor=50, maxMergeSize=9223372036854775807, maxMergeSizeForForcedMerge=9223372036854775807, calibrateSizeByDeletes=true, maxMergeDocs=2147483647, maxCFSSegmentSizeMB=8.796093022207999E12, noCFSRatio=0.36459640234102664]
   [junit4]   2> 6310 INFO  (coreLoadExecutor-80-thread-3-processing-x:collection4) [    x:collection5] o.a.s.s.IndexSchema Loaded schema tiny/1.1 with uniqueid field id
   [junit4]   2> 6310 INFO  (coreLoadExecutor-80-thread-3-processing-x:collection4) [    x:collection5] o.a.s.c.CoreContainer Creating SolrCore 'collection5' using configuration from instancedir /x1/jenkins/jenkins-slave/workspace/Lucene-Solr-Tests-master/solr/build/solr-core/test/J0/temp/solr.core.TestLazyCores_342C810C6A05F56C-001/tempDir-004/./collection5, trusted=true
   [junit4]   2> 6311 INFO  (coreLoadExecutor-80-thread-3-processing-x:collection4) [    x:collection5] o.a.s.c.SolrCore solr.RecoveryStrategy.Builder
   [junit4]   2> 6311 INFO  (coreLoadExecutor-80-thread-3-processing-x:collection4) [    x:collection5] o.a.s.c.SolrCore [[collection5] ] Opening new SolrCore at [/x1/jenkins/jenkins-slave/workspace/Lucene-Solr-Tests-master/solr/build/solr-core/test/J0/temp/solr.core.TestLazyCores_342C810C6A05F56C-001/tempDir-004/collection5], dataDir=[/x1/jenkins/jenkins-slave/workspace/Lucene-Solr-Tests-master/solr/build/solr-core/test/J0/temp/solr.core.TestLazyCores_342C810C6A05F56C-001/tempDir-004/./collection5/data/]
   [junit4]   2> 6313 INFO  (coreLoadExecutor-80-thread-3-processing-x:collection4) [    x:collection5] o.a.s.u.RandomMergePolicy RandomMergePolicy wrapping class org.apache.lucene.index.LogDocMergePolicy: [LogDocMergePolicy: minMergeSize=1000, mergeFactor=50, maxMergeSize=9223372036854775807, maxMergeSizeForForcedMerge=9223372036854775807, calibrateSizeByDeletes=true, maxMergeDocs=2147483647, maxCFSSegmentSizeMB=8.796093022207999E12, noCFSRatio=0.36459640234102664]
   [junit4]   2> 6311 INFO  (coreLoadExecutor-80-thread-1-processing-x:collection4) [    x:collection1] o.a.s.s.IndexSchema Loaded schema tiny/1.1 with uniqueid field id
   [junit4]   2> 6314 INFO  (coreLoadExecutor-80-thread-1-processing-x:collection4) [    x:collection1] o.a.s.c.CoreContainer Creating SolrCore 'collection1' using configuration from instancedir /x1/jenkins/jenkins-slave/workspace/Lucene-Solr-Tests-master/solr/build/solr-core/test/J0/temp/solr.core.TestLazyCores_342C810C6A05F56C-001/tempDir-004/./collection1, trusted=true
   [junit4]   2> 6314 INFO  (coreLoadExecutor-80-thread-1-processing-x:collection4) [    x:collection1] o.a.s.c.SolrCore solr.RecoveryStrategy.Builder
   [junit4]   2> 6315 INFO  (coreLoadExecutor-80-thread-1-processing-x:collection4) [    x:collection1] o.a.s.c.SolrCore [[collection1] ] Opening new SolrCore at [/x1/jenkins/jenkins-slave/workspace/Lucene-Solr-Tests-master/solr/build/solr-core/test/J0/temp/solr.core.TestLazyCores_342C810C6A05F56C-001/tempDir-004/collection1], dataDir=[/x1/jenkins/jenkins-slave/workspace/Lucene-Solr-Tests-master/solr/build/solr-core/test/J0/temp/solr.core.TestLazyCores_342C810C6A05F56C-001/tempDir-004/./collection1/data/]
   [junit4]   2> 6320 INFO  (coreLoadExecutor-80-thread-1-processing-x:collection4) [    x:collection1] o.a.s.u.RandomMergePolicy RandomMergePolicy wrapping class org.apache.lucene.index.LogDocMergePolicy: [LogDocMergePolicy: minMergeSize=1000, mergeFactor=50, maxMergeSize=9223372036854775807, maxMergeSizeForForcedMerge=9223372036854775807, calibrateSizeByDeletes=true, maxMergeDocs=2147483647, maxCFSSegmentSizeMB=8.796093022207999E12, noCFSRatio=0.36459640234102664]
   [junit4]   2> 6438 INFO  (coreLoadExecutor-80-thread-2-processing-x:collection4) [    x:collection2] o.a.s.u.CommitTracker Hard AutoCommit: disabled
   [junit4]   2> 6438 INFO  (coreLoadExecutor-80-thread-2-processing-x:collection4) [    x:collection2] o.a.s.u.CommitTracker Soft AutoCommit: disabled
   [junit4]   2> 6441 INFO  (coreLoadExecutor-80-thread-2-processing-x:collection4) [    x:collection2] o.a.s.u.RandomMergePolicy RandomMergePolicy wrapping class org.apache.lucene.index.AlcoholicMergePolicy: [AlcoholicMergePolicy: minMergeSize=0, mergeFactor=10, maxMergeSize=330678612, maxMergeSizeForForcedMerge=9223372036854775807, calibrateSizeByDeletes=true, maxMergeDocs=2147483647, maxCFSSegmentSizeMB=8.796093022207999E12, noCFSRatio=0.1]
   [junit4]   2> 6449 INFO  (coreLoadExecutor-80-thread-3-processing-x:collection4) [    x:collection5] o.a.s.u.CommitTracker Hard AutoCommit: disabled
   [junit4]   2> 6449 INFO  (coreLoadExecutor-80-thread-3-processing-x:collection4) [    x:collection5] o.a.s.u.CommitTracker Soft AutoCommit: disabled
   [junit4]   2> 6450 INFO  (coreLoadExecutor-80-thread-3-processing-x:collection4) [    x:collection5] o.a.s.u.RandomMergePolicy RandomMergePolicy wrapping class org.apache.lucene.index.AlcoholicMergePolicy: [AlcoholicMergePolicy: minMergeSize=0, mergeFactor=10, maxMergeSize=330678612, maxMergeSizeForForcedMerge=9223372036854775807, calibrateSizeByDeletes=true, maxMergeDocs=2147483647, maxCFSSegmentSizeMB=8.796093022207999E12, noCFSRatio=0.1]
   [junit4]   2> 6454 INFO  (coreLoadExecutor-80-thread-3-processing-x:collection4) [    x:collection5] o.a.s.s.SolrIndexSearcher Opening [Searcher@6441b1d2[collection5] main]
   [junit4]   2> 6454 INFO  (coreLoadExecutor-80-thread-2-processing-x:collection4) [    x:collection2] o.a.s.s.SolrIndexSearcher Opening [Searcher@645d84a9[collection2] main]
   [junit4]   2> 6455 INFO  (coreLoadExecutor-80-thread-3-processing-x:collection4) [    x:collection5] o.a.s.r.ManagedResourceStorage File-based storage initialized to use dir: /x1/jenkins/jenkins-slave/workspace/Lucene-Solr-Tests-master/solr/build/solr-core/test/J0/temp/solr.core.TestLazyCores_342C810C6A05F56C-001/tempDir-004/collection5/conf
   [junit4]   2> 6455 INFO  (coreLoadExecutor-80-thread-3-processing-x:collection4) [    x:collection5] o.a.s.h.ReplicationHandler Commits will be reserved for  10000
   [junit4]   2> 6455 INFO  (coreLoadExecutor-80-thread-2-processing-x:collection4) [    x:collection2] o.a.s.r.ManagedResourceStorage File-based storage initialized to use dir: /x1/jenkins/jenkins-slave/workspace/Lucene-Solr-Tests-master/solr/build/solr-core/test/J0/temp/solr.core.TestLazyCores_342C810C6A05F56C-001/tempDir-004/collection2/conf
   [junit4]   2> 6462 INFO  (searcherExecutor-82-thread-1-processing-x:collection5) [    x:collection5] o.a.s.c.SolrCore [collection5] Registered new searcher Searcher@6441b1d2[collection5] main{ExitableDirectoryReader(UninvertingDirectoryReader())}
   [junit4]   2> 6462 INFO  (coreLoadExecutor-80-thread-2-processing-x:collection4) [    x:collection2] o.a.s.h.ReplicationHandler Commits will be reserved for  10000
   [junit4]   2> 6464 INFO  (searcherExecutor-81-thread-1-processing-x:collection2) [    x:collection2] o.a.s.c.SolrCore [collection2] Registered new searcher Searcher@645d84a9[collection2] main{ExitableDirectoryReader(UninvertingDirectoryReader())}
   [junit4]   2> 6478 INFO  (coreLoadExecutor-80-thread-1-processing-x:collection4) [    x:collection1] o.a.s.u.CommitTracker Hard AutoCommit: disabled
   [junit4]   2> 6478 INFO  (coreLoadExecutor-80-thread-1-processing-x:collection4) [    x:collection1] o.a.s.u.CommitTracker Soft AutoCommit: disabled
   [junit4]   2> 6479 INFO  (coreLoadExecutor-80-thread-1-processing-x:collection4) [    x:collection1] o.a.s.u.RandomMergePolicy RandomMergePolicy wrapping class org.apache.lucene.index.AlcoholicMergePolicy: [AlcoholicMergePolicy: minMergeSize=0, mergeFactor=10, maxMergeSize=330678612, maxMergeSizeForForcedMerge=9223372036854775807, calibrateSizeByDeletes=true, maxMergeDocs=2147483647, maxCFSSegmentSizeMB=8.796093022207999E12, noCFSRatio=0.1]
   [junit4]   2> 6481 INFO  (coreLoadExecutor-80-thread-1-processing-x:collection4) [    x:collection1] o.a.s.s.SolrIndexSearcher Opening [Searcher@55a56b6f[collection1] main]
   [junit4]   2> 6481 INFO  (coreLoadExecutor-80-thread-1-processing-x:collection4) [    x:collection1] o.a.s.r.ManagedResourceStorage File-based storage initialized to use dir: /x1/jenkins/jenkins-slave/workspace/Lucene-Solr-Tests-master/solr/build/solr-core/test/J0/temp/solr.core.TestLazyCores_342C810C6A05F56C-001/tempDir-004/collection1/conf
   [junit4]   2> 

[...truncated too long message...]

)
   [junit4]    > 	at org.apache.solr.core.CoreContainer.lambda$load$7(CoreContainer.java:611)
   [junit4]    > 	at com.codahale.metrics.InstrumentedExecutorService$InstrumentedCallable.call(InstrumentedExecutorService.java:197)
   [junit4]    > 	at java.util.concurrent.FutureTask.run(FutureTask.java:266)
   [junit4]    > 	at org.apache.solr.common.util.ExecutorUtil$MDCAwareThreadPoolExecutor.lambda$execute$0(ExecutorUtil.java:188)
   [junit4]    > 	at java.util.concurrent.ThreadPoolExecutor.runWorker(ThreadPoolExecutor.java:1142)
   [junit4]    > 	at java.util.concurrent.ThreadPoolExecutor$Worker.run(ThreadPoolExecutor.java:617)
   [junit4]    > 	at java.lang.Thread.run(Thread.java:748)
   [junit4]    > org.apache.solr.common.util.ObjectReleaseTracker$ObjectTrackerException: org.apache.solr.core.SolrCore
   [junit4]    > 	at org.apache.solr.common.util.ObjectReleaseTracker.track(ObjectReleaseTracker.java:42)
   [junit4]    > 	at org.apache.solr.core.SolrCore.<init>(SolrCore.java:1033)
   [junit4]    > 	at org.apache.solr.core.SolrCore.<init>(SolrCore.java:855)
   [junit4]    > 	at org.apache.solr.core.CoreContainer.create(CoreContainer.java:979)
   [junit4]    > 	at org.apache.solr.core.CoreContainer.lambda$load$7(CoreContainer.java:611)
   [junit4]    > 	at com.codahale.metrics.InstrumentedExecutorService$InstrumentedCallable.call(InstrumentedExecutorService.java:197)
   [junit4]    > 	at java.util.concurrent.FutureTask.run(FutureTask.java:266)
   [junit4]    > 	at org.apache.solr.common.util.ExecutorUtil$MDCAwareThreadPoolExecutor.lambda$execute$0(ExecutorUtil.java:188)
   [junit4]    > 	at java.util.concurrent.ThreadPoolExecutor.runWorker(ThreadPoolExecutor.java:1142)
   [junit4]    > 	at java.util.concurrent.ThreadPoolExecutor$Worker.run(ThreadPoolExecutor.java:617)
   [junit4]    > 	at java.lang.Thread.run(Thread.java:748)
   [junit4]    > org.apache.solr.common.util.ObjectReleaseTracker$ObjectTrackerException: org.apache.lucene.store.MMapDirectory
   [junit4]    > 	at org.apache.solr.common.util.ObjectReleaseTracker.track(ObjectReleaseTracker.java:42)
   [junit4]    > 	at org.apache.solr.core.CachingDirectoryFactory.get(CachingDirectoryFactory.java:347)
   [junit4]    > 	at org.apache.solr.core.SolrCore.initSnapshotMetaDataManager(SolrCore.java:490)
   [junit4]    > 	at org.apache.solr.core.SolrCore.<init>(SolrCore.java:942)
   [junit4]    > 	at org.apache.solr.core.SolrCore.<init>(SolrCore.java:855)
   [junit4]    > 	at org.apache.solr.core.CoreContainer.create(CoreContainer.java:979)
   [junit4]    > 	at org.apache.solr.core.CoreContainer.lambda$load$7(CoreContainer.java:611)
   [junit4]    > 	at com.codahale.metrics.InstrumentedExecutorService$InstrumentedCallable.call(InstrumentedExecutorService.java:197)
   [junit4]    > 	at java.util.concurrent.FutureTask.run(FutureTask.java:266)
   [junit4]    > 	at org.apache.solr.common.util.ExecutorUtil$MDCAwareThreadPoolExecutor.lambda$execute$0(ExecutorUtil.java:188)
   [junit4]    > 	at java.util.concurrent.ThreadPoolExecutor.runWorker(ThreadPoolExecutor.java:1142)
   [junit4]    > 	at java.util.concurrent.ThreadPoolExecutor$Worker.run(ThreadPoolExecutor.java:617)
   [junit4]    > 	at java.lang.Thread.run(Thread.java:748)
   [junit4]    > org.apache.solr.common.util.ObjectReleaseTracker$ObjectTrackerException: org.apache.solr.common.util.ExecutorUtil$MDCAwareThreadPoolExecutor
   [junit4]    > 	at org.apache.solr.common.util.ObjectReleaseTracker.track(ObjectReleaseTracker.java:42)
   [junit4]    > 	at org.apache.solr.core.SolrCore.<init>(SolrCore.java:884)
   [junit4]    > 	at org.apache.solr.core.SolrCore.<init>(SolrCore.java:855)
   [junit4]    > 	at org.apache.solr.core.CoreContainer.create(CoreContainer.java:979)
   [junit4]    > 	at org.apache.solr.core.CoreContainer.lambda$load$7(CoreContainer.java:611)
   [junit4]    > 	at com.codahale.metrics.InstrumentedExecutorService$InstrumentedCallable.call(InstrumentedExecutorService.java:197)
   [junit4]    > 	at java.util.concurrent.FutureTask.run(FutureTask.java:266)
   [junit4]    > 	at org.apache.solr.common.util.ExecutorUtil$MDCAwareThreadPoolExecutor.lambda$execute$0(ExecutorUtil.java:188)
   [junit4]    > 	at java.util.concurrent.ThreadPoolExecutor.runWorker(ThreadPoolExecutor.java:1142)
   [junit4]    > 	at java.util.concurrent.ThreadPoolExecutor$Worker.run(ThreadPoolExecutor.java:617)
   [junit4]    > 	at java.lang.Thread.run(Thread.java:748)
   [junit4]    > org.apache.solr.common.util.ObjectReleaseTracker$ObjectTrackerException: org.apache.solr.search.SolrIndexSearcher
   [junit4]    > 	at org.apache.solr.common.util.ObjectReleaseTracker.track(ObjectReleaseTracker.java:42)
   [junit4]    > 	at org.apache.solr.search.SolrIndexSearcher.<init>(SolrIndexSearcher.java:323)
   [junit4]    > 	at org.apache.solr.core.SolrCore.openNewSearcher(SolrCore.java:2047)
   [junit4]    > 	at org.apache.solr.core.SolrCore.getSearcher(SolrCore.java:2199)
   [junit4]    > 	at org.apache.solr.core.SolrCore.initSearcher(SolrCore.java:1085)
   [junit4]    > 	at org.apache.solr.core.SolrCore.<init>(SolrCore.java:974)
   [junit4]    > 	at org.apache.solr.core.SolrCore.<init>(SolrCore.java:855)
   [junit4]    > 	at org.apache.solr.core.CoreContainer.create(CoreContainer.java:979)
   [junit4]    > 	at org.apache.solr.core.CoreContainer.lambda$load$7(CoreContainer.java:611)
   [junit4]    > 	at com.codahale.metrics.InstrumentedExecutorService$InstrumentedCallable.call(InstrumentedExecutorService.java:197)
   [junit4]    > 	at java.util.concurrent.FutureTask.run(FutureTask.java:266)
   [junit4]    > 	at org.apache.solr.common.util.ExecutorUtil$MDCAwareThreadPoolExecutor.lambda$execute$0(ExecutorUtil.java:188)
   [junit4]    > 	at java.util.concurrent.ThreadPoolExecutor.runWorker(ThreadPoolExecutor.java:1142)
   [junit4]    > 	at java.util.concurrent.ThreadPoolExecutor$Worker.run(ThreadPoolExecutor.java:617)
   [junit4]    > 	at java.lang.Thread.run(Thread.java:748)
   [junit4]    > org.apache.solr.common.util.ObjectReleaseTracker$ObjectTrackerException: org.apache.lucene.store.MMapDirectory
   [junit4]    > 	at org.apache.solr.common.util.ObjectReleaseTracker.track(ObjectReleaseTracker.java:42)
   [junit4]    > 	at org.apache.solr.core.CachingDirectoryFactory.get(CachingDirectoryFactory.java:347)
   [junit4]    > 	at org.apache.solr.core.SolrCore.getNewIndexDir(SolrCore.java:361)
   [junit4]    > 	at org.apache.solr.core.SolrCore.initIndex(SolrCore.java:721)
   [junit4]    > 	at org.apache.solr.core.SolrCore.<init>(SolrCore.java:948)
   [junit4]    > 	at org.apache.solr.core.SolrCore.<init>(SolrCore.java:855)
   [junit4]    > 	at org.apache.solr.core.CoreContainer.create(CoreContainer.java:979)
   [junit4]    > 	at org.apache.solr.core.CoreContainer.lambda$load$7(CoreContainer.java:611)
   [junit4]    > 	at com.codahale.metrics.InstrumentedExecutorService$InstrumentedCallable.call(InstrumentedExecutorService.java:197)
   [junit4]    > 	at java.util.concurrent.FutureTask.run(FutureTask.java:266)
   [junit4]    > 	at org.apache.solr.common.util.ExecutorUtil$MDCAwareThreadPoolExecutor.lambda$execute$0(ExecutorUtil.java:188)
   [junit4]    > 	at java.util.concurrent.ThreadPoolExecutor.runWorker(ThreadPoolExecutor.java:1142)
   [junit4]    > 	at java.util.concurrent.ThreadPoolExecutor$Worker.run(ThreadPoolExecutor.java:617)
   [junit4]    > 	at java.lang.Thread.run(Thread.java:748)
   [junit4]    > 	at __randomizedtesting.SeedInfo.seed([342C810C6A05F56C]:0)
   [junit4]    > 	at org.apache.solr.SolrTestCaseJ4.teardownTestCases(SolrTestCaseJ4.java:295)
   [junit4]    > 	at java.lang.Thread.run(Thread.java:748)Throwable #2: com.carrotsearch.randomizedtesting.ThreadLeakError: 1 thread leaked from SUITE scope at org.apache.solr.core.TestLazyCores: 
   [junit4]    >    1) Thread[id=199, name=searcherExecutor-203-thread-1, state=WAITING, group=TGRP-TestLazyCores]
   [junit4]    >         at sun.misc.Unsafe.park(Native Method)
   [junit4]    >         at java.util.concurrent.locks.LockSupport.park(LockSupport.java:175)
   [junit4]    >         at java.util.concurrent.locks.AbstractQueuedSynchronizer$ConditionObject.await(AbstractQueuedSynchronizer.java:2039)
   [junit4]    >         at java.util.concurrent.LinkedBlockingQueue.take(LinkedBlockingQueue.java:442)
   [junit4]    >         at java.util.concurrent.ThreadPoolExecutor.getTask(ThreadPoolExecutor.java:1067)
   [junit4]    >         at java.util.concurrent.ThreadPoolExecutor.runWorker(ThreadPoolExecutor.java:1127)
   [junit4]    >         at java.util.concurrent.ThreadPoolExecutor$Worker.run(ThreadPoolExecutor.java:617)
   [junit4]    >         at java.lang.Thread.run(Thread.java:748)
   [junit4]    > 	at __randomizedtesting.SeedInfo.seed([342C810C6A05F56C]:0)Throwable #3: com.carrotsearch.randomizedtesting.ThreadLeakError: There are still zombie threads that couldn't be terminated:
   [junit4]    >    1) Thread[id=199, name=searcherExecutor-203-thread-1, state=WAITING, group=TGRP-TestLazyCores]
   [junit4]    >         at sun.misc.Unsafe.park(Native Method)
   [junit4]    >         at java.util.concurrent.locks.LockSupport.park(LockSupport.java:175)
   [junit4]    >         at java.util.concurrent.locks.AbstractQueuedSynchronizer$ConditionObject.await(AbstractQueuedSynchronizer.java:2039)
   [junit4]    >         at java.util.concurrent.LinkedBlockingQueue.take(LinkedBlockingQueue.java:442)
   [junit4]    >         at java.util.concurrent.ThreadPoolExecutor.getTask(ThreadPoolExecutor.java:1067)
   [junit4]    >         at java.util.concurrent.ThreadPoolExecutor.runWorker(ThreadPoolExecutor.java:1127)
   [junit4]    >         at java.util.concurrent.ThreadPoolExecutor$Worker.run(ThreadPoolExecutor.java:617)
   [junit4]    >         at java.lang.Thread.run(Thread.java:748)
   [junit4]    > 	at __randomizedtesting.SeedInfo.seed([342C810C6A05F56C]:0)
   [junit4] Completed [16/725 (1!)] on J0 in 61.21s, 9 tests, 1 failure, 2 errors, 1 skipped <<< FAILURES!

[...truncated 45495 lines...]

Mime
View raw message