lucene-dev mailing list archives

Site index · List index
Message view « Date » · « Thread »
Top « Date » · « Thread »
From Policeman Jenkins Server <jenk...@thetaphi.de>
Subject [JENKINS-EA] Lucene-Solr-6.x-Linux (32bit/jdk-9-ea+175) - Build # 3837 - Still Unstable!
Date Sat, 24 Jun 2017 15:50:26 GMT
Build: https://jenkins.thetaphi.de/job/Lucene-Solr-6.x-Linux/3837/
Java: 32bit/jdk-9-ea+175 -server -XX:+UseParallelGC --illegal-access=deny

5 tests failed.
FAILED:  junit.framework.TestSuite.org.apache.solr.cloud.TestSolrCloudWithSecureImpersonation

Error Message:


Stack Trace:
java.lang.ExceptionInInitializerError
	at __randomizedtesting.SeedInfo.seed([93881E9BBC94EA70]:0)
	at org.apache.hadoop.util.StringUtils.<clinit>(StringUtils.java:80)
	at org.apache.hadoop.security.Groups.parseStaticMapping(Groups.java:130)
	at org.apache.hadoop.security.Groups.<init>(Groups.java:94)
	at org.apache.hadoop.security.Groups.<init>(Groups.java:74)
	at org.apache.solr.cloud.TestSolrCloudWithSecureImpersonation.getUsersFirstGroup(TestSolrCloudWithSecureImpersonation.java:63)
	at org.apache.solr.cloud.TestSolrCloudWithSecureImpersonation.getImpersonatorSettings(TestSolrCloudWithSecureImpersonation.java:89)
	at org.apache.solr.cloud.TestSolrCloudWithSecureImpersonation.startup(TestSolrCloudWithSecureImpersonation.java:104)
	at java.base/jdk.internal.reflect.NativeMethodAccessorImpl.invoke0(Native Method)
	at java.base/jdk.internal.reflect.NativeMethodAccessorImpl.invoke(NativeMethodAccessorImpl.java:62)
	at java.base/jdk.internal.reflect.DelegatingMethodAccessorImpl.invoke(DelegatingMethodAccessorImpl.java:43)
	at java.base/java.lang.reflect.Method.invoke(Method.java:564)
	at com.carrotsearch.randomizedtesting.RandomizedRunner.invoke(RandomizedRunner.java:1713)
	at com.carrotsearch.randomizedtesting.RandomizedRunner$6.evaluate(RandomizedRunner.java:847)
	at com.carrotsearch.randomizedtesting.RandomizedRunner$7.evaluate(RandomizedRunner.java:863)
	at com.carrotsearch.randomizedtesting.rules.StatementAdapter.evaluate(StatementAdapter.java:36)
	at com.carrotsearch.randomizedtesting.rules.SystemPropertiesRestoreRule$1.evaluate(SystemPropertiesRestoreRule.java:57)
	at org.apache.lucene.util.AbstractBeforeAfterRule$1.evaluate(AbstractBeforeAfterRule.java:45)
	at com.carrotsearch.randomizedtesting.rules.StatementAdapter.evaluate(StatementAdapter.java:36)
	at org.apache.lucene.util.TestRuleStoreClassName$1.evaluate(TestRuleStoreClassName.java:41)
	at com.carrotsearch.randomizedtesting.rules.NoShadowingOrOverridesOnMethodsRule$1.evaluate(NoShadowingOrOverridesOnMethodsRule.java:40)
	at com.carrotsearch.randomizedtesting.rules.NoShadowingOrOverridesOnMethodsRule$1.evaluate(NoShadowingOrOverridesOnMethodsRule.java:40)
	at com.carrotsearch.randomizedtesting.rules.StatementAdapter.evaluate(StatementAdapter.java:36)
	at com.carrotsearch.randomizedtesting.rules.StatementAdapter.evaluate(StatementAdapter.java:36)
	at org.apache.lucene.util.TestRuleAssertionsRequired$1.evaluate(TestRuleAssertionsRequired.java:53)
	at org.apache.lucene.util.TestRuleMarkFailure$1.evaluate(TestRuleMarkFailure.java:47)
	at org.apache.lucene.util.TestRuleIgnoreAfterMaxFailures$1.evaluate(TestRuleIgnoreAfterMaxFailures.java:64)
	at org.apache.lucene.util.TestRuleIgnoreTestSuites$1.evaluate(TestRuleIgnoreTestSuites.java:54)
	at com.carrotsearch.randomizedtesting.rules.StatementAdapter.evaluate(StatementAdapter.java:36)
	at com.carrotsearch.randomizedtesting.ThreadLeakControl$StatementRunner.run(ThreadLeakControl.java:368)
	at java.base/java.lang.Thread.run(Thread.java:844)
Caused by: java.lang.StringIndexOutOfBoundsException: begin 0, end 3, length 1
	at java.base/java.lang.String.checkBoundsBeginEnd(String.java:3116)
	at java.base/java.lang.String.substring(String.java:1885)
	at org.apache.hadoop.util.Shell.<clinit>(Shell.java:51)
	... 30 more


FAILED:  junit.framework.TestSuite.org.apache.solr.cloud.TestSolrCloudWithSecureImpersonation

Error Message:
Could not initialize class org.apache.hadoop.util.StringUtils

Stack Trace:
java.lang.NoClassDefFoundError: Could not initialize class org.apache.hadoop.util.StringUtils
	at __randomizedtesting.SeedInfo.seed([93881E9BBC94EA70]:0)
	at org.apache.hadoop.security.Groups.parseStaticMapping(Groups.java:130)
	at org.apache.hadoop.security.Groups.<init>(Groups.java:94)
	at org.apache.hadoop.security.Groups.<init>(Groups.java:74)
	at org.apache.solr.cloud.TestSolrCloudWithSecureImpersonation.getUsersFirstGroup(TestSolrCloudWithSecureImpersonation.java:63)
	at org.apache.solr.cloud.TestSolrCloudWithSecureImpersonation.getImpersonatorSettings(TestSolrCloudWithSecureImpersonation.java:89)
	at org.apache.solr.cloud.TestSolrCloudWithSecureImpersonation.shutdown(TestSolrCloudWithSecureImpersonation.java:164)
	at java.base/jdk.internal.reflect.NativeMethodAccessorImpl.invoke0(Native Method)
	at java.base/jdk.internal.reflect.NativeMethodAccessorImpl.invoke(NativeMethodAccessorImpl.java:62)
	at java.base/jdk.internal.reflect.DelegatingMethodAccessorImpl.invoke(DelegatingMethodAccessorImpl.java:43)
	at java.base/java.lang.reflect.Method.invoke(Method.java:564)
	at com.carrotsearch.randomizedtesting.RandomizedRunner.invoke(RandomizedRunner.java:1713)
	at com.carrotsearch.randomizedtesting.RandomizedRunner$7.evaluate(RandomizedRunner.java:870)
	at com.carrotsearch.randomizedtesting.rules.StatementAdapter.evaluate(StatementAdapter.java:36)
	at com.carrotsearch.randomizedtesting.rules.SystemPropertiesRestoreRule$1.evaluate(SystemPropertiesRestoreRule.java:57)
	at org.apache.lucene.util.AbstractBeforeAfterRule$1.evaluate(AbstractBeforeAfterRule.java:45)
	at com.carrotsearch.randomizedtesting.rules.StatementAdapter.evaluate(StatementAdapter.java:36)
	at org.apache.lucene.util.TestRuleStoreClassName$1.evaluate(TestRuleStoreClassName.java:41)
	at com.carrotsearch.randomizedtesting.rules.NoShadowingOrOverridesOnMethodsRule$1.evaluate(NoShadowingOrOverridesOnMethodsRule.java:40)
	at com.carrotsearch.randomizedtesting.rules.NoShadowingOrOverridesOnMethodsRule$1.evaluate(NoShadowingOrOverridesOnMethodsRule.java:40)
	at com.carrotsearch.randomizedtesting.rules.StatementAdapter.evaluate(StatementAdapter.java:36)
	at com.carrotsearch.randomizedtesting.rules.StatementAdapter.evaluate(StatementAdapter.java:36)
	at org.apache.lucene.util.TestRuleAssertionsRequired$1.evaluate(TestRuleAssertionsRequired.java:53)
	at org.apache.lucene.util.TestRuleMarkFailure$1.evaluate(TestRuleMarkFailure.java:47)
	at org.apache.lucene.util.TestRuleIgnoreAfterMaxFailures$1.evaluate(TestRuleIgnoreAfterMaxFailures.java:64)
	at org.apache.lucene.util.TestRuleIgnoreTestSuites$1.evaluate(TestRuleIgnoreTestSuites.java:54)
	at com.carrotsearch.randomizedtesting.rules.StatementAdapter.evaluate(StatementAdapter.java:36)
	at com.carrotsearch.randomizedtesting.ThreadLeakControl$StatementRunner.run(ThreadLeakControl.java:368)
	at java.base/java.lang.Thread.run(Thread.java:844)


FAILED:  junit.framework.TestSuite.org.apache.solr.security.hadoop.TestImpersonationWithHadoopAuth

Error Message:
Could not initialize class org.apache.hadoop.util.StringUtils

Stack Trace:
java.lang.NoClassDefFoundError: Could not initialize class org.apache.hadoop.util.StringUtils
	at __randomizedtesting.SeedInfo.seed([93881E9BBC94EA70]:0)
	at org.apache.hadoop.security.Groups.parseStaticMapping(Groups.java:130)
	at org.apache.hadoop.security.Groups.<init>(Groups.java:94)
	at org.apache.hadoop.security.Groups.<init>(Groups.java:74)
	at org.apache.solr.security.hadoop.ImpersonationUtil.getUsersFirstGroup(ImpersonationUtil.java:39)
	at org.apache.solr.security.hadoop.TestImpersonationWithHadoopAuth.setupClass(TestImpersonationWithHadoopAuth.java:72)
	at java.base/jdk.internal.reflect.NativeMethodAccessorImpl.invoke0(Native Method)
	at java.base/jdk.internal.reflect.NativeMethodAccessorImpl.invoke(NativeMethodAccessorImpl.java:62)
	at java.base/jdk.internal.reflect.DelegatingMethodAccessorImpl.invoke(DelegatingMethodAccessorImpl.java:43)
	at java.base/java.lang.reflect.Method.invoke(Method.java:564)
	at com.carrotsearch.randomizedtesting.RandomizedRunner.invoke(RandomizedRunner.java:1713)
	at com.carrotsearch.randomizedtesting.RandomizedRunner$6.evaluate(RandomizedRunner.java:847)
	at com.carrotsearch.randomizedtesting.RandomizedRunner$7.evaluate(RandomizedRunner.java:863)
	at com.carrotsearch.randomizedtesting.rules.StatementAdapter.evaluate(StatementAdapter.java:36)
	at com.carrotsearch.randomizedtesting.rules.SystemPropertiesRestoreRule$1.evaluate(SystemPropertiesRestoreRule.java:57)
	at org.apache.lucene.util.AbstractBeforeAfterRule$1.evaluate(AbstractBeforeAfterRule.java:45)
	at com.carrotsearch.randomizedtesting.rules.StatementAdapter.evaluate(StatementAdapter.java:36)
	at org.apache.lucene.util.TestRuleStoreClassName$1.evaluate(TestRuleStoreClassName.java:41)
	at com.carrotsearch.randomizedtesting.rules.NoShadowingOrOverridesOnMethodsRule$1.evaluate(NoShadowingOrOverridesOnMethodsRule.java:40)
	at com.carrotsearch.randomizedtesting.rules.NoShadowingOrOverridesOnMethodsRule$1.evaluate(NoShadowingOrOverridesOnMethodsRule.java:40)
	at com.carrotsearch.randomizedtesting.rules.StatementAdapter.evaluate(StatementAdapter.java:36)
	at com.carrotsearch.randomizedtesting.rules.StatementAdapter.evaluate(StatementAdapter.java:36)
	at org.apache.lucene.util.TestRuleAssertionsRequired$1.evaluate(TestRuleAssertionsRequired.java:53)
	at org.apache.lucene.util.TestRuleMarkFailure$1.evaluate(TestRuleMarkFailure.java:47)
	at org.apache.lucene.util.TestRuleIgnoreAfterMaxFailures$1.evaluate(TestRuleIgnoreAfterMaxFailures.java:64)
	at org.apache.lucene.util.TestRuleIgnoreTestSuites$1.evaluate(TestRuleIgnoreTestSuites.java:54)
	at com.carrotsearch.randomizedtesting.rules.StatementAdapter.evaluate(StatementAdapter.java:36)
	at com.carrotsearch.randomizedtesting.ThreadLeakControl$StatementRunner.run(ThreadLeakControl.java:368)
	at java.base/java.lang.Thread.run(Thread.java:844)


FAILED:  junit.framework.TestSuite.org.apache.solr.cloud.TestSolrCloudWithDelegationTokens

Error Message:
SOLR-10951: Hadoop does not work on Java 9

Stack Trace:
com.carrotsearch.randomizedtesting.InternalAssumptionViolatedException: SOLR-10951: Hadoop
does not work on Java 9
	at __randomizedtesting.SeedInfo.seed([93881E9BBC94EA70]:0)
	at com.carrotsearch.randomizedtesting.RandomizedTest.assumeTrue(RandomizedTest.java:675)
	at com.carrotsearch.randomizedtesting.RandomizedTest.assumeFalse(RandomizedTest.java:683)
	at org.apache.lucene.util.LuceneTestCase.assumeFalse(LuceneTestCase.java:867)
	at org.apache.solr.cloud.TestSolrCloudWithDelegationTokens.startup(TestSolrCloudWithDelegationTokens.java:67)
	at java.base/jdk.internal.reflect.NativeMethodAccessorImpl.invoke0(Native Method)
	at java.base/jdk.internal.reflect.NativeMethodAccessorImpl.invoke(NativeMethodAccessorImpl.java:62)
	at java.base/jdk.internal.reflect.DelegatingMethodAccessorImpl.invoke(DelegatingMethodAccessorImpl.java:43)
	at java.base/java.lang.reflect.Method.invoke(Method.java:564)
	at com.carrotsearch.randomizedtesting.RandomizedRunner.invoke(RandomizedRunner.java:1713)
	at com.carrotsearch.randomizedtesting.RandomizedRunner$6.evaluate(RandomizedRunner.java:847)
	at com.carrotsearch.randomizedtesting.RandomizedRunner$7.evaluate(RandomizedRunner.java:863)
	at com.carrotsearch.randomizedtesting.rules.StatementAdapter.evaluate(StatementAdapter.java:36)
	at com.carrotsearch.randomizedtesting.rules.SystemPropertiesRestoreRule$1.evaluate(SystemPropertiesRestoreRule.java:57)
	at org.apache.lucene.util.AbstractBeforeAfterRule$1.evaluate(AbstractBeforeAfterRule.java:45)
	at com.carrotsearch.randomizedtesting.rules.StatementAdapter.evaluate(StatementAdapter.java:36)
	at org.apache.lucene.util.TestRuleStoreClassName$1.evaluate(TestRuleStoreClassName.java:41)
	at com.carrotsearch.randomizedtesting.rules.NoShadowingOrOverridesOnMethodsRule$1.evaluate(NoShadowingOrOverridesOnMethodsRule.java:40)
	at com.carrotsearch.randomizedtesting.rules.NoShadowingOrOverridesOnMethodsRule$1.evaluate(NoShadowingOrOverridesOnMethodsRule.java:40)
	at com.carrotsearch.randomizedtesting.rules.StatementAdapter.evaluate(StatementAdapter.java:36)
	at com.carrotsearch.randomizedtesting.rules.StatementAdapter.evaluate(StatementAdapter.java:36)
	at org.apache.lucene.util.TestRuleAssertionsRequired$1.evaluate(TestRuleAssertionsRequired.java:53)
	at org.apache.lucene.util.TestRuleMarkFailure$1.evaluate(TestRuleMarkFailure.java:47)
	at org.apache.lucene.util.TestRuleIgnoreAfterMaxFailures$1.evaluate(TestRuleIgnoreAfterMaxFailures.java:64)
	at org.apache.lucene.util.TestRuleIgnoreTestSuites$1.evaluate(TestRuleIgnoreTestSuites.java:54)
	at com.carrotsearch.randomizedtesting.rules.StatementAdapter.evaluate(StatementAdapter.java:36)
	at com.carrotsearch.randomizedtesting.ThreadLeakControl$StatementRunner.run(ThreadLeakControl.java:368)
	at java.base/java.lang.Thread.run(Thread.java:844)


FAILED:  junit.framework.TestSuite.org.apache.solr.cloud.TestSolrCloudWithDelegationTokens

Error Message:


Stack Trace:
java.lang.NullPointerException
	at __randomizedtesting.SeedInfo.seed([93881E9BBC94EA70]:0)
	at org.apache.solr.cloud.TestSolrCloudWithDelegationTokens.shutdown(TestSolrCloudWithDelegationTokens.java:90)
	at java.base/jdk.internal.reflect.NativeMethodAccessorImpl.invoke0(Native Method)
	at java.base/jdk.internal.reflect.NativeMethodAccessorImpl.invoke(NativeMethodAccessorImpl.java:62)
	at java.base/jdk.internal.reflect.DelegatingMethodAccessorImpl.invoke(DelegatingMethodAccessorImpl.java:43)
	at java.base/java.lang.reflect.Method.invoke(Method.java:564)
	at com.carrotsearch.randomizedtesting.RandomizedRunner.invoke(RandomizedRunner.java:1713)
	at com.carrotsearch.randomizedtesting.RandomizedRunner$7.evaluate(RandomizedRunner.java:870)
	at com.carrotsearch.randomizedtesting.rules.StatementAdapter.evaluate(StatementAdapter.java:36)
	at com.carrotsearch.randomizedtesting.rules.SystemPropertiesRestoreRule$1.evaluate(SystemPropertiesRestoreRule.java:57)
	at org.apache.lucene.util.AbstractBeforeAfterRule$1.evaluate(AbstractBeforeAfterRule.java:45)
	at com.carrotsearch.randomizedtesting.rules.StatementAdapter.evaluate(StatementAdapter.java:36)
	at org.apache.lucene.util.TestRuleStoreClassName$1.evaluate(TestRuleStoreClassName.java:41)
	at com.carrotsearch.randomizedtesting.rules.NoShadowingOrOverridesOnMethodsRule$1.evaluate(NoShadowingOrOverridesOnMethodsRule.java:40)
	at com.carrotsearch.randomizedtesting.rules.NoShadowingOrOverridesOnMethodsRule$1.evaluate(NoShadowingOrOverridesOnMethodsRule.java:40)
	at com.carrotsearch.randomizedtesting.rules.StatementAdapter.evaluate(StatementAdapter.java:36)
	at com.carrotsearch.randomizedtesting.rules.StatementAdapter.evaluate(StatementAdapter.java:36)
	at org.apache.lucene.util.TestRuleAssertionsRequired$1.evaluate(TestRuleAssertionsRequired.java:53)
	at org.apache.lucene.util.TestRuleMarkFailure$1.evaluate(TestRuleMarkFailure.java:47)
	at org.apache.lucene.util.TestRuleIgnoreAfterMaxFailures$1.evaluate(TestRuleIgnoreAfterMaxFailures.java:64)
	at org.apache.lucene.util.TestRuleIgnoreTestSuites$1.evaluate(TestRuleIgnoreTestSuites.java:54)
	at com.carrotsearch.randomizedtesting.rules.StatementAdapter.evaluate(StatementAdapter.java:36)
	at com.carrotsearch.randomizedtesting.ThreadLeakControl$StatementRunner.run(ThreadLeakControl.java:368)
	at java.base/java.lang.Thread.run(Thread.java:844)




Build Log:
[...truncated 11112 lines...]
   [junit4] Suite: org.apache.solr.cloud.TestSolrCloudWithDelegationTokens
   [junit4]   2> Creating dataDir: /home/jenkins/workspace/Lucene-Solr-6.x-Linux/solr/build/solr-core/test/J1/temp/solr.cloud.TestSolrCloudWithDelegationTokens_93881E9BBC94EA70-001/init-core-data-001
   [junit4]   2> 42586 WARN  (SUITE-TestSolrCloudWithDelegationTokens-seed#[93881E9BBC94EA70]-worker)
[    ] o.a.s.SolrTestCaseJ4 startTrackingSearchers: numOpens=9 numCloses=9
   [junit4]   2> 42586 INFO  (SUITE-TestSolrCloudWithDelegationTokens-seed#[93881E9BBC94EA70]-worker)
[    ] o.a.s.SolrTestCaseJ4 Using PointFields
   [junit4]   2> 42587 INFO  (SUITE-TestSolrCloudWithDelegationTokens-seed#[93881E9BBC94EA70]-worker)
[    ] o.a.s.SolrTestCaseJ4 Randomized ssl (false) and clientAuth (false) via: @org.apache.solr.SolrTestCaseJ4$SuppressSSL(bugUrl="None")
   [junit4]   2> 42588 INFO  (SUITE-TestSolrCloudWithDelegationTokens-seed#[93881E9BBC94EA70]-worker)
[    ] o.a.s.SolrTestCaseJ4 ###deleteCore
   [junit4]   2> 42588 INFO  (SUITE-TestSolrCloudWithDelegationTokens-seed#[93881E9BBC94EA70]-worker)
[    ] o.a.s.SolrTestCaseJ4 ------------------------------------------------------- Done waiting
for tracked resources to be released
   [junit4]   2> NOTE: test params are: codec=Asserting(Lucene62): {}, docValues:{}, maxPointsInLeafNode=1997,
maxMBSortInHeap=6.638875782240585, sim=RandomSimilarity(queryNorm=false,coord=no): {}, locale=sah-RU,
timezone=Pacific/Marquesas
   [junit4]   2> NOTE: Linux 4.10.0-21-generic i386/Oracle Corporation 9 (32-bit)/cpus=8,threads=1,free=49480176,total=230424576
   [junit4]   2> NOTE: All tests run in this JVM: [MBeansHandlerTest, TestSchemalessBufferedUpdates,
HdfsDirectoryFactoryTest, ShardRoutingTest, TestHashQParserPlugin, TestSolrCloudWithDelegationTokens]
   [junit4]   2> NOTE: reproduce with: ant test  -Dtestcase=TestSolrCloudWithDelegationTokens
-Dtests.seed=93881E9BBC94EA70 -Dtests.multiplier=3 -Dtests.slow=true -Dtests.locale=sah-RU
-Dtests.timezone=Pacific/Marquesas -Dtests.asserts=true -Dtests.file.encoding=US-ASCII
   [junit4] ERROR   0.00s J1 | TestSolrCloudWithDelegationTokens (suite) <<<
   [junit4]    > Assumption #1: SOLR-10951: Hadoop does not work on Java 9Throwable #2:
java.lang.NullPointerException
   [junit4]    > 	at __randomizedtesting.SeedInfo.seed([93881E9BBC94EA70]:0)
   [junit4]    > 	at org.apache.solr.cloud.TestSolrCloudWithDelegationTokens.shutdown(TestSolrCloudWithDelegationTokens.java:90)
   [junit4]    > 	at java.base/jdk.internal.reflect.NativeMethodAccessorImpl.invoke0(Native
Method)
   [junit4]    > 	at java.base/jdk.internal.reflect.NativeMethodAccessorImpl.invoke(NativeMethodAccessorImpl.java:62)
   [junit4]    > 	at java.base/jdk.internal.reflect.DelegatingMethodAccessorImpl.invoke(DelegatingMethodAccessorImpl.java:43)
   [junit4]    > 	at java.base/java.lang.reflect.Method.invoke(Method.java:564)
   [junit4]    > 	at java.base/java.lang.Thread.run(Thread.java:844)
   [junit4] Completed [37/713 (1!)] on J1 in 0.02s, 0 tests, 1 error <<< FAILURES!

[...truncated 574 lines...]
   [junit4] Suite: org.apache.solr.cloud.TestSolrCloudWithSecureImpersonation
   [junit4]   2> Creating dataDir: /home/jenkins/workspace/Lucene-Solr-6.x-Linux/solr/build/solr-core/test/J0/temp/solr.cloud.TestSolrCloudWithSecureImpersonation_93881E9BBC94EA70-001/init-core-data-001
   [junit4]   2> 490390 WARN  (SUITE-TestSolrCloudWithSecureImpersonation-seed#[93881E9BBC94EA70]-worker)
[    ] o.a.s.SolrTestCaseJ4 startTrackingSearchers: numOpens=22 numCloses=22
   [junit4]   2> 490390 INFO  (SUITE-TestSolrCloudWithSecureImpersonation-seed#[93881E9BBC94EA70]-worker)
[    ] o.a.s.SolrTestCaseJ4 Using TrieFields
   [junit4]   2> 490391 INFO  (SUITE-TestSolrCloudWithSecureImpersonation-seed#[93881E9BBC94EA70]-worker)
[    ] o.a.s.SolrTestCaseJ4 Randomized ssl (false) and clientAuth (false) via: @org.apache.solr.util.RandomizeSSL(reason="",
ssl=0.0/0.0, value=0.0/0.0, clientAuth=0.0/0.0)
   [junit4]   2> 490426 WARN  (SUITE-TestSolrCloudWithSecureImpersonation-seed#[93881E9BBC94EA70]-worker)
[    ] o.a.h.u.NativeCodeLoader Unable to load native-hadoop library for your platform...
using builtin-java classes where applicable
   [junit4]   2> 490434 INFO  (SUITE-TestSolrCloudWithSecureImpersonation-seed#[93881E9BBC94EA70]-worker)
[    ] o.a.s.SolrTestCaseJ4 ###deleteCore
   [junit4]   2> 490434 INFO  (SUITE-TestSolrCloudWithSecureImpersonation-seed#[93881E9BBC94EA70]-worker)
[    ] o.a.s.SolrTestCaseJ4 ------------------------------------------------------- Done waiting
for tracked resources to be released
   [junit4]   2> NOTE: test params are: codec=Asserting(Lucene62): {}, docValues:{}, maxPointsInLeafNode=1040,
maxMBSortInHeap=5.053885987896978, sim=RandomSimilarity(queryNorm=false,coord=no): {}, locale=haw,
timezone=America/Yellowknife
   [junit4]   2> NOTE: Linux 4.10.0-21-generic i386/Oracle Corporation 9 (32-bit)/cpus=8,threads=1,free=124786664,total=397672448
   [junit4]   2> NOTE: All tests run in this JVM: [TestManagedSynonymGraphFilterFactory,
DistanceUnitsTest, TestSubQueryTransformerCrossCore, TestReloadDeadlock, PluginInfoTest, TestLazyCores,
TestFaceting, TestSerializedLuceneMatchVersion, TestCSVLoader, JavabinLoaderTest, TestNoOpRegenerator,
TestJsonFacetRefinement, QueryParsingTest, TestManagedResourceStorage, TestReplicationHandlerBackup,
TestHdfsUpdateLog, HdfsUnloadDistributedZkTest, TestCrossCoreJoin, BigEndianAscendingWordDeserializerTest,
TestExtendedDismaxParser, PreAnalyzedFieldManagedSchemaCloudTest, TestClassNameShortening,
SyncSliceTest, BlockDirectoryTest, TermVectorComponentTest, UpdateLogTest, TestGeoJSONResponseWriter,
SSLMigrationTest, DistributedSpellCheckComponentTest, CircularListTest, TestSolrConfigHandler,
FacetPivotSmallTest, TestSolrJ, TestBackupRepositoryFactory, SolrRequestParserTest, TestStressRecovery,
TestInfoStreamLogging, SolrMetricManagerTest, OverseerCollectionConfigSetProcessorTest, TestTrieFacet,
TestScoreJoinQPNoScore, SuggesterWFSTTest, HdfsSyncSliceTest, PKIAuthenticationIntegrationTest,
TestRandomDVFaceting, BasicZkTest, TestMacros, TestDFISimilarityFactory, TestRuleBasedAuthorizationPlugin,
LeaderElectionIntegrationTest, TestSolrConfigHandlerConcurrent, TestCollapseQParserPlugin,
TestAuthenticationFramework, TestPayloadScoreQParserPlugin, TestUseDocValuesAsStored2, TestPostingsSolrHighlighter,
TestReplicaProperties, TestSlowCompositeReaderWrapper, TestConfigSetProperties, TestCharFilters,
TestCustomStream, TestLeaderElectionWithEmptyReplica, TestReversedWildcardFilterFactory, ClusterStateTest,
TestSolr4Spatial, TestDistribIDF, TestCloudRecovery, TestSolrCloudSnapshots, TestSolrCloudWithSecureImpersonation]
   [junit4]   2> NOTE: reproduce with: ant test  -Dtestcase=TestSolrCloudWithSecureImpersonation
-Dtests.seed=93881E9BBC94EA70 -Dtests.multiplier=3 -Dtests.slow=true -Dtests.locale=haw -Dtests.timezone=America/Yellowknife
-Dtests.asserts=true -Dtests.file.encoding=US-ASCII
   [junit4] ERROR   0.00s J0 | TestSolrCloudWithSecureImpersonation (suite) <<<
   [junit4]    > Throwable #1: java.lang.ExceptionInInitializerError
   [junit4]    > 	at __randomizedtesting.SeedInfo.seed([93881E9BBC94EA70]:0)
   [junit4]    > 	at org.apache.hadoop.util.StringUtils.<clinit>(StringUtils.java:80)
   [junit4]    > 	at org.apache.hadoop.security.Groups.parseStaticMapping(Groups.java:130)
   [junit4]    > 	at org.apache.hadoop.security.Groups.<init>(Groups.java:94)
   [junit4]    > 	at org.apache.hadoop.security.Groups.<init>(Groups.java:74)
   [junit4]    > 	at org.apache.solr.cloud.TestSolrCloudWithSecureImpersonation.getUsersFirstGroup(TestSolrCloudWithSecureImpersonation.java:63)
   [junit4]    > 	at org.apache.solr.cloud.TestSolrCloudWithSecureImpersonation.getImpersonatorSettings(TestSolrCloudWithSecureImpersonation.java:89)
   [junit4]    > 	at org.apache.solr.cloud.TestSolrCloudWithSecureImpersonation.startup(TestSolrCloudWithSecureImpersonation.java:104)
   [junit4]    > 	at java.base/jdk.internal.reflect.NativeMethodAccessorImpl.invoke0(Native
Method)
   [junit4]    > 	at java.base/jdk.internal.reflect.NativeMethodAccessorImpl.invoke(NativeMethodAccessorImpl.java:62)
   [junit4]    > 	at java.base/jdk.internal.reflect.DelegatingMethodAccessorImpl.invoke(DelegatingMethodAccessorImpl.java:43)
   [junit4]    > 	at java.base/java.lang.reflect.Method.invoke(Method.java:564)
   [junit4]    > 	at java.base/java.lang.Thread.run(Thread.java:844)
   [junit4]    > Caused by: java.lang.StringIndexOutOfBoundsException: begin 0, end 3,
length 1
   [junit4]    > 	at java.base/java.lang.String.checkBoundsBeginEnd(String.java:3116)
   [junit4]    > 	at java.base/java.lang.String.substring(String.java:1885)
   [junit4]    > 	at org.apache.hadoop.util.Shell.<clinit>(Shell.java:51)
   [junit4]    > 	... 30 moreThrowable #2: java.lang.NoClassDefFoundError: Could not initialize
class org.apache.hadoop.util.StringUtils
   [junit4]    > 	at __randomizedtesting.SeedInfo.seed([93881E9BBC94EA70]:0)
   [junit4]    > 	at org.apache.hadoop.security.Groups.parseStaticMapping(Groups.java:130)
   [junit4]    > 	at org.apache.hadoop.security.Groups.<init>(Groups.java:94)
   [junit4]    > 	at org.apache.hadoop.security.Groups.<init>(Groups.java:74)
   [junit4]    > 	at org.apache.solr.cloud.TestSolrCloudWithSecureImpersonation.getUsersFirstGroup(TestSolrCloudWithSecureImpersonation.java:63)
   [junit4]    > 	at org.apache.solr.cloud.TestSolrCloudWithSecureImpersonation.getImpersonatorSettings(TestSolrCloudWithSecureImpersonation.java:89)
   [junit4]    > 	at org.apache.solr.cloud.TestSolrCloudWithSecureImpersonation.shutdown(TestSolrCloudWithSecureImpersonation.java:164)
   [junit4]    > 	at java.base/jdk.internal.reflect.NativeMethodAccessorImpl.invoke0(Native
Method)
   [junit4]    > 	at java.base/jdk.internal.reflect.NativeMethodAccessorImpl.invoke(NativeMethodAccessorImpl.java:62)
   [junit4]    > 	at java.base/jdk.internal.reflect.DelegatingMethodAccessorImpl.invoke(DelegatingMethodAccessorImpl.java:43)
   [junit4]    > 	at java.base/java.lang.reflect.Method.invoke(Method.java:564)
   [junit4]    > 	at java.base/java.lang.Thread.run(Thread.java:844)
   [junit4] Completed [219/713 (2!)] on J0 in 0.06s, 0 tests, 2 errors <<< FAILURES!

[...truncated 435 lines...]
   [junit4] Suite: org.apache.solr.security.hadoop.TestImpersonationWithHadoopAuth
   [junit4]   2> Creating dataDir: /home/jenkins/workspace/Lucene-Solr-6.x-Linux/solr/build/solr-core/test/J0/temp/solr.security.hadoop.TestImpersonationWithHadoopAuth_93881E9BBC94EA70-001/init-core-data-001
   [junit4]   2> 832487 WARN  (SUITE-TestImpersonationWithHadoopAuth-seed#[93881E9BBC94EA70]-worker)
[    ] o.a.s.SolrTestCaseJ4 startTrackingSearchers: numOpens=3 numCloses=3
   [junit4]   2> 832487 INFO  (SUITE-TestImpersonationWithHadoopAuth-seed#[93881E9BBC94EA70]-worker)
[    ] o.a.s.SolrTestCaseJ4 Using PointFields
   [junit4]   2> 832488 INFO  (SUITE-TestImpersonationWithHadoopAuth-seed#[93881E9BBC94EA70]-worker)
[    ] o.a.s.SolrTestCaseJ4 Randomized ssl (false) and clientAuth (true) via: @org.apache.solr.util.RandomizeSSL(reason="",
ssl=0.0/0.0, value=0.0/0.0, clientAuth=0.0/0.0)
   [junit4]   2> 832494 INFO  (SUITE-TestImpersonationWithHadoopAuth-seed#[93881E9BBC94EA70]-worker)
[    ] o.a.s.SolrTestCaseJ4 ###deleteCore
   [junit4]   2> 832494 INFO  (SUITE-TestImpersonationWithHadoopAuth-seed#[93881E9BBC94EA70]-worker)
[    ] o.a.s.SolrTestCaseJ4 ------------------------------------------------------- Done waiting
for tracked resources to be released
   [junit4]   2> NOTE: test params are: codec=Asserting(Lucene62): {}, docValues:{}, maxPointsInLeafNode=625,
maxMBSortInHeap=6.89113592984777, sim=RandomSimilarity(queryNorm=true,coord=crazy): {}, locale=cs,
timezone=Singapore
   [junit4]   2> NOTE: Linux 4.10.0-21-generic i386/Oracle Corporation 9 (32-bit)/cpus=8,threads=1,free=145727144,total=365953024
   [junit4]   2> NOTE: All tests run in this JVM: [TestManagedSynonymGraphFilterFactory,
DistanceUnitsTest, TestSubQueryTransformerCrossCore, TestReloadDeadlock, PluginInfoTest, TestLazyCores,
TestFaceting, TestSerializedLuceneMatchVersion, TestCSVLoader, JavabinLoaderTest, TestNoOpRegenerator,
TestJsonFacetRefinement, QueryParsingTest, TestManagedResourceStorage, TestReplicationHandlerBackup,
TestHdfsUpdateLog, HdfsUnloadDistributedZkTest, TestCrossCoreJoin, BigEndianAscendingWordDeserializerTest,
TestExtendedDismaxParser, PreAnalyzedFieldManagedSchemaCloudTest, TestClassNameShortening,
SyncSliceTest, BlockDirectoryTest, TermVectorComponentTest, UpdateLogTest, TestGeoJSONResponseWriter,
SSLMigrationTest, DistributedSpellCheckComponentTest, CircularListTest, TestSolrConfigHandler,
FacetPivotSmallTest, TestSolrJ, TestBackupRepositoryFactory, SolrRequestParserTest, TestStressRecovery,
TestInfoStreamLogging, SolrMetricManagerTest, OverseerCollectionConfigSetProcessorTest, TestTrieFacet,
TestScoreJoinQPNoScore, SuggesterWFSTTest, HdfsSyncSliceTest, PKIAuthenticationIntegrationTest,
TestRandomDVFaceting, BasicZkTest, TestMacros, TestDFISimilarityFactory, TestRuleBasedAuthorizationPlugin,
LeaderElectionIntegrationTest, TestSolrConfigHandlerConcurrent, TestCollapseQParserPlugin,
TestAuthenticationFramework, TestPayloadScoreQParserPlugin, TestUseDocValuesAsStored2, TestPostingsSolrHighlighter,
TestReplicaProperties, TestSlowCompositeReaderWrapper, TestConfigSetProperties, TestCharFilters,
TestCustomStream, TestLeaderElectionWithEmptyReplica, TestReversedWildcardFilterFactory, ClusterStateTest,
TestSolr4Spatial, TestDistribIDF, TestCloudRecovery, TestSolrCloudSnapshots, TestSolrCloudWithSecureImpersonation,
TestSizeLimitedDistributedMap, IndexSchemaRuntimeFieldTest, SolrSlf4jReporterTest, SampleTest,
TestSolrQueryResponse, PeerSyncTest, BinaryUpdateRequestHandlerTest, ClassificationUpdateProcessorIntegrationTest,
TestBinaryResponseWriter, TestBlobHandler, DocValuesMissingTest, TestRangeQuery, SpellCheckCollatorTest,
TestSchemaResource, TestSchemaManager, TestAnalyzeInfixSuggestions, TestPHPSerializedResponseWriter,
FieldMutatingUpdateProcessorTest, TestSmileRequest, CursorPagingTest, ResponseHeaderTest,
GraphQueryTest, LeaderElectionContextKeyTest, TestCloudManagedSchema, TestPerFieldSimilarityWithDefaultOverride,
TestPerFieldSimilarity, TestCSVResponseWriter, TestCryptoKeys, SliceStateTest, TestBadConfig,
TestRandomFlRTGCloud, HighlighterConfigTest, BlobRepositoryCloudTest, MissingSegmentRecoveryTest,
TestUniqueKeyFieldResource, CollectionReloadTest, ScriptEngineTest, TestUninvertingReader,
TestImpersonationWithHadoopAuth]
   [junit4]   2> NOTE: reproduce with: ant test  -Dtestcase=TestImpersonationWithHadoopAuth
-Dtests.seed=93881E9BBC94EA70 -Dtests.multiplier=3 -Dtests.slow=true -Dtests.locale=cs -Dtests.timezone=Singapore
-Dtests.asserts=true -Dtests.file.encoding=US-ASCII
   [junit4] ERROR   0.00s J0 | TestImpersonationWithHadoopAuth (suite) <<<
   [junit4]    > Throwable #1: java.lang.NoClassDefFoundError: Could not initialize class
org.apache.hadoop.util.StringUtils
   [junit4]    > 	at __randomizedtesting.SeedInfo.seed([93881E9BBC94EA70]:0)
   [junit4]    > 	at org.apache.hadoop.security.Groups.parseStaticMapping(Groups.java:130)
   [junit4]    > 	at org.apache.hadoop.security.Groups.<init>(Groups.java:94)
   [junit4]    > 	at org.apache.hadoop.security.Groups.<init>(Groups.java:74)
   [junit4]    > 	at org.apache.solr.security.hadoop.ImpersonationUtil.getUsersFirstGroup(ImpersonationUtil.java:39)
   [junit4]    > 	at org.apache.solr.security.hadoop.TestImpersonationWithHadoopAuth.setupClass(TestImpersonationWithHadoopAuth.java:72)
   [junit4]    > 	at java.base/jdk.internal.reflect.NativeMethodAccessorImpl.invoke0(Native
Method)
   [junit4]    > 	at java.base/jdk.internal.reflect.NativeMethodAccessorImpl.invoke(NativeMethodAccessorImpl.java:62)
   [junit4]    > 	at java.base/jdk.internal.reflect.DelegatingMethodAccessorImpl.invoke(DelegatingMethodAccessorImpl.java:43)
   [junit4]    > 	at java.base/java.lang.reflect.Method.invoke(Method.java:564)
   [junit4]    > 	at java.base/java.lang.Thread.run(Thread.java:844)
   [junit4] Completed [352/713 (3!)] on J0 in 0.02s, 0 tests, 1 error <<< FAILURES!

[...truncated 37652 lines...]

Mime
View raw message