lucene-dev mailing list archives

Site index · List index
Message view « Date » · « Thread »
Top « Date » · « Thread »
From Apache Jenkins Server <jenk...@builds.apache.org>
Subject [JENKINS] Lucene-Solr-Tests-master - Build # 1800 - Unstable
Date Thu, 04 May 2017 01:57:40 GMT
Build: https://builds.apache.org/job/Lucene-Solr-Tests-master/1800/

1 tests failed.
FAILED:  org.apache.solr.update.HardAutoCommitTest.testCommitWithin

Error Message:
Exception during query

Stack Trace:
java.lang.RuntimeException: Exception during query
	at __randomizedtesting.SeedInfo.seed([FC3BA23C1E6D990:B511D55B42C83785]:0)
	at org.apache.solr.SolrTestCaseJ4.assertQ(SolrTestCaseJ4.java:896)
	at org.apache.solr.update.HardAutoCommitTest.testCommitWithin(HardAutoCommitTest.java:100)
	at sun.reflect.NativeMethodAccessorImpl.invoke0(Native Method)
	at sun.reflect.NativeMethodAccessorImpl.invoke(NativeMethodAccessorImpl.java:62)
	at sun.reflect.DelegatingMethodAccessorImpl.invoke(DelegatingMethodAccessorImpl.java:43)
	at java.lang.reflect.Method.invoke(Method.java:498)
	at com.carrotsearch.randomizedtesting.RandomizedRunner.invoke(RandomizedRunner.java:1713)
	at com.carrotsearch.randomizedtesting.RandomizedRunner$8.evaluate(RandomizedRunner.java:907)
	at com.carrotsearch.randomizedtesting.RandomizedRunner$9.evaluate(RandomizedRunner.java:943)
	at com.carrotsearch.randomizedtesting.RandomizedRunner$10.evaluate(RandomizedRunner.java:957)
	at com.carrotsearch.randomizedtesting.rules.SystemPropertiesRestoreRule$1.evaluate(SystemPropertiesRestoreRule.java:57)
	at org.apache.lucene.util.TestRuleSetupTeardownChained$1.evaluate(TestRuleSetupTeardownChained.java:49)
	at org.apache.lucene.util.AbstractBeforeAfterRule$1.evaluate(AbstractBeforeAfterRule.java:45)
	at org.apache.lucene.util.TestRuleThreadAndTestName$1.evaluate(TestRuleThreadAndTestName.java:48)
	at org.apache.lucene.util.TestRuleIgnoreAfterMaxFailures$1.evaluate(TestRuleIgnoreAfterMaxFailures.java:64)
	at org.apache.lucene.util.TestRuleMarkFailure$1.evaluate(TestRuleMarkFailure.java:47)
	at com.carrotsearch.randomizedtesting.rules.StatementAdapter.evaluate(StatementAdapter.java:36)
	at com.carrotsearch.randomizedtesting.ThreadLeakControl$StatementRunner.run(ThreadLeakControl.java:368)
	at com.carrotsearch.randomizedtesting.ThreadLeakControl.forkTimeoutingTask(ThreadLeakControl.java:817)
	at com.carrotsearch.randomizedtesting.ThreadLeakControl$3.evaluate(ThreadLeakControl.java:468)
	at com.carrotsearch.randomizedtesting.RandomizedRunner.runSingleTest(RandomizedRunner.java:916)
	at com.carrotsearch.randomizedtesting.RandomizedRunner$5.evaluate(RandomizedRunner.java:802)
	at com.carrotsearch.randomizedtesting.RandomizedRunner$6.evaluate(RandomizedRunner.java:852)
	at com.carrotsearch.randomizedtesting.RandomizedRunner$7.evaluate(RandomizedRunner.java:863)
	at com.carrotsearch.randomizedtesting.rules.StatementAdapter.evaluate(StatementAdapter.java:36)
	at com.carrotsearch.randomizedtesting.rules.SystemPropertiesRestoreRule$1.evaluate(SystemPropertiesRestoreRule.java:57)
	at org.apache.lucene.util.AbstractBeforeAfterRule$1.evaluate(AbstractBeforeAfterRule.java:45)
	at com.carrotsearch.randomizedtesting.rules.StatementAdapter.evaluate(StatementAdapter.java:36)
	at org.apache.lucene.util.TestRuleStoreClassName$1.evaluate(TestRuleStoreClassName.java:41)
	at com.carrotsearch.randomizedtesting.rules.NoShadowingOrOverridesOnMethodsRule$1.evaluate(NoShadowingOrOverridesOnMethodsRule.java:40)
	at com.carrotsearch.randomizedtesting.rules.NoShadowingOrOverridesOnMethodsRule$1.evaluate(NoShadowingOrOverridesOnMethodsRule.java:40)
	at com.carrotsearch.randomizedtesting.rules.StatementAdapter.evaluate(StatementAdapter.java:36)
	at com.carrotsearch.randomizedtesting.rules.StatementAdapter.evaluate(StatementAdapter.java:36)
	at com.carrotsearch.randomizedtesting.rules.StatementAdapter.evaluate(StatementAdapter.java:36)
	at org.apache.lucene.util.TestRuleAssertionsRequired$1.evaluate(TestRuleAssertionsRequired.java:53)
	at org.apache.lucene.util.TestRuleMarkFailure$1.evaluate(TestRuleMarkFailure.java:47)
	at org.apache.lucene.util.TestRuleIgnoreAfterMaxFailures$1.evaluate(TestRuleIgnoreAfterMaxFailures.java:64)
	at org.apache.lucene.util.TestRuleIgnoreTestSuites$1.evaluate(TestRuleIgnoreTestSuites.java:54)
	at com.carrotsearch.randomizedtesting.rules.StatementAdapter.evaluate(StatementAdapter.java:36)
	at com.carrotsearch.randomizedtesting.ThreadLeakControl$StatementRunner.run(ThreadLeakControl.java:368)
	at java.lang.Thread.run(Thread.java:745)
Caused by: java.lang.RuntimeException: REQUEST FAILED: xpath=//result[@numFound=1]
	xml response was: <?xml version="1.0" encoding="UTF-8"?>
<response>
<lst name="responseHeader"><int name="status">0</int><int name="QTime">0</int></lst><result
name="response" numFound="0" start="0"></result>
</response>

	request was:q=id:529&qt=standard&start=0&rows=20&version=2.2
	at org.apache.solr.SolrTestCaseJ4.assertQ(SolrTestCaseJ4.java:889)
	... 40 more




Build Log:
[...truncated 12242 lines...]
   [junit4] Suite: org.apache.solr.update.HardAutoCommitTest
   [junit4]   2> Creating dataDir: /x1/jenkins/jenkins-slave/workspace/Lucene-Solr-Tests-master/solr/build/solr-core/test/J2/temp/solr.update.HardAutoCommitTest_FC3BA23C1E6D990-001/init-core-data-001
   [junit4]   2> 1096381 WARN  (SUITE-HardAutoCommitTest-seed#[FC3BA23C1E6D990]-worker)
[    ] o.a.s.SolrTestCaseJ4 startTrackingSearchers: numOpens=429 numCloses=429
   [junit4]   2> 1096381 INFO  (SUITE-HardAutoCommitTest-seed#[FC3BA23C1E6D990]-worker)
[    ] o.a.s.SolrTestCaseJ4 Using PointFields
   [junit4]   2> 1096391 INFO  (SUITE-HardAutoCommitTest-seed#[FC3BA23C1E6D990]-worker)
[    ] o.a.s.SolrTestCaseJ4 Randomized ssl (true) and clientAuth (false) via: @org.apache.solr.util.RandomizeSSL(reason=,
ssl=NaN, value=NaN, clientAuth=NaN)
   [junit4]   2> 1096392 INFO  (SUITE-HardAutoCommitTest-seed#[FC3BA23C1E6D990]-worker)
[    ] o.a.s.SolrTestCaseJ4 ####initCore
   [junit4]   2> 1096395 INFO  (SUITE-HardAutoCommitTest-seed#[FC3BA23C1E6D990]-worker)
[    ] o.a.s.c.SolrResourceLoader [null] Added 2 libs to classloader, from paths: [/x1/jenkins/jenkins-slave/workspace/Lucene-Solr-Tests-master/solr/core/src/test-files/solr/collection1/lib,
/x1/jenkins/jenkins-slave/workspace/Lucene-Solr-Tests-master/solr/core/src/test-files/solr/collection1/lib/classes]
   [junit4]   2> 1096452 WARN  (SUITE-HardAutoCommitTest-seed#[FC3BA23C1E6D990]-worker)
[    ] o.a.s.c.Config Beginning with Solr 5.5, <mergePolicy> is deprecated, use <mergePolicyFactory>
instead.
   [junit4]   2> 1096453 INFO  (SUITE-HardAutoCommitTest-seed#[FC3BA23C1E6D990]-worker)
[    ] o.a.s.c.SolrConfig Using Lucene MatchVersion: 7.0.0
   [junit4]   2> 1096490 INFO  (SUITE-HardAutoCommitTest-seed#[FC3BA23C1E6D990]-worker)
[    ] o.a.s.s.IndexSchema [null] Schema name=test
   [junit4]   2> 1096657 WARN  (SUITE-HardAutoCommitTest-seed#[FC3BA23C1E6D990]-worker)
[    ] o.a.s.s.IndexSchema [null] default search field in schema is text. WARNING: Deprecated,
please use 'df' on request instead.
   [junit4]   2> 1096659 INFO  (SUITE-HardAutoCommitTest-seed#[FC3BA23C1E6D990]-worker)
[    ] o.a.s.s.IndexSchema Loaded schema test/1.0 with uniqueid field id
   [junit4]   2> 1096749 INFO  (SUITE-HardAutoCommitTest-seed#[FC3BA23C1E6D990]-worker)
[    ] o.a.s.m.r.SolrJmxReporter JMX monitoring for 'solr.node' (registry 'solr.node') enabled
at server: com.sun.jmx.mbeanserver.JmxMBeanServer@552f141d
   [junit4]   2> 1096754 INFO  (SUITE-HardAutoCommitTest-seed#[FC3BA23C1E6D990]-worker)
[    ] o.a.s.m.r.SolrJmxReporter JMX monitoring for 'solr.jvm' (registry 'solr.jvm') enabled
at server: com.sun.jmx.mbeanserver.JmxMBeanServer@552f141d
   [junit4]   2> 1096754 INFO  (SUITE-HardAutoCommitTest-seed#[FC3BA23C1E6D990]-worker)
[    ] o.a.s.m.r.SolrJmxReporter JMX monitoring for 'solr.jetty' (registry 'solr.jetty') enabled
at server: com.sun.jmx.mbeanserver.JmxMBeanServer@552f141d
   [junit4]   2> 1096775 INFO  (coreLoadExecutor-4147-thread-1) [    x:collection1] o.a.s.c.SolrResourceLoader
[null] Added 2 libs to classloader, from paths: [/x1/jenkins/jenkins-slave/workspace/Lucene-Solr-Tests-master/solr/core/src/test-files/solr/collection1/lib,
/x1/jenkins/jenkins-slave/workspace/Lucene-Solr-Tests-master/solr/core/src/test-files/solr/collection1/lib/classes]
   [junit4]   2> 1096939 WARN  (coreLoadExecutor-4147-thread-1) [    x:collection1] o.a.s.c.Config
Beginning with Solr 5.5, <mergePolicy> is deprecated, use <mergePolicyFactory>
instead.
   [junit4]   2> 1096941 INFO  (coreLoadExecutor-4147-thread-1) [    x:collection1] o.a.s.c.SolrConfig
Using Lucene MatchVersion: 7.0.0
   [junit4]   2> 1096966 INFO  (coreLoadExecutor-4147-thread-1) [    x:collection1] o.a.s.s.IndexSchema
[collection1] Schema name=test
   [junit4]   2> 1097148 WARN  (coreLoadExecutor-4147-thread-1) [    x:collection1] o.a.s.s.IndexSchema
[collection1] default search field in schema is text. WARNING: Deprecated, please use 'df'
on request instead.
   [junit4]   2> 1097150 INFO  (coreLoadExecutor-4147-thread-1) [    x:collection1] o.a.s.s.IndexSchema
Loaded schema test/1.0 with uniqueid field id
   [junit4]   2> 1097172 INFO  (coreLoadExecutor-4147-thread-1) [    x:collection1] o.a.s.c.CoreContainer
Creating SolrCore 'collection1' using configuration from instancedir /x1/jenkins/jenkins-slave/workspace/Lucene-Solr-Tests-master/solr/core/src/test-files/solr/collection1,
trusted=true
   [junit4]   2> 1097173 INFO  (coreLoadExecutor-4147-thread-1) [    x:collection1] o.a.s.m.r.SolrJmxReporter
JMX monitoring for 'solr.core.collection1' (registry 'solr.core.collection1') enabled at server:
com.sun.jmx.mbeanserver.JmxMBeanServer@552f141d
   [junit4]   2> 1097173 INFO  (coreLoadExecutor-4147-thread-1) [    x:collection1] o.a.s.c.SolrCore
solr.RecoveryStrategy.Builder
   [junit4]   2> 1097173 INFO  (coreLoadExecutor-4147-thread-1) [    x:collection1] o.a.s.c.SolrCore
[[collection1] ] Opening new SolrCore at [/x1/jenkins/jenkins-slave/workspace/Lucene-Solr-Tests-master/solr/core/src/test-files/solr/collection1],
dataDir=[/x1/jenkins/jenkins-slave/workspace/Lucene-Solr-Tests-master/solr/build/solr-core/test/J2/temp/solr.update.HardAutoCommitTest_FC3BA23C1E6D990-001/init-core-data-001/]
   [junit4]   2> 1097175 INFO  (coreLoadExecutor-4147-thread-1) [    x:collection1] o.a.s.u.RandomMergePolicy
RandomMergePolicy wrapping class org.apache.lucene.index.LogDocMergePolicy: [LogDocMergePolicy:
minMergeSize=1000, mergeFactor=25, maxMergeSize=9223372036854775807, maxMergeSizeForForcedMerge=9223372036854775807,
calibrateSizeByDeletes=false, maxMergeDocs=2147483647, maxCFSSegmentSizeMB=8.796093022207999E12,
noCFSRatio=0.2109097261831222]
   [junit4]   2> 1097307 INFO  (coreLoadExecutor-4147-thread-1) [    x:collection1] o.a.s.u.UpdateHandler
Using UpdateLog implementation: org.apache.solr.update.UpdateLog
   [junit4]   2> 1097307 INFO  (coreLoadExecutor-4147-thread-1) [    x:collection1] o.a.s.u.UpdateLog
Initializing UpdateLog: dataDir= defaultSyncLevel=FLUSH numRecordsToKeep=100 maxNumLogsToKeep=10
numVersionBuckets=65536
   [junit4]   2> 1097308 INFO  (coreLoadExecutor-4147-thread-1) [    x:collection1] o.a.s.u.CommitTracker
Hard AutoCommit: disabled
   [junit4]   2> 1097308 INFO  (coreLoadExecutor-4147-thread-1) [    x:collection1] o.a.s.u.CommitTracker
Soft AutoCommit: disabled
   [junit4]   2> 1097309 INFO  (coreLoadExecutor-4147-thread-1) [    x:collection1] o.a.s.u.RandomMergePolicy
RandomMergePolicy wrapping class org.apache.lucene.index.LogByteSizeMergePolicy: [LogByteSizeMergePolicy:
minMergeSize=1677721, mergeFactor=39, maxMergeSize=2147483648, maxMergeSizeForForcedMerge=9223372036854775807,
calibrateSizeByDeletes=true, maxMergeDocs=2147483647, maxCFSSegmentSizeMB=8.796093022207999E12,
noCFSRatio=1.0]
   [junit4]   2> 1097309 INFO  (coreLoadExecutor-4147-thread-1) [    x:collection1] o.a.s.s.SolrIndexSearcher
Opening [Searcher@6f8ab8ae[collection1] main]
   [junit4]   2> 1097310 INFO  (coreLoadExecutor-4147-thread-1) [    x:collection1] o.a.s.h.c.SpellCheckComponent
Initializing spell checkers
   [junit4]   2> 1097318 INFO  (coreLoadExecutor-4147-thread-1) [    x:collection1] o.a.s.s.DirectSolrSpellChecker
init: {name=direct,classname=DirectSolrSpellChecker,field=lowerfilt,minQueryLength=3}
   [junit4]   2> 1097367 INFO  (coreLoadExecutor-4147-thread-1) [    x:collection1] o.a.s.h.ReplicationHandler
Commits will be reserved for  10000
   [junit4]   2> 1097368 INFO  (coreLoadExecutor-4147-thread-1) [    x:collection1] o.a.s.u.UpdateLog
Could not find max version in index or recent updates, using new clock 1566426804867039232
   [junit4]   2> 1097370 INFO  (searcherExecutor-4148-thread-1-processing-x:collection1)
[    x:collection1] o.a.s.h.c.SpellCheckComponent Loading spell index for spellchecker: default
   [junit4]   2> 1097370 INFO  (searcherExecutor-4148-thread-1-processing-x:collection1)
[    x:collection1] o.a.s.h.c.SpellCheckComponent Loading spell index for spellchecker: direct
   [junit4]   2> 1097370 INFO  (searcherExecutor-4148-thread-1-processing-x:collection1)
[    x:collection1] o.a.s.h.c.SpellCheckComponent Loading spell index for spellchecker: wordbreak
   [junit4]   2> 1097370 INFO  (searcherExecutor-4148-thread-1-processing-x:collection1)
[    x:collection1] o.a.s.h.c.SpellCheckComponent Loading spell index for spellchecker: multipleFields
   [junit4]   2> 1097370 INFO  (searcherExecutor-4148-thread-1-processing-x:collection1)
[    x:collection1] o.a.s.h.c.SpellCheckComponent Loading spell index for spellchecker: jarowinkler
   [junit4]   2> 1097370 INFO  (searcherExecutor-4148-thread-1-processing-x:collection1)
[    x:collection1] o.a.s.h.c.SpellCheckComponent Loading spell index for spellchecker: external
   [junit4]   2> 1097371 INFO  (searcherExecutor-4148-thread-1-processing-x:collection1)
[    x:collection1] o.a.s.h.c.SpellCheckComponent Loading spell index for spellchecker: freq
   [junit4]   2> 1097371 INFO  (searcherExecutor-4148-thread-1-processing-x:collection1)
[    x:collection1] o.a.s.h.c.SpellCheckComponent Loading spell index for spellchecker: fqcn
   [junit4]   2> 1097371 INFO  (SUITE-HardAutoCommitTest-seed#[FC3BA23C1E6D990]-worker)
[    ] o.a.s.SolrTestCaseJ4 ####initCore end
   [junit4]   2> 1097371 INFO  (searcherExecutor-4148-thread-1-processing-x:collection1)
[    x:collection1] o.a.s.h.c.SpellCheckComponent Loading spell index for spellchecker: perDict
   [junit4]   2> 1097373 INFO  (searcherExecutor-4148-thread-1-processing-x:collection1)
[    x:collection1] o.a.s.c.SolrCore [collection1] Registered new searcher Searcher@6f8ab8ae[collection1]
main{ExitableDirectoryReader(UninvertingDirectoryReader())}
   [junit4]   2> 1097374 INFO  (TEST-HardAutoCommitTest.testCommitWithin-seed#[FC3BA23C1E6D990])
[    ] o.a.s.SolrTestCaseJ4 ###Starting testCommitWithin
   [junit4]   2> 1097374 INFO  (TEST-HardAutoCommitTest.testCommitWithin-seed#[FC3BA23C1E6D990])
[    ] o.a.s.u.DirectUpdateHandler2 [collection1] REMOVING ALL DOCUMENTS FROM INDEX
   [junit4]   2> 1097375 INFO  (TEST-HardAutoCommitTest.testCommitWithin-seed#[FC3BA23C1E6D990])
[    ] o.a.s.s.SolrIndexSearcher Opening [Searcher@2d50c95[collection1] realtime]
   [junit4]   2> 1097375 INFO  (TEST-HardAutoCommitTest.testCommitWithin-seed#[FC3BA23C1E6D990])
[    ] o.a.s.u.p.LogUpdateProcessorFactory [collection1]  webapp=null path=null params={_version_=-9223372036854775807&update.distrib=FROMLEADER&versions=true&wt=json&indent=true}{deleteByQuery=*:*
(-9223372036854775807)} 0 0
   [junit4]   2> 1097375 ERROR (TEST-HardAutoCommitTest.testCommitWithin-seed#[FC3BA23C1E6D990])
[    ] o.a.s.c.CorePropertiesLocator Couldn't load core descriptor from /x1/jenkins/jenkins-slave/workspace/Lucene-Solr-Tests-master/solr/core/src/test-files/solr/collection1/core.properties:java.nio.file.NoSuchFileException:
/x1/jenkins/jenkins-slave/workspace/Lucene-Solr-Tests-master/solr/core/src/test-files/solr/collection1/core.properties
   [junit4]   2> 1097376 INFO  (TEST-HardAutoCommitTest.testCommitWithin-seed#[FC3BA23C1E6D990])
[    ] o.a.s.c.SolrResourceLoader [null] Added 2 libs to classloader, from paths: [/x1/jenkins/jenkins-slave/workspace/Lucene-Solr-Tests-master/solr/core/src/test-files/solr/collection1/lib,
/x1/jenkins/jenkins-slave/workspace/Lucene-Solr-Tests-master/solr/core/src/test-files/solr/collection1/lib/classes]
   [junit4]   2> 1097440 WARN  (TEST-HardAutoCommitTest.testCommitWithin-seed#[FC3BA23C1E6D990])
[    ] o.a.s.c.Config Beginning with Solr 5.5, <mergePolicy> is deprecated, use <mergePolicyFactory>
instead.
   [junit4]   2> 1097442 INFO  (TEST-HardAutoCommitTest.testCommitWithin-seed#[FC3BA23C1E6D990])
[    ] o.a.s.c.SolrConfig Using Lucene MatchVersion: 7.0.0
   [junit4]   2> 1097493 INFO  (TEST-HardAutoCommitTest.testCommitWithin-seed#[FC3BA23C1E6D990])
[    ] o.a.s.s.IndexSchema [collection1] Schema name=test
   [junit4]   2> 1098044 WARN  (TEST-HardAutoCommitTest.testCommitWithin-seed#[FC3BA23C1E6D990])
[    ] o.a.s.s.IndexSchema [collection1] default search field in schema is text. WARNING:
Deprecated, please use 'df' on request instead.
   [junit4]   2> 1098047 INFO  (TEST-HardAutoCommitTest.testCommitWithin-seed#[FC3BA23C1E6D990])
[    ] o.a.s.s.IndexSchema Loaded schema test/1.0 with uniqueid field id
   [junit4]   2> 1098057 INFO  (TEST-HardAutoCommitTest.testCommitWithin-seed#[FC3BA23C1E6D990])
[    ] o.a.s.c.CoreContainer Reloading SolrCore 'collection1' using configuration from instancedir
/x1/jenkins/jenkins-slave/workspace/Lucene-Solr-Tests-master/solr/core/src/test-files/solr/collection1
   [junit4]   2> 1098171 INFO  (TEST-HardAutoCommitTest.testCommitWithin-seed#[FC3BA23C1E6D990])
[    x:collection1] o.a.s.m.r.SolrJmxReporter JMX monitoring for 'solr.core.collection1' (registry
'solr.core.collection1') enabled at server: com.sun.jmx.mbeanserver.JmxMBeanServer@552f141d
   [junit4]   2> 1098171 INFO  (TEST-HardAutoCommitTest.testCommitWithin-seed#[FC3BA23C1E6D990])
[    x:collection1] o.a.s.c.SolrCore [[collection1] ] Opening new SolrCore at [/x1/jenkins/jenkins-slave/workspace/Lucene-Solr-Tests-master/solr/core/src/test-files/solr/collection1],
dataDir=[/x1/jenkins/jenkins-slave/workspace/Lucene-Solr-Tests-master/solr/build/solr-core/test/J2/temp/solr.update.HardAutoCommitTest_FC3BA23C1E6D990-001/init-core-data-001/]
   [junit4]   2> 1098239 INFO  (TEST-HardAutoCommitTest.testCommitWithin-seed#[FC3BA23C1E6D990])
[    x:collection1] o.a.s.u.CommitTracker Hard AutoCommit: disabled
   [junit4]   2> 1098239 INFO  (TEST-HardAutoCommitTest.testCommitWithin-seed#[FC3BA23C1E6D990])
[    x:collection1] o.a.s.u.CommitTracker Soft AutoCommit: disabled
   [junit4]   2> 1098241 INFO  (TEST-HardAutoCommitTest.testCommitWithin-seed#[FC3BA23C1E6D990])
[    x:collection1] o.a.s.s.SolrIndexSearcher Opening [Searcher@78fd80b5[collection1] main]
   [junit4]   2> 1098242 INFO  (TEST-HardAutoCommitTest.testCommitWithin-seed#[FC3BA23C1E6D990])
[    x:collection1] o.a.s.h.c.SpellCheckComponent Initializing spell checkers
   [junit4]   2> 1098242 INFO  (TEST-HardAutoCommitTest.testCommitWithin-seed#[FC3BA23C1E6D990])
[    x:collection1] o.a.s.s.DirectSolrSpellChecker init: {name=direct,classname=DirectSolrSpellChecker,field=lowerfilt,minQueryLength=3}
   [junit4]   2> 1098245 INFO  (TEST-HardAutoCommitTest.testCommitWithin-seed#[FC3BA23C1E6D990])
[    x:collection1] o.a.s.h.ReplicationHandler Commits will be reserved for  10000
   [junit4]   2> 1098246 INFO  (TEST-HardAutoCommitTest.testCommitWithin-seed#[FC3BA23C1E6D990])
[    x:collection1] o.a.s.u.UpdateLog Could not find max version in index or recent updates,
using new clock 1566426805787688960
   [junit4]   2> 1098248 INFO  (searcherExecutor-4153-thread-1-processing-x:collection1)
[    x:collection1] o.a.s.h.c.SpellCheckComponent Loading spell index for spellchecker: default
   [junit4]   2> 1098248 INFO  (searcherExecutor-4153-thread-1-processing-x:collection1)
[    x:collection1] o.a.s.h.c.SpellCheckComponent Loading spell index for spellchecker: direct
   [junit4]   2> 1098248 INFO  (searcherExecutor-4153-thread-1-processing-x:collection1)
[    x:collection1] o.a.s.h.c.SpellCheckComponent Loading spell index for spellchecker: wordbreak
   [junit4]   2> 1098248 INFO  (searcherExecutor-4153-thread-1-processing-x:collection1)
[    x:collection1] o.a.s.h.c.SpellCheckComponent Loading spell index for spellchecker: multipleFields
   [junit4]   2> 1098249 INFO  (searcherExecutor-4153-thread-1-processing-x:collection1)
[    x:collection1] o.a.s.h.c.SpellCheckComponent Loading spell index for spellchecker: jarowinkler
   [junit4]   2> 1098250 INFO  (searcherExecutor-4153-thread-1-processing-x:collection1)
[    x:collection1] o.a.s.h.c.SpellCheckComponent Loading spell index for spellchecker: external
   [junit4]   2> 1098250 INFO  (TEST-HardAutoCommitTest.testCommitWithin-seed#[FC3BA23C1E6D990])
[    x:collection1] o.a.s.u.RandomMergePolicy RandomMergePolicy wrapping class org.apache.lucene.index.TieredMergePolicy:
[TieredMergePolicy: maxMergeAtOnce=15, maxMergeAtOnceExplicit=29, maxMergedSegmentMB=7.3466796875,
floorSegmentMB=1.48046875, forceMergeDeletesPctAllowed=8.209642173832792, segmentsPerTier=19.0,
maxCFSSegmentSizeMB=8.796093022207999E12, noCFSRatio=0.0
   [junit4]   2> 1098250 INFO  (searcherExecutor-4153-thread-1-processing-x:collection1)
[    x:collection1] o.a.s.h.c.SpellCheckComponent Loading spell index for spellchecker: freq
   [junit4]   2> 1098250 INFO  (searcherExecutor-4153-thread-1-processing-x:collection1)
[    x:collection1] o.a.s.h.c.SpellCheckComponent Loading spell index for spellchecker: fqcn
   [junit4]   2> 1098250 INFO  (searcherExecutor-4153-thread-1-processing-x:collection1)
[    x:collection1] o.a.s.h.c.SpellCheckComponent Loading spell index for spellchecker: perDict
   [junit4]   2> 1098253 INFO  (searcherExecutor-4153-thread-1-processing-x:collection1)
[    x:collection1] o.a.s.c.SolrCore [collection1] Registered new searcher Searcher@78fd80b5[collection1]
main{ExitableDirectoryReader(UninvertingDirectoryReader())}
   [junit4]   2> 1098253 INFO  (TEST-HardAutoCommitTest.testCommitWithin-seed#[FC3BA23C1E6D990])
[    x:collection1] o.a.s.u.DefaultSolrCoreState New IndexWriter is ready to be used.
   [junit4]   2> 1098254 INFO  (TEST-HardAutoCommitTest.testCommitWithin-seed#[FC3BA23C1E6D990])
[    x:collection1] o.a.s.s.SolrIndexSearcher Opening [Searcher@51edebbe[collection1] main]
   [junit4]   2> 1098254 INFO  (TEST-HardAutoCommitTest.testCommitWithin-seed#[FC3BA23C1E6D990])
[    x:collection1] o.a.s.c.SolrCore [collection1]  CLOSING SolrCore org.apache.solr.core.SolrCore@41748a20
   [junit4]   2> 1098254 INFO  (TEST-HardAutoCommitTest.testCommitWithin-seed#[FC3BA23C1E6D990])
[    x:collection1] o.a.s.m.SolrMetricManager Closing metric reporters for registry=solr.core.collection1,
tag=1098156576
   [junit4]   2> 1098263 INFO  (searcherExecutor-4153-thread-1-processing-x:collection1)
[    x:collection1] o.a.s.c.SolrCore [collection1] Registered new searcher Searcher@51edebbe[collection1]
main{ExitableDirectoryReader(UninvertingDirectoryReader())}
   [junit4]   2> 1098265 INFO  (TEST-HardAutoCommitTest.testCommitWithin-seed#[FC3BA23C1E6D990])
[    x:collection1] o.a.s.u.p.LogUpdateProcessorFactory [collection1] {add=[529 (1566426805803417600)]}
0 3
   [junit4]   2> 1098265 INFO  (TEST-HardAutoCommitTest.testCommitWithin-seed#[FC3BA23C1E6D990])
[    x:collection1] o.a.s.c.S.Request [collection1]  webapp=null path=null params={q=id:529&qt=standard&start=0&rows=20&version=2.2}
hits=0 status=0 QTime=0
   [junit4]   2> 1098267 INFO  (TEST-HardAutoCommitTest.testCommitWithin-seed#[FC3BA23C1E6D990])
[    x:collection1] o.a.s.u.p.LogUpdateProcessorFactory [collection1] {add=[530 (1566426805809709056)]}
0 6
   [junit4]   2> 1098268 INFO  (TEST-HardAutoCommitTest.testCommitWithin-seed#[FC3BA23C1E6D990])
[    x:collection1] o.a.s.c.S.Request [collection1]  webapp=null path=null params={q=id:530&qt=standard&start=0&rows=20&version=2.2}
hits=0 status=0 QTime=0
   [junit4]   2> 1098268 INFO  (TEST-HardAutoCommitTest.testCommitWithin-seed#[FC3BA23C1E6D990])
[    x:collection1] o.a.s.u.p.LogUpdateProcessorFactory [collection1] {delete=[529 (-1566426805810757632)]}
0 7
   [junit4]   2> 1098268 INFO  (TEST-HardAutoCommitTest.testCommitWithin-seed#[FC3BA23C1E6D990])
[    x:collection1] o.a.s.c.S.Request [collection1]  webapp=null path=null params={q=id:529&qt=standard&start=0&rows=20&version=2.2}
hits=0 status=0 QTime=0
   [junit4]   2> 1098269 ERROR (TEST-HardAutoCommitTest.testCommitWithin-seed#[FC3BA23C1E6D990])
[    x:collection1] o.a.s.SolrTestCaseJ4 REQUEST FAILED: xpath=//result[@numFound=1]
   [junit4]   2> 	xml response was: <?xml version="1.0" encoding="UTF-8"?>
   [junit4]   2> <response>
   [junit4]   2> <lst name="responseHeader"><int name="status">0</int><int
name="QTime">0</int></lst><result name="response" numFound="0" start="0"></result>
   [junit4]   2> </response>
   [junit4]   2> 
   [junit4]   2> 	request was:q=id:529&qt=standard&start=0&rows=20&version=2.2
   [junit4]   2> 1098289 ERROR (TEST-HardAutoCommitTest.testCommitWithin-seed#[FC3BA23C1E6D990])
[    x:collection1] o.a.s.SolrTestCaseJ4 REQUEST FAILED: q=id:529&qt=standard&start=0&rows=20&version=2.2:java.lang.RuntimeException:
REQUEST FAILED: xpath=//result[@numFound=1]
   [junit4]   2> 	xml response was: <?xml version="1.0" encoding="UTF-8"?>
   [junit4]   2> <response>
   [junit4]   2> <lst name="responseHeader"><int name="status">0</int><int
name="QTime">0</int></lst><result name="response" numFound="0" start="0"></result>
   [junit4]   2> </response>
   [junit4]   2> 
   [junit4]   2> 	request was:q=id:529&qt=standard&start=0&rows=20&version=2.2
   [junit4]   2> 	at org.apache.solr.SolrTestCaseJ4.assertQ(SolrTestCaseJ4.java:889)
   [junit4]   2> 	at org.apache.solr.update.HardAutoCommitTest.testCommitWithin(HardAutoCommitTest.java:100)
   [junit4]   2> 	at sun.reflect.NativeMethodAccessorImpl.invoke0(Native Method)
   [junit4]   2> 	at sun.reflect.NativeMethodAccessorImpl.invoke(NativeMethodAccessorImpl.java:62)
   [junit4]   2> 	at sun.reflect.DelegatingMethodAccessorImpl.invoke(DelegatingMethodAccessorImpl.java:43)
   [junit4]   2> 	at java.lang.reflect.Method.invoke(Method.java:498)
   [junit4]   2> 	at com.carrotsearch.randomizedtesting.RandomizedRunner.invoke(RandomizedRunner.java:1713)
   [junit4]   2> 	at com.carrotsearch.randomizedtesting.RandomizedRunner$8.evaluate(RandomizedRunner.java:907)
   [junit4]   2> 	at com.carrotsearch.randomizedtesting.RandomizedRunner$9.evaluate(RandomizedRunner.java:943)
   [junit4]   2> 	at com.carrotsearch.randomizedtesting.RandomizedRunner$10.evaluate(RandomizedRunner.java:957)
   [junit4]   2> 	at com.carrotsearch.randomizedtesting.rules.SystemPropertiesRestoreRule$1.evaluate(SystemPropertiesRestoreRule.java:57)
   [junit4]   2> 	at org.apache.lucene.util.TestRuleSetupTeardownChained$1.evaluate(TestRuleSetupTeardownChained.java:49)
   [junit4]   2> 	at org.apache.lucene.util.AbstractBeforeAfterRule$1.evaluate(AbstractBeforeAfterRule.java:45)
   [junit4]   2> 	at org.apache.lucene.util.TestRuleThreadAndTestName$1.evaluate(TestRuleThreadAndTestName.java:48)
   [junit4]   2> 	at org.apache.lucene.util.TestRuleIgnoreAfterMaxFailures$1.evaluate(TestRuleIgnoreAfterMaxFailures.java:64)
   [junit4]   2> 	at org.apache.lucene.util.TestRuleMarkFailure$1.evaluate(TestRuleMarkFailure.java:47)
   [junit4]   2> 	at com.carrotsearch.randomizedtesting.rules.StatementAdapter.evaluate(StatementAdapter.java:36)
   [junit4]   2> 	at com.carrotsearch.randomizedtesting.ThreadLeakControl$StatementRunner.run(ThreadLeakControl.java:368)
   [junit4]   2> 	at com.carrotsearch.randomizedtesting.ThreadLeakControl.forkTimeoutingTask(ThreadLeakControl.java:817)
   [junit4]   2> 	at com.carrotsearch.randomizedtesting.ThreadLeakControl$3.evaluate(ThreadLeakControl.java:468)
   [junit4]   2> 	at com.carrotsearch.randomizedtesting.RandomizedRunner.runSingleTest(RandomizedRunner.java:916)
   [junit4]   2> 	at com.carrotsearch.randomizedtesting.RandomizedRunner$5.evaluate(RandomizedRunner.java:802)
   [junit4]   2> 	at com.carrotsearch.randomizedtesting.RandomizedRunner$6.evaluate(RandomizedRunner.java:852)
   [junit4]   2> 	at com.carrotsearch.randomizedtesting.RandomizedRunner$7.evaluate(RandomizedRunner.java:863)
   [junit4]   2> 	at com.carrotsearch.randomizedtesting.rules.StatementAdapter.evaluate(StatementAdapter.java:36)
   [junit4]   2> 	at com.carrotsearch.randomizedtesting.rules.SystemPropertiesRestoreRule$1.evaluate(SystemPropertiesRestoreRule.java:57)
   [junit4]   2> 	at org.apache.lucene.util.AbstractBeforeAfterRule$1.evaluate(AbstractBeforeAfterRule.java:45)
   [junit4]   2> 	at com.carrotsearch.randomizedtesting.rules.StatementAdapter.evaluate(StatementAdapter.java:36)
   [junit4]   2> 	at org.apache.lucene.util.TestRuleStoreClassName$1.evaluate(TestRuleStoreClassName.java:41)
   [junit4]   2> 	at com.carrotsearch.randomizedtesting.rules.NoShadowingOrOverridesOnMethodsRule$1.evaluate(NoShadowingOrOverridesOnMethodsRule.java:40)
   [junit4]   2> 	at com.carrotsearch.randomizedtesting.rules.NoShadowingOrOverridesOnMethodsRule$1.evaluate(NoShadowingOrOverridesOnMethodsRule.java:40)
   [junit4]   2> 	at com.carrotsearch.randomizedtesting.rules.StatementAdapter.evaluate(StatementAdapter.java:36)
   [junit4]   2> 	at com.carrotsearch.randomizedtesting.rules.StatementAdapter.evaluate(StatementAdapter.java:36)
   [junit4]   2> 	at com.carrotsearch.randomizedtesting.rules.StatementAdapter.evaluate(StatementAdapter.java:36)
   [junit4]   2> 	at org.apache.lucene.util.TestRuleAssertionsRequired$1.evaluate(TestRuleAssertionsRequired.java:53)
   [junit4]   2> 	at org.apache.lucene.util.TestRuleMarkFailure$1.evaluate(TestRuleMarkFailure.java:47)
   [junit4]   2> 	at org.apache.lucene.util.TestRuleIgnoreAfterMaxFailures$1.evaluate(TestRuleIgnoreAfterMaxFailures.java:64)
   [junit4]   2> 	at org.apache.lucene.util.TestRuleIgnoreTestSuites$1.evaluate(TestRuleIgnoreTestSuites.java:54)
   [junit4]   2> 	at com.carrotsearch.randomizedtesting.rules.StatementAdapter.evaluate(StatementAdapter.java:36)
   [junit4]   2> 	at com.carrotsearch.randomizedtesting.ThreadLeakControl$StatementRunner.run(ThreadLeakControl.java:368)
   [junit4]   2> 	at java.lang.Thread.run(Thread.java:745)
   [junit4]   2> 
   [junit4]   2> 1098289 INFO  (TEST-HardAutoCommitTest.testCommitWithin-seed#[FC3BA23C1E6D990])
[    x:collection1] o.a.s.SolrTestCaseJ4 ###Ending testCommitWithin
   [junit4]   2> NOTE: reproduce with: ant test  -Dtestcase=HardAutoCommitTest -Dtests.method=testCommitWithin
-Dtests.seed=FC3BA23C1E6D990 -Dtests.multiplier=2 -Dtests.slow=true -Dtests.locale=sv-SE -Dtests.timezone=Asia/Chongqing
-Dtests.asserts=true -Dtests.file.encoding=US-ASCII
   [junit4] ERROR   0.92s J2 | HardAutoCommitTest.testCommitWithin <<<
   [junit4]    > Throwable #1: java.lang.RuntimeException: Exception during query
   [junit4]    > 	at __randomizedtesting.SeedInfo.seed([FC3BA23C1E6D990:B511D55B42C83785]:0)
   [junit4]    > 	at org.apache.solr.SolrTestCaseJ4.assertQ(SolrTestCaseJ4.java:896)
   [junit4]    > 	at org.apache.solr.update.HardAutoCommitTest.testCommitWithin(HardAutoCommitTest.java:100)
   [junit4]    > 	at java.lang.Thread.run(Thread.java:745)
   [junit4]    > Caused by: java.lang.RuntimeException: REQUEST FAILED: xpath=//result[@numFound=1]
   [junit4]    > 	xml response was: <?xml version="1.0" encoding="UTF-8"?>
   [junit4]    > <response>
   [junit4]    > <lst name="responseHeader"><int name="status">0</int><int
name="QTime">0</int></lst><result name="response" numFound="0" start="0"></result>
   [junit4]    > </response>
   [junit4]    > 	request was:q=id:529&qt=standard&start=0&rows=20&version=2.2
   [junit4]    > 	at org.apache.solr.SolrTestCaseJ4.assertQ(SolrTestCaseJ4.java:889)
   [junit4]    > 	... 40 more
   [junit4]   2> 1098295 INFO  (SUITE-HardAutoCommitTest-seed#[FC3BA23C1E6D990]-worker)
[    x:collection1] o.a.s.SolrTestCaseJ4 ###deleteCore
   [junit4]   2> 1098303 INFO  (SUITE-HardAutoCommitTest-seed#[FC3BA23C1E6D990]-worker)
[    x:collection1] o.a.s.c.CoreContainer Shutting down CoreContainer instance=565812892
   [junit4]   2> 1098303 INFO  (SUITE-HardAutoCommitTest-seed#[FC3BA23C1E6D990]-worker)
[    x:collection1] o.a.s.m.SolrMetricManager Closing metric reporters for registry=solr.node,
tag=null
   [junit4]   2> 1098304 INFO  (SUITE-HardAutoCommitTest-seed#[FC3BA23C1E6D990]-worker)
[    x:collection1] o.a.s.m.SolrMetricManager Closing metric reporters for registry=solr.jvm,
tag=null
   [junit4]   2> 1098305 INFO  (SUITE-HardAutoCommitTest-seed#[FC3BA23C1E6D990]-worker)
[    x:collection1] o.a.s.m.SolrMetricManager Closing metric reporters for registry=solr.jetty,
tag=null
   [junit4]   2> 1098307 INFO  (SUITE-HardAutoCommitTest-seed#[FC3BA23C1E6D990]-worker)
[    x:collection1] o.a.s.c.TransientSolrCoreCacheDefault Allocating transient cache for 2147483647
transient cores
   [junit4]   2> 1098311 INFO  (coreCloseExecutor-4157-thread-1-processing-x:collection1)
[    x:collection1] o.a.s.c.SolrCore [collection1]  CLOSING SolrCore org.apache.solr.core.SolrCore@29a7cfbf
   [junit4]   2> 1098312 INFO  (coreCloseExecutor-4157-thread-1-processing-x:collection1)
[    x:collection1] o.a.s.u.DirectUpdateHandler2 Committing on IndexWriter close.
   [junit4]   2> 1098312 INFO  (coreCloseExecutor-4157-thread-1-processing-x:collection1)
[    x:collection1] o.a.s.u.SolrIndexWriter Calling setCommitData with IW:org.apache.solr.update.SolrIndexWriter@60acca5e
commitCommandVersion:0
   [junit4]   2> 1098314 INFO  (coreCloseExecutor-4157-thread-1-processing-x:collection1)
[    x:collection1] o.a.s.m.SolrMetricManager Closing metric reporters for registry=solr.core.collection1,
tag=698863551
   [junit4]   2> NOTE: leaving temporary files on disk at: /x1/jenkins/jenkins-slave/workspace/Lucene-Solr-Tests-master/solr/build/solr-core/test/J2/temp/solr.update.HardAutoCommitTest_FC3BA23C1E6D990-001
   [junit4]   2> May 04, 2017 1:23:33 AM com.carrotsearch.randomizedtesting.ThreadLeakControl
checkThreadLeaks
   [junit4]   2> WARNING: Will linger awaiting termination of 2 leaked thread(s).
   [junit4]   2> NOTE: test params are: codec=Lucene70, sim=RandomSimilarity(queryNorm=true):
{}, locale=sv-SE, timezone=Asia/Chongqing
   [junit4]   2> NOTE: Linux 3.13.0-88-generic amd64/Oracle Corporation 1.8.0_121 (64-bit)/cpus=4,threads=1,free=300719888,total=532152320
   [junit4]   2> NOTE: All tests run in this JVM: [TestMissingGroups, TestRandomRequestDistribution,
FieldAnalysisRequestHandlerTest, OutputWriterTest, TestHdfsUpdateLog, TermVectorComponentDistributedTest,
TriLevelCompositeIdRoutingTest, TestSearcherReuse, TestPhraseSuggestions, CdcrVersionReplicationTest,
TestEmbeddedSolrServerSchemaAPI, DistributedExpandComponentTest, DirectUpdateHandlerOptimizeTest,
AsyncCallRequestStatusResponseTest, ExternalFileFieldSortTest, TestRequestForwarding, HighlighterConfigTest,
DocValuesMultiTest, TestInitParams, ManagedSchemaRoundRobinCloudTest, StatsReloadRaceTest,
UpdateParamsTest, TestRestoreCore, TestFastOutputStream, SuggestComponentContextFilterQueryTest,
SynonymTokenizerTest, LeaderElectionTest, OverseerModifyCollectionTest, PropertiesRequestHandlerTest,
OverseerTest, TestSubQueryTransformerDistrib, HdfsWriteToMultipleCollectionsTest, TestCustomDocTransformer,
TestPHPSerializedResponseWriter, TestExactStatsCache, OutOfBoxZkACLAndCredentialsProvidersTest,
HttpPartitionTest, TestTolerantSearch, BasicAuthStandaloneTest, SimpleFacetsTest, CheckHdfsIndexTest,
TestExpandComponent, TestConfigsApi, TestUseDocValuesAsStored, JsonValidatorTest, HLLUtilTest,
HdfsThreadLeakTest, BinaryUpdateRequestHandlerTest, TestWriterPerf, TestQueryWrapperFilter,
TestCoreDiscovery, TestCloudPivotFacet, DistributedSuggestComponentTest, TestFilteredDocIdSet,
TestTolerantUpdateProcessorCloud, TestLockTree, TestCollationField, EchoParamsTest, TestBinaryField,
V2ApiIntegrationTest, RestartWhileUpdatingTest, JavabinLoaderTest, TestComponentsName, BadIndexSchemaTest,
TestDelegationWithHadoopAuth, AtomicUpdatesTest, TestConfig, RequestLoggingTest, TestCSVResponseWriter,
SolrJmxReporterTest, TestOverriddenPrefixQueryForCustomFieldType, CoreMergeIndexesAdminHandlerTest,
ConcurrentDeleteAndCreateCollectionTest, CdcrReplicationDistributedZkTest, SolrCoreCheckLockOnStartupTest,
SuggesterWFSTTest, MergeStrategyTest, TestSolrCloudWithDelegationTokens, RemoteQueryErrorTest,
TestReversedWildcardFilterFactory, FullSolrCloudDistribCmdsTest, TestClusterProperties, TestDistributedMissingSort,
TestIndexSearcher, ZkStateReaderTest, CdcrUpdateLogTest, CoreSorterTest, SolrTestCaseJ4Test,
ChaosMonkeyNothingIsSafeTest, TestIndexingPerformance, AutoCommitTest, CreateCollectionCleanupTest,
TestGroupingSearch, TestSortByMinMaxFunction, AnalyticsQueryTest, SaslZkACLProviderTest, SolrMetricsIntegrationTest,
TestQuerySenderNoQuery, TestExclusionRuleCollectionAccess, TestPointFields, DateFieldTest,
TestXmlQParser, TestCloudSchemaless, SuggesterTest, TestFieldCacheSortRandom, MultiThreadedOCPTest,
MBeansHandlerTest, TestSolrDeletionPolicy1, TestSolrXml, TestGraphMLResponseWriter, CurrencyFieldXmlFileTest,
DateRangeFieldTest, ExplicitHLLTest, TestSolrQueryParser, ActionThrottleTest, BasicDistributedZk2Test,
CollectionsAPIDistributedZkTest, ShardRoutingTest, TestZkChroot, ZkCLITest, TestDistributedSearch,
TestStressReorder, HardAutoCommitTest]
   [junit4] Completed [375/709 (1!)] on J2 in 2.24s, 1 test, 1 error <<< FAILURES!

[...truncated 44437 lines...]

Mime
View raw message