lucene-dev mailing list archives

Site index · List index
Message view « Date » · « Thread »
Top « Date » · « Thread »
From Policeman Jenkins Server <jenk...@thetaphi.de>
Subject [JENKINS] Lucene-Solr-master-Linux (32bit/jdk1.8.0_131) - Build # 19636 - Unstable!
Date Thu, 18 May 2017 08:31:02 GMT
Build: https://jenkins.thetaphi.de/job/Lucene-Solr-master-Linux/19636/
Java: 32bit/jdk1.8.0_131 -client -XX:+UseG1GC

1 tests failed.
FAILED:  org.apache.solr.handler.admin.TestCollectionAPIs.testCommands

Error Message:
Error in command payload[{     "modify":{       "rule":"replica:*,cores:<5",       "autoAddReplicas":false},
    "errorMessages":["Value is not valid, expected one of: [ARRAY], found: String"]}]

Stack Trace:
java.lang.RuntimeException: Error in command payload[{
    "modify":{
      "rule":"replica:*,cores:<5",
      "autoAddReplicas":false},
    "errorMessages":["Value is not valid, expected one of: [ARRAY], found: String"]}]
	at __randomizedtesting.SeedInfo.seed([4D398EDCF379C9FA:6C0547249943299E]:0)
	at org.apache.solr.handler.admin.TestCollectionAPIs.makeCall(TestCollectionAPIs.java:189)
	at org.apache.solr.handler.admin.TestCollectionAPIs.compareOutput(TestCollectionAPIs.java:148)
	at org.apache.solr.handler.admin.TestCollectionAPIs.testCommands(TestCollectionAPIs.java:120)
	at sun.reflect.NativeMethodAccessorImpl.invoke0(Native Method)
	at sun.reflect.NativeMethodAccessorImpl.invoke(NativeMethodAccessorImpl.java:62)
	at sun.reflect.DelegatingMethodAccessorImpl.invoke(DelegatingMethodAccessorImpl.java:43)
	at java.lang.reflect.Method.invoke(Method.java:498)
	at com.carrotsearch.randomizedtesting.RandomizedRunner.invoke(RandomizedRunner.java:1713)
	at com.carrotsearch.randomizedtesting.RandomizedRunner$8.evaluate(RandomizedRunner.java:907)
	at com.carrotsearch.randomizedtesting.RandomizedRunner$9.evaluate(RandomizedRunner.java:943)
	at com.carrotsearch.randomizedtesting.RandomizedRunner$10.evaluate(RandomizedRunner.java:957)
	at com.carrotsearch.randomizedtesting.rules.SystemPropertiesRestoreRule$1.evaluate(SystemPropertiesRestoreRule.java:57)
	at org.apache.lucene.util.TestRuleSetupTeardownChained$1.evaluate(TestRuleSetupTeardownChained.java:49)
	at org.apache.lucene.util.AbstractBeforeAfterRule$1.evaluate(AbstractBeforeAfterRule.java:45)
	at org.apache.lucene.util.TestRuleThreadAndTestName$1.evaluate(TestRuleThreadAndTestName.java:48)
	at org.apache.lucene.util.TestRuleIgnoreAfterMaxFailures$1.evaluate(TestRuleIgnoreAfterMaxFailures.java:64)
	at org.apache.lucene.util.TestRuleMarkFailure$1.evaluate(TestRuleMarkFailure.java:47)
	at com.carrotsearch.randomizedtesting.rules.StatementAdapter.evaluate(StatementAdapter.java:36)
	at com.carrotsearch.randomizedtesting.ThreadLeakControl$StatementRunner.run(ThreadLeakControl.java:368)
	at com.carrotsearch.randomizedtesting.ThreadLeakControl.forkTimeoutingTask(ThreadLeakControl.java:817)
	at com.carrotsearch.randomizedtesting.ThreadLeakControl$3.evaluate(ThreadLeakControl.java:468)
	at com.carrotsearch.randomizedtesting.RandomizedRunner.runSingleTest(RandomizedRunner.java:916)
	at com.carrotsearch.randomizedtesting.RandomizedRunner$5.evaluate(RandomizedRunner.java:802)
	at com.carrotsearch.randomizedtesting.RandomizedRunner$6.evaluate(RandomizedRunner.java:852)
	at com.carrotsearch.randomizedtesting.RandomizedRunner$7.evaluate(RandomizedRunner.java:863)
	at com.carrotsearch.randomizedtesting.rules.StatementAdapter.evaluate(StatementAdapter.java:36)
	at com.carrotsearch.randomizedtesting.rules.SystemPropertiesRestoreRule$1.evaluate(SystemPropertiesRestoreRule.java:57)
	at org.apache.lucene.util.AbstractBeforeAfterRule$1.evaluate(AbstractBeforeAfterRule.java:45)
	at com.carrotsearch.randomizedtesting.rules.StatementAdapter.evaluate(StatementAdapter.java:36)
	at org.apache.lucene.util.TestRuleStoreClassName$1.evaluate(TestRuleStoreClassName.java:41)
	at com.carrotsearch.randomizedtesting.rules.NoShadowingOrOverridesOnMethodsRule$1.evaluate(NoShadowingOrOverridesOnMethodsRule.java:40)
	at com.carrotsearch.randomizedtesting.rules.NoShadowingOrOverridesOnMethodsRule$1.evaluate(NoShadowingOrOverridesOnMethodsRule.java:40)
	at com.carrotsearch.randomizedtesting.rules.StatementAdapter.evaluate(StatementAdapter.java:36)
	at com.carrotsearch.randomizedtesting.rules.StatementAdapter.evaluate(StatementAdapter.java:36)
	at com.carrotsearch.randomizedtesting.rules.StatementAdapter.evaluate(StatementAdapter.java:36)
	at org.apache.lucene.util.TestRuleAssertionsRequired$1.evaluate(TestRuleAssertionsRequired.java:53)
	at org.apache.lucene.util.TestRuleMarkFailure$1.evaluate(TestRuleMarkFailure.java:47)
	at org.apache.lucene.util.TestRuleIgnoreAfterMaxFailures$1.evaluate(TestRuleIgnoreAfterMaxFailures.java:64)
	at org.apache.lucene.util.TestRuleIgnoreTestSuites$1.evaluate(TestRuleIgnoreTestSuites.java:54)
	at com.carrotsearch.randomizedtesting.rules.StatementAdapter.evaluate(StatementAdapter.java:36)
	at com.carrotsearch.randomizedtesting.ThreadLeakControl$StatementRunner.run(ThreadLeakControl.java:368)
	at java.lang.Thread.run(Thread.java:748)
Caused by: org.apache.solr.api.ApiBag$ExceptionWithErrObject: Error in command payload
	at org.apache.solr.api.ApiBag.getCommandOperations(ApiBag.java:320)
	at org.apache.solr.handler.admin.TestCollectionAPIs$1.getCommands(TestCollectionAPIs.java:173)
	at org.apache.solr.handler.admin.BaseHandlerApiSupport$1.call(BaseHandlerApiSupport.java:84)
	at org.apache.solr.handler.admin.TestCollectionAPIs.makeCall(TestCollectionAPIs.java:187)
	... 41 more




Build Log:
[...truncated 12931 lines...]
   [junit4] Suite: org.apache.solr.handler.admin.TestCollectionAPIs
   [junit4]   2> Creating dataDir: /home/jenkins/workspace/Lucene-Solr-master-Linux/solr/build/solr-core/test/J2/temp/solr.handler.admin.TestCollectionAPIs_4D398EDCF379C9FA-001/init-core-data-001
   [junit4]   2> 1872491 WARN  (SUITE-TestCollectionAPIs-seed#[4D398EDCF379C9FA]-worker)
[    ] o.a.s.SolrTestCaseJ4 startTrackingSearchers: numOpens=18 numCloses=18
   [junit4]   2> 1872491 INFO  (SUITE-TestCollectionAPIs-seed#[4D398EDCF379C9FA]-worker)
[    ] o.a.s.SolrTestCaseJ4 Using TrieFields
   [junit4]   2> 1872493 INFO  (SUITE-TestCollectionAPIs-seed#[4D398EDCF379C9FA]-worker)
[    ] o.a.s.SolrTestCaseJ4 Randomized ssl (true) and clientAuth (false) via: @org.apache.solr.util.RandomizeSSL(reason=,
ssl=NaN, value=NaN, clientAuth=NaN)
   [junit4]   2> 1872495 INFO  (TEST-TestCollectionAPIs.testCommands-seed#[4D398EDCF379C9FA])
[    ] o.a.s.SolrTestCaseJ4 ###Starting testCommands
   [junit4]   2> 1872514 INFO  (TEST-TestCollectionAPIs.testCommands-seed#[4D398EDCF379C9FA])
[    ] o.a.s.SolrTestCaseJ4 ###Ending testCommands
   [junit4]   2> NOTE: reproduce with: ant test  -Dtestcase=TestCollectionAPIs -Dtests.method=testCommands
-Dtests.seed=4D398EDCF379C9FA -Dtests.multiplier=3 -Dtests.slow=true -Dtests.locale=da -Dtests.timezone=America/Monterrey
-Dtests.asserts=true -Dtests.file.encoding=US-ASCII
   [junit4] ERROR   0.02s J2 | TestCollectionAPIs.testCommands <<<
   [junit4]    > Throwable #1: java.lang.RuntimeException: Error in command payload[{
   [junit4]    >     "modify":{
   [junit4]    >       "rule":"replica:*,cores:<5",
   [junit4]    >       "autoAddReplicas":false},
   [junit4]    >     "errorMessages":["Value is not valid, expected one of: [ARRAY], found:
String"]}]
   [junit4]    > 	at __randomizedtesting.SeedInfo.seed([4D398EDCF379C9FA:6C0547249943299E]:0)
   [junit4]    > 	at org.apache.solr.handler.admin.TestCollectionAPIs.makeCall(TestCollectionAPIs.java:189)
   [junit4]    > 	at org.apache.solr.handler.admin.TestCollectionAPIs.compareOutput(TestCollectionAPIs.java:148)
   [junit4]    > 	at org.apache.solr.handler.admin.TestCollectionAPIs.testCommands(TestCollectionAPIs.java:120)
   [junit4]    > 	at java.lang.Thread.run(Thread.java:748)
   [junit4]    > Caused by: org.apache.solr.api.ApiBag$ExceptionWithErrObject: Error in
command payload
   [junit4]    > 	at org.apache.solr.api.ApiBag.getCommandOperations(ApiBag.java:320)
   [junit4]    > 	at org.apache.solr.handler.admin.TestCollectionAPIs$1.getCommands(TestCollectionAPIs.java:173)
   [junit4]    > 	at org.apache.solr.handler.admin.BaseHandlerApiSupport$1.call(BaseHandlerApiSupport.java:84)
   [junit4]    > 	at org.apache.solr.handler.admin.TestCollectionAPIs.makeCall(TestCollectionAPIs.java:187)
   [junit4]    > 	... 41 more
   [junit4]   2> 1872516 INFO  (SUITE-TestCollectionAPIs-seed#[4D398EDCF379C9FA]-worker)
[    ] o.a.s.SolrTestCaseJ4 ###deleteCore
   [junit4]   2> NOTE: leaving temporary files on disk at: /home/jenkins/workspace/Lucene-Solr-master-Linux/solr/build/solr-core/test/J2/temp/solr.handler.admin.TestCollectionAPIs_4D398EDCF379C9FA-001
   [junit4]   2> NOTE: test params are: codec=Asserting(Lucene70): {}, docValues:{}, maxPointsInLeafNode=778,
maxMBSortInHeap=6.909435655595123, sim=RandomSimilarity(queryNorm=true): {}, locale=da, timezone=America/Monterrey
   [junit4]   2> NOTE: Linux 4.4.0-75-generic i386/Oracle Corporation 1.8.0_131 (32-bit)/cpus=12,threads=1,free=301677896,total=536870912
   [junit4]   2> NOTE: All tests run in this JVM: [BlockJoinFacetDistribTest, ExplicitHLLTest,
TestSolrQueryResponse, DebugComponentTest, RuleEngineTest, JavabinLoaderTest, TestSolrQueryParser,
TestSolrFieldCacheBean, TestSubQueryTransformerCrossCore, SolrCloudExampleTest, LargeFieldTest,
ZkStateReaderTest, CoreSorterTest, SolrCloudReportersTest, TestIndexingPerformance, PropertiesRequestHandlerTest,
AnalysisErrorHandlingTest, SolrMetricReporterTest, TestComponentsName, TestMiniSolrCloudClusterSSL,
TestInPlaceUpdatesStandalone, TestHdfsBackupRestoreCore, XmlUpdateRequestHandlerTest, TestSolrConfigHandlerCloud,
TestConfig, TestQuerySenderNoQuery, TestRequestForwarding, TestDynamicFieldResource, TestRandomRequestDistribution,
DateFieldTest, RemoteQueryErrorTest, CollectionTooManyReplicasTest, ParsingFieldUpdateProcessorsTest,
HdfsWriteToMultipleCollectionsTest, CurrencyFieldXmlFileTest, SpatialRPTFieldTypeTest, TestAuthorizationFramework,
CloudExitableDirectoryReaderTest, DistributedFacetPivotLongTailTest, TestSolrCloudWithHadoopAuthPlugin,
TestCloudPivotFacet, TestHalfAndHalfDocValues, TestGroupingSearch, DistributedSuggestComponentTest,
SimpleFacetsTest, ChangedSchemaMergeTest, TestComplexPhraseLeadingWildcard, TestReloadDeadlock,
TemplateUpdateProcessorTest, SuggesterTSTTest, PeerSyncWithIndexFingerprintCachingTest, TestTestInjection,
BasicDistributedZk2Test, DistributedFacetPivotWhiteBoxTest, OutputWriterTest, HttpPartitionTest,
ClusterStateTest, OverseerTaskQueueTest, BufferStoreTest, SortSpecParsingTest, TestCloudDeleteByQuery,
TestExtendedDismaxParser, TestDynamicLoading, TestDistributedMissingSort, HardAutoCommitTest,
EchoParamsTest, TestBlendedInfixSuggestions, RequestLoggingTest, ReplicaListTransformerTest,
TestLMDirichletSimilarityFactory, DeleteLastCustomShardedReplicaTest, TestSchemalessBufferedUpdates,
TestPHPSerializedResponseWriter, TestBinaryResponseWriter, DocValuesMultiTest, BadIndexSchemaTest,
TestDeleteCollectionOnDownNodes, BinaryUpdateRequestHandlerTest, DistributedVersionInfoTest,
TestReload, TestRecovery, TestSegmentSorting, TestIndexSearcher, StatelessScriptUpdateProcessorFactoryTest,
TestSolrDeletionPolicy1, ExternalFileFieldSortTest, TestConfigSetsAPIExclusivity, TestTolerantUpdateProcessorCloud,
GraphQueryTest, SynonymTokenizerTest, DeleteShardTest, FieldAnalysisRequestHandlerTest, DistributedExpandComponentTest,
TestEmbeddedSolrServerSchemaAPI, RequestHandlersTest, CloudMLTQParserTest, DirectUpdateHandlerTest,
CloneFieldUpdateProcessorFactoryTest, ConjunctionSolrSpellCheckerTest, FieldMutatingUpdateProcessorTest,
TestHashQParserPlugin, HdfsRecoveryZkTest, HdfsThreadLeakTest, TestCollationField, TestStressCloudBlindAtomicUpdates,
TestSmileRequest, TestClusterProperties, CircularListTest, TestScoreJoinQPNoScore, TestHighFrequencyDictionaryFactory,
TestFieldCacheSort, OutOfBoxZkACLAndCredentialsProvidersTest, V2ApiIntegrationTest, AutoCommitTest,
UnloadDistributedZkTest, OverseerTest, LeaderElectionIntegrationTest, ShardRoutingTest, FullSolrCloudDistribCmdsTest,
TestRandomFaceting, LeaderElectionTest, TestFaceting, TestHashPartitioner, TestRealTimeGet,
StatsComponentTest, ConvertedLegacyTest, TestFiltering, SolrRequestParserTest, DocValuesTest,
SortByFunctionTest, CacheHeaderTest, DisMaxRequestHandlerTest, TestQueryUtils, StandardRequestHandlerTest,
TestReversedWildcardFilterFactory, PrimitiveFieldTypeTest, TermsComponentTest, DocumentBuilderTest,
MoreLikeThisHandlerTest, IndexSchemaRuntimeFieldTest, RegexBoostProcessorTest, ReturnFieldsTest,
TestCSVResponseWriter, TestAnalyzedSuggestions, HighlighterConfigTest, SOLR749Test, UpdateParamsTest,
SolrIndexConfigTest, TestMergePolicyConfig, MultiTermTest, TestDocSet, TestBinaryField, NumericFieldsTest,
MinimalSchemaTest, TestFuzzyAnalyzedSuggestions, TestSolrCoreProperties, TestLuceneMatchVersion,
TestPhraseSuggestions, SpellPossibilityIteratorTest, TestCodecSupport, TestXIncludeConfig,
TestIBSimilarityFactory, TestFastWriter, TimeZoneUtilsTest, TestFastOutputStream, ScriptEngineTest,
OpenExchangeRatesOrgProviderTest, URLClassifyProcessorTest, PluginInfoTest, DateMathParserTest,
ChaosMonkeyNothingIsSafeTest, SolrTestCaseJ4Test, TestCrossCoreJoin, TestHighlightDedupGrouping,
ActionThrottleTest, AssignTest, AsyncCallRequestStatusResponseTest, CdcrReplicationDistributedZkTest,
CdcrVersionReplicationTest, CleanupOldIndexTest, ConcurrentDeleteAndCreateCollectionTest,
CreateCollectionCleanupTest, DistribCursorPagingTest, LeaderFailureAfterFreshStartTest, MigrateRouteKeyTest,
OverriddenZkACLAndCredentialsProvidersTest, OverseerModifyCollectionTest, PeerSyncReplicationTest,
RestartWhileUpdatingTest, RollingRestartTest, SharedFSAutoReplicaFailoverTest, SharedFSAutoReplicaFailoverUtilsTest,
SimpleCollectionCreateDeleteTest, TestCloudJSONFacetJoinDomain, TestConfigSetsAPIZkFailure,
TestExclusionRuleCollectionAccess, TestHdfsCloudBackupRestore, TestLeaderElectionZkExpiry,
TestLockTree, TestOnReconnectListenerSupport, TestSSLRandomization, TestSizeLimitedDistributedMap,
TestSolrCloudWithKerberosAlt, TestTolerantUpdateProcessorRandomCloud, VMParamsZkACLAndCredentialsProvidersTest,
HdfsBasicDistributedZkTest, HdfsCollectionsAPIDistributedZkTest, HdfsNNFailoverTest, HdfsSyncSliceTest,
HdfsTlogReplayBufferedWhileIndexingTest, HdfsUnloadDistributedZkTest, StressHdfsTest, RulesTest,
TestInitParams, TestSolrConfigHandler, TestSolrCoreSnapshots, TestReqParamsAPI, TestRestoreCore,
CoreAdminCreateDiscoverTest, CoreMergeIndexesAdminHandlerTest, SecurityConfHandlerTest, StatsReloadRaceTest,
TestCollectionAPIs]
   [junit4] Completed [577/709 (1!)] on J2 in 0.04s, 1 test, 1 error <<< FAILURES!

[...truncated 39853 lines...]

Mime
View raw message