lucene-dev mailing list archives

Site index · List index
Message view « Date » · « Thread »
Top « Date » · « Thread »
From Policeman Jenkins Server <jenk...@thetaphi.de>
Subject [JENKINS] Lucene-Solr-master-Linux (64bit/jdk1.8.0_131) - Build # 19560 - Still Unstable!
Date Fri, 05 May 2017 13:38:05 GMT
Build: https://jenkins.thetaphi.de/job/Lucene-Solr-master-Linux/19560/
Java: 64bit/jdk1.8.0_131 -XX:+UseCompressedOops -XX:+UseSerialGC

1 tests failed.
FAILED:  org.apache.solr.update.processor.UpdateRequestProcessorFactoryTest.testRequestTimeUrp

Error Message:
No such processor Template

Stack Trace:
org.apache.solr.common.SolrException: No such processor Template
	at __randomizedtesting.SeedInfo.seed([438011F81EBE2EB1:E6325130B8F0E745]:0)
	at org.apache.solr.update.processor.UpdateRequestProcessorChain.getReqProcessors(UpdateRequestProcessorChain.java:286)
	at org.apache.solr.update.processor.UpdateRequestProcessorChain.constructChain(UpdateRequestProcessorChain.java:235)
	at org.apache.solr.core.SolrCore.getUpdateProcessorChain(SolrCore.java:1446)
	at org.apache.solr.update.processor.UpdateRequestProcessorFactoryTest.testRequestTimeUrp(UpdateRequestProcessorFactoryTest.java:53)
	at sun.reflect.NativeMethodAccessorImpl.invoke0(Native Method)
	at sun.reflect.NativeMethodAccessorImpl.invoke(NativeMethodAccessorImpl.java:62)
	at sun.reflect.DelegatingMethodAccessorImpl.invoke(DelegatingMethodAccessorImpl.java:43)
	at java.lang.reflect.Method.invoke(Method.java:498)
	at com.carrotsearch.randomizedtesting.RandomizedRunner.invoke(RandomizedRunner.java:1713)
	at com.carrotsearch.randomizedtesting.RandomizedRunner$8.evaluate(RandomizedRunner.java:907)
	at com.carrotsearch.randomizedtesting.RandomizedRunner$9.evaluate(RandomizedRunner.java:943)
	at com.carrotsearch.randomizedtesting.RandomizedRunner$10.evaluate(RandomizedRunner.java:957)
	at com.carrotsearch.randomizedtesting.rules.SystemPropertiesRestoreRule$1.evaluate(SystemPropertiesRestoreRule.java:57)
	at org.apache.lucene.util.TestRuleSetupTeardownChained$1.evaluate(TestRuleSetupTeardownChained.java:49)
	at org.apache.lucene.util.AbstractBeforeAfterRule$1.evaluate(AbstractBeforeAfterRule.java:45)
	at org.apache.lucene.util.TestRuleThreadAndTestName$1.evaluate(TestRuleThreadAndTestName.java:48)
	at org.apache.lucene.util.TestRuleIgnoreAfterMaxFailures$1.evaluate(TestRuleIgnoreAfterMaxFailures.java:64)
	at org.apache.lucene.util.TestRuleMarkFailure$1.evaluate(TestRuleMarkFailure.java:47)
	at com.carrotsearch.randomizedtesting.rules.StatementAdapter.evaluate(StatementAdapter.java:36)
	at com.carrotsearch.randomizedtesting.ThreadLeakControl$StatementRunner.run(ThreadLeakControl.java:368)
	at com.carrotsearch.randomizedtesting.ThreadLeakControl.forkTimeoutingTask(ThreadLeakControl.java:817)
	at com.carrotsearch.randomizedtesting.ThreadLeakControl$3.evaluate(ThreadLeakControl.java:468)
	at com.carrotsearch.randomizedtesting.RandomizedRunner.runSingleTest(RandomizedRunner.java:916)
	at com.carrotsearch.randomizedtesting.RandomizedRunner$5.evaluate(RandomizedRunner.java:802)
	at com.carrotsearch.randomizedtesting.RandomizedRunner$6.evaluate(RandomizedRunner.java:852)
	at com.carrotsearch.randomizedtesting.RandomizedRunner$7.evaluate(RandomizedRunner.java:863)
	at com.carrotsearch.randomizedtesting.rules.StatementAdapter.evaluate(StatementAdapter.java:36)
	at com.carrotsearch.randomizedtesting.rules.SystemPropertiesRestoreRule$1.evaluate(SystemPropertiesRestoreRule.java:57)
	at org.apache.lucene.util.AbstractBeforeAfterRule$1.evaluate(AbstractBeforeAfterRule.java:45)
	at com.carrotsearch.randomizedtesting.rules.StatementAdapter.evaluate(StatementAdapter.java:36)
	at org.apache.lucene.util.TestRuleStoreClassName$1.evaluate(TestRuleStoreClassName.java:41)
	at com.carrotsearch.randomizedtesting.rules.NoShadowingOrOverridesOnMethodsRule$1.evaluate(NoShadowingOrOverridesOnMethodsRule.java:40)
	at com.carrotsearch.randomizedtesting.rules.NoShadowingOrOverridesOnMethodsRule$1.evaluate(NoShadowingOrOverridesOnMethodsRule.java:40)
	at com.carrotsearch.randomizedtesting.rules.StatementAdapter.evaluate(StatementAdapter.java:36)
	at com.carrotsearch.randomizedtesting.rules.StatementAdapter.evaluate(StatementAdapter.java:36)
	at com.carrotsearch.randomizedtesting.rules.StatementAdapter.evaluate(StatementAdapter.java:36)
	at org.apache.lucene.util.TestRuleAssertionsRequired$1.evaluate(TestRuleAssertionsRequired.java:53)
	at org.apache.lucene.util.TestRuleMarkFailure$1.evaluate(TestRuleMarkFailure.java:47)
	at org.apache.lucene.util.TestRuleIgnoreAfterMaxFailures$1.evaluate(TestRuleIgnoreAfterMaxFailures.java:64)
	at org.apache.lucene.util.TestRuleIgnoreTestSuites$1.evaluate(TestRuleIgnoreTestSuites.java:54)
	at com.carrotsearch.randomizedtesting.rules.StatementAdapter.evaluate(StatementAdapter.java:36)
	at com.carrotsearch.randomizedtesting.ThreadLeakControl$StatementRunner.run(ThreadLeakControl.java:368)
	at java.lang.Thread.run(Thread.java:748)




Build Log:
[...truncated 11441 lines...]
   [junit4] Suite: org.apache.solr.update.processor.UpdateRequestProcessorFactoryTest
   [junit4]   2> Creating dataDir: /home/jenkins/workspace/Lucene-Solr-master-Linux/solr/build/solr-core/test/J1/temp/solr.update.processor.UpdateRequestProcessorFactoryTest_438011F81EBE2EB1-001/init-core-data-001
   [junit4]   2> 419935 WARN  (SUITE-UpdateRequestProcessorFactoryTest-seed#[438011F81EBE2EB1]-worker)
[    ] o.a.s.SolrTestCaseJ4 startTrackingSearchers: numOpens=2 numCloses=2
   [junit4]   2> 419935 INFO  (SUITE-UpdateRequestProcessorFactoryTest-seed#[438011F81EBE2EB1]-worker)
[    ] o.a.s.SolrTestCaseJ4 Using TrieFields
   [junit4]   2> 419937 INFO  (SUITE-UpdateRequestProcessorFactoryTest-seed#[438011F81EBE2EB1]-worker)
[    ] o.a.s.SolrTestCaseJ4 Randomized ssl (false) and clientAuth (true) via: @org.apache.solr.util.RandomizeSSL(reason=,
ssl=NaN, value=NaN, clientAuth=NaN)
   [junit4]   2> 419937 INFO  (SUITE-UpdateRequestProcessorFactoryTest-seed#[438011F81EBE2EB1]-worker)
[    ] o.a.s.SolrTestCaseJ4 ####initCore
   [junit4]   2> 419938 INFO  (SUITE-UpdateRequestProcessorFactoryTest-seed#[438011F81EBE2EB1]-worker)
[    ] o.a.s.c.SolrResourceLoader [null] Added 2 libs to classloader, from paths: [/home/jenkins/workspace/Lucene-Solr-master-Linux/solr/core/src/test-files/solr/collection1/lib,
/home/jenkins/workspace/Lucene-Solr-master-Linux/solr/core/src/test-files/solr/collection1/lib/classes]
   [junit4]   2> 419956 WARN  (SUITE-UpdateRequestProcessorFactoryTest-seed#[438011F81EBE2EB1]-worker)
[    ] o.a.s.c.Config Beginning with Solr 5.5, <mergePolicy> is deprecated, use <mergePolicyFactory>
instead.
   [junit4]   2> 419957 INFO  (SUITE-UpdateRequestProcessorFactoryTest-seed#[438011F81EBE2EB1]-worker)
[    ] o.a.s.c.SolrConfig Using Lucene MatchVersion: 7.0.0
   [junit4]   2> 419990 INFO  (SUITE-UpdateRequestProcessorFactoryTest-seed#[438011F81EBE2EB1]-worker)
[    ] o.a.s.s.IndexSchema [null] Schema name=test
   [junit4]   2> 420116 INFO  (SUITE-UpdateRequestProcessorFactoryTest-seed#[438011F81EBE2EB1]-worker)
[    ] o.a.s.s.IndexSchema Loaded schema test/1.0 with uniqueid field id
   [junit4]   2> 420156 INFO  (SUITE-UpdateRequestProcessorFactoryTest-seed#[438011F81EBE2EB1]-worker)
[    ] o.a.s.m.r.SolrJmxReporter JMX monitoring for 'solr.node' (registry 'solr.node') enabled
at server: com.sun.jmx.mbeanserver.JmxMBeanServer@48570ca3
   [junit4]   2> 420161 INFO  (SUITE-UpdateRequestProcessorFactoryTest-seed#[438011F81EBE2EB1]-worker)
[    ] o.a.s.m.r.SolrJmxReporter JMX monitoring for 'solr.jvm' (registry 'solr.jvm') enabled
at server: com.sun.jmx.mbeanserver.JmxMBeanServer@48570ca3
   [junit4]   2> 420161 INFO  (SUITE-UpdateRequestProcessorFactoryTest-seed#[438011F81EBE2EB1]-worker)
[    ] o.a.s.m.r.SolrJmxReporter JMX monitoring for 'solr.jetty' (registry 'solr.jetty') enabled
at server: com.sun.jmx.mbeanserver.JmxMBeanServer@48570ca3
   [junit4]   2> 420163 INFO  (coreLoadExecutor-1202-thread-1) [    x:collection1] o.a.s.c.SolrResourceLoader
[null] Added 2 libs to classloader, from paths: [/home/jenkins/workspace/Lucene-Solr-master-Linux/solr/core/src/test-files/solr/collection1/lib,
/home/jenkins/workspace/Lucene-Solr-master-Linux/solr/core/src/test-files/solr/collection1/lib/classes]
   [junit4]   2> 420184 WARN  (coreLoadExecutor-1202-thread-1) [    x:collection1] o.a.s.c.Config
Beginning with Solr 5.5, <mergePolicy> is deprecated, use <mergePolicyFactory>
instead.
   [junit4]   2> 420184 INFO  (coreLoadExecutor-1202-thread-1) [    x:collection1] o.a.s.c.SolrConfig
Using Lucene MatchVersion: 7.0.0
   [junit4]   2> 420193 INFO  (coreLoadExecutor-1202-thread-1) [    x:collection1] o.a.s.s.IndexSchema
[collection1] Schema name=test
   [junit4]   2> 420282 INFO  (coreLoadExecutor-1202-thread-1) [    x:collection1] o.a.s.s.IndexSchema
Loaded schema test/1.0 with uniqueid field id
   [junit4]   2> 420287 INFO  (coreLoadExecutor-1202-thread-1) [    x:collection1] o.a.s.c.CoreContainer
Creating SolrCore 'collection1' using configuration from instancedir /home/jenkins/workspace/Lucene-Solr-master-Linux/solr/core/src/test-files/solr/collection1,
trusted=true
   [junit4]   2> 420287 INFO  (coreLoadExecutor-1202-thread-1) [    x:collection1] o.a.s.m.r.SolrJmxReporter
JMX monitoring for 'solr.core.collection1' (registry 'solr.core.collection1') enabled at server:
com.sun.jmx.mbeanserver.JmxMBeanServer@48570ca3
   [junit4]   2> 420288 INFO  (coreLoadExecutor-1202-thread-1) [    x:collection1] o.a.s.c.SolrCore
solr.RecoveryStrategy.Builder
   [junit4]   2> 420288 INFO  (coreLoadExecutor-1202-thread-1) [    x:collection1] o.a.s.c.SolrCore
[[collection1] ] Opening new SolrCore at [/home/jenkins/workspace/Lucene-Solr-master-Linux/solr/core/src/test-files/solr/collection1],
dataDir=[/home/jenkins/workspace/Lucene-Solr-master-Linux/solr/build/solr-core/test/J1/temp/solr.update.processor.UpdateRequestProcessorFactoryTest_438011F81EBE2EB1-001/init-core-data-001/]
   [junit4]   2> 420289 INFO  (coreLoadExecutor-1202-thread-1) [    x:collection1] o.a.s.u.RandomMergePolicy
RandomMergePolicy wrapping class org.apache.lucene.index.TieredMergePolicy: [TieredMergePolicy:
maxMergeAtOnce=42, maxMergeAtOnceExplicit=34, maxMergedSegmentMB=10.984375, floorSegmentMB=1.9267578125,
forceMergeDeletesPctAllowed=15.432066727659281, segmentsPerTier=43.0, maxCFSSegmentSizeMB=8.796093022207999E12,
noCFSRatio=1.0
   [junit4]   2> 420343 WARN  (coreLoadExecutor-1202-thread-1) [    x:collection1] o.a.s.c.RequestHandlers
no default request handler is registered (either '/select' or 'standard')
   [junit4]   2> 420343 INFO  (coreLoadExecutor-1202-thread-1) [    x:collection1] o.a.s.u.CommitTracker
Hard AutoCommit: disabled
   [junit4]   2> 420343 INFO  (coreLoadExecutor-1202-thread-1) [    x:collection1] o.a.s.u.CommitTracker
Soft AutoCommit: disabled
   [junit4]   2> 420345 INFO  (coreLoadExecutor-1202-thread-1) [    x:collection1] o.a.s.u.RandomMergePolicy
RandomMergePolicy wrapping class org.apache.lucene.index.TieredMergePolicy: [TieredMergePolicy:
maxMergeAtOnce=28, maxMergeAtOnceExplicit=38, maxMergedSegmentMB=0.9619140625, floorSegmentMB=0.8193359375,
forceMergeDeletesPctAllowed=1.6235812769377012, segmentsPerTier=23.0, maxCFSSegmentSizeMB=8.796093022207999E12,
noCFSRatio=0.22071252862363738
   [junit4]   2> 420345 INFO  (coreLoadExecutor-1202-thread-1) [    x:collection1] o.a.s.s.SolrIndexSearcher
Opening [Searcher@48feda1f[collection1] main]
   [junit4]   2> 420345 WARN  (coreLoadExecutor-1202-thread-1) [    x:collection1] o.a.s.r.ManagedResourceStorage
Cannot write to config directory /home/jenkins/workspace/Lucene-Solr-master-Linux/solr/core/src/test-files/solr/collection1/conf;
switching to use InMemory storage instead.
   [junit4]   2> 420346 INFO  (coreLoadExecutor-1202-thread-1) [    x:collection1] o.a.s.h.ReplicationHandler
Commits will be reserved for  10000
   [junit4]   2> 420347 INFO  (SUITE-UpdateRequestProcessorFactoryTest-seed#[438011F81EBE2EB1]-worker)
[    ] o.a.s.SolrTestCaseJ4 ####initCore end
   [junit4]   2> 420349 INFO  (searcherExecutor-1203-thread-1-processing-x:collection1)
[    x:collection1] o.a.s.c.SolrCore [collection1] Registered new searcher Searcher@48feda1f[collection1]
main{ExitableDirectoryReader(UninvertingDirectoryReader())}
   [junit4]   2> 420350 INFO  (TEST-UpdateRequestProcessorFactoryTest.testRequestTimeUrp-seed#[438011F81EBE2EB1])
[    ] o.a.s.SolrTestCaseJ4 ###Starting testRequestTimeUrp
   [junit4]   2> 420351 WARN  (TEST-UpdateRequestProcessorFactoryTest.testRequestTimeUrp-seed#[438011F81EBE2EB1])
[    ] o.a.s.c.PluginBag runtime library loading is not enabled, start Solr with -Denable.runtime.lib=true
   [junit4]   2> 420352 INFO  (TEST-UpdateRequestProcessorFactoryTest.testRequestTimeUrp-seed#[438011F81EBE2EB1])
[    ] o.a.s.SolrTestCaseJ4 ###Ending testRequestTimeUrp
   [junit4]   2> NOTE: reproduce with: ant test  -Dtestcase=UpdateRequestProcessorFactoryTest
-Dtests.method=testRequestTimeUrp -Dtests.seed=438011F81EBE2EB1 -Dtests.multiplier=3 -Dtests.slow=true
-Dtests.locale=fi -Dtests.timezone=Africa/Monrovia -Dtests.asserts=true -Dtests.file.encoding=UTF-8
   [junit4] ERROR   0.01s J1 | UpdateRequestProcessorFactoryTest.testRequestTimeUrp <<<
   [junit4]    > Throwable #1: org.apache.solr.common.SolrException: No such processor
Template
   [junit4]    > 	at __randomizedtesting.SeedInfo.seed([438011F81EBE2EB1:E6325130B8F0E745]:0)
   [junit4]    > 	at org.apache.solr.update.processor.UpdateRequestProcessorChain.getReqProcessors(UpdateRequestProcessorChain.java:286)
   [junit4]    > 	at org.apache.solr.update.processor.UpdateRequestProcessorChain.constructChain(UpdateRequestProcessorChain.java:235)
   [junit4]    > 	at org.apache.solr.core.SolrCore.getUpdateProcessorChain(SolrCore.java:1446)
   [junit4]    > 	at org.apache.solr.update.processor.UpdateRequestProcessorFactoryTest.testRequestTimeUrp(UpdateRequestProcessorFactoryTest.java:53)
   [junit4]    > 	at java.lang.Thread.run(Thread.java:748)
   [junit4]   2> 420354 INFO  (TEST-UpdateRequestProcessorFactoryTest.testUpdateDistribChainSkipping-seed#[438011F81EBE2EB1])
[    ] o.a.s.SolrTestCaseJ4 ###Starting testUpdateDistribChainSkipping
   [junit4]   2> 420358 INFO  (TEST-UpdateRequestProcessorFactoryTest.testUpdateDistribChainSkipping-seed#[438011F81EBE2EB1])
[    ] o.a.s.SolrTestCaseJ4 ###Ending testUpdateDistribChainSkipping
   [junit4]   2> 420364 INFO  (TEST-UpdateRequestProcessorFactoryTest.testConfiguration-seed#[438011F81EBE2EB1])
[    ] o.a.s.SolrTestCaseJ4 ###Starting testConfiguration
   [junit4]   2> 420365 INFO  (TEST-UpdateRequestProcessorFactoryTest.testConfiguration-seed#[438011F81EBE2EB1])
[    ] o.a.s.SolrTestCaseJ4 ###Ending testConfiguration
   [junit4]   2> 420365 INFO  (SUITE-UpdateRequestProcessorFactoryTest-seed#[438011F81EBE2EB1]-worker)
[    ] o.a.s.SolrTestCaseJ4 ###deleteCore
   [junit4]   2> 420365 INFO  (SUITE-UpdateRequestProcessorFactoryTest-seed#[438011F81EBE2EB1]-worker)
[    ] o.a.s.c.CoreContainer Shutting down CoreContainer instance=2126155555
   [junit4]   2> 420365 INFO  (SUITE-UpdateRequestProcessorFactoryTest-seed#[438011F81EBE2EB1]-worker)
[    ] o.a.s.m.SolrMetricManager Closing metric reporters for registry=solr.node, tag=null
   [junit4]   2> 420366 INFO  (SUITE-UpdateRequestProcessorFactoryTest-seed#[438011F81EBE2EB1]-worker)
[    ] o.a.s.m.SolrMetricManager Closing metric reporters for registry=solr.jvm, tag=null
   [junit4]   2> 420367 INFO  (SUITE-UpdateRequestProcessorFactoryTest-seed#[438011F81EBE2EB1]-worker)
[    ] o.a.s.m.SolrMetricManager Closing metric reporters for registry=solr.jetty, tag=null
   [junit4]   2> 420367 INFO  (SUITE-UpdateRequestProcessorFactoryTest-seed#[438011F81EBE2EB1]-worker)
[    ] o.a.s.c.TransientSolrCoreCacheDefault Allocating transient cache for 2147483647 transient
cores
   [junit4]   2> 420367 INFO  (coreCloseExecutor-1207-thread-1) [    x:collection1] o.a.s.c.SolrCore
[collection1]  CLOSING SolrCore org.apache.solr.core.SolrCore@2a42a10b
   [junit4]   2> 420369 INFO  (coreCloseExecutor-1207-thread-1) [    x:collection1] o.a.s.m.SolrMetricManager
Closing metric reporters for registry=solr.core.collection1, tag=709009675
   [junit4]   2> NOTE: leaving temporary files on disk at: /home/jenkins/workspace/Lucene-Solr-master-Linux/solr/build/solr-core/test/J1/temp/solr.update.processor.UpdateRequestProcessorFactoryTest_438011F81EBE2EB1-001
   [junit4]   2> NOTE: test params are: codec=Asserting(Lucene70): {}, docValues:{}, maxPointsInLeafNode=941,
maxMBSortInHeap=7.340093742400958, sim=RandomSimilarity(queryNorm=true): {}, locale=fi, timezone=Africa/Monrovia
   [junit4]   2> NOTE: Linux 4.4.0-75-generic amd64/Oracle Corporation 1.8.0_131 (64-bit)/cpus=12,threads=1,free=196411904,total=508952576
   [junit4]   2> NOTE: All tests run in this JVM: [TestInitQParser, SliceStateTest, ScriptEngineTest,
TestPushWriter, TestUpdate, UpdateLogTest, IndexSchemaTest, TestDistributedGrouping, SchemaVersionSpecificBehaviorTest,
TestUseDocValuesAsStored, TestCloudRecovery, SOLR749Test, BadComponentTest, DirectSolrConnectionTest,
TestPerFieldSimilarity, ShardRoutingTest, TestBinaryResponseWriter, TestStressRecovery, TestSSLRandomization,
SolrInfoBeanTest, SuggesterFSTTest, TestBulkSchemaConcurrent, ChaosMonkeySafeLeaderTest, TestRTimerTree,
TestAuthenticationFramework, MoreLikeThisHandlerTest, TestFieldCacheSortRandom, TestCloudJSONFacetJoinDomain,
TestDynamicFieldResource, IndexBasedSpellCheckerTest, UpdateRequestProcessorFactoryTest]
   [junit4] Completed [130/709 (1!)] on J1 in 0.45s, 3 tests, 1 error <<< FAILURES!

[...truncated 45241 lines...]

Mime
View raw message