lucene-dev mailing list archives

Site index · List index
Message view « Date » · « Thread »
Top « Date » · « Thread »
From Policeman Jenkins Server <jenk...@thetaphi.de>
Subject [JENKINS] Lucene-Solr-6.x-Linux (64bit/jdk1.8.0_131) - Build # 3625 - Still Unstable!
Date Tue, 30 May 2017 22:16:34 GMT
Build: https://jenkins.thetaphi.de/job/Lucene-Solr-6.x-Linux/3625/
Java: 64bit/jdk1.8.0_131 -XX:+UseCompressedOops -XX:+UseConcMarkSweepGC

2 tests failed.
FAILED:  org.apache.solr.cloud.TestSolrCloudWithDelegationTokens.testDelegationTokenRenew

Error Message:
expected:<200> but was:<403>

Stack Trace:
java.lang.AssertionError: expected:<200> but was:<403>
	at __randomizedtesting.SeedInfo.seed([8134D2D4AC565D62:B6AF26CA949A80C6]:0)
	at org.junit.Assert.fail(Assert.java:93)
	at org.junit.Assert.failNotEquals(Assert.java:647)
	at org.junit.Assert.assertEquals(Assert.java:128)
	at org.junit.Assert.assertEquals(Assert.java:472)
	at org.junit.Assert.assertEquals(Assert.java:456)
	at org.apache.solr.cloud.TestSolrCloudWithDelegationTokens.renewDelegationToken(TestSolrCloudWithDelegationTokens.java:131)
	at org.apache.solr.cloud.TestSolrCloudWithDelegationTokens.verifyDelegationTokenRenew(TestSolrCloudWithDelegationTokens.java:317)
	at org.apache.solr.cloud.TestSolrCloudWithDelegationTokens.testDelegationTokenRenew(TestSolrCloudWithDelegationTokens.java:334)
	at sun.reflect.NativeMethodAccessorImpl.invoke0(Native Method)
	at sun.reflect.NativeMethodAccessorImpl.invoke(NativeMethodAccessorImpl.java:62)
	at sun.reflect.DelegatingMethodAccessorImpl.invoke(DelegatingMethodAccessorImpl.java:43)
	at java.lang.reflect.Method.invoke(Method.java:498)
	at com.carrotsearch.randomizedtesting.RandomizedRunner.invoke(RandomizedRunner.java:1713)
	at com.carrotsearch.randomizedtesting.RandomizedRunner$8.evaluate(RandomizedRunner.java:907)
	at com.carrotsearch.randomizedtesting.RandomizedRunner$9.evaluate(RandomizedRunner.java:943)
	at com.carrotsearch.randomizedtesting.RandomizedRunner$10.evaluate(RandomizedRunner.java:957)
	at com.carrotsearch.randomizedtesting.rules.SystemPropertiesRestoreRule$1.evaluate(SystemPropertiesRestoreRule.java:57)
	at org.apache.lucene.util.TestRuleSetupTeardownChained$1.evaluate(TestRuleSetupTeardownChained.java:49)
	at org.apache.lucene.util.AbstractBeforeAfterRule$1.evaluate(AbstractBeforeAfterRule.java:45)
	at org.apache.lucene.util.TestRuleThreadAndTestName$1.evaluate(TestRuleThreadAndTestName.java:48)
	at org.apache.lucene.util.TestRuleIgnoreAfterMaxFailures$1.evaluate(TestRuleIgnoreAfterMaxFailures.java:64)
	at org.apache.lucene.util.TestRuleMarkFailure$1.evaluate(TestRuleMarkFailure.java:47)
	at com.carrotsearch.randomizedtesting.rules.StatementAdapter.evaluate(StatementAdapter.java:36)
	at com.carrotsearch.randomizedtesting.ThreadLeakControl$StatementRunner.run(ThreadLeakControl.java:368)
	at com.carrotsearch.randomizedtesting.ThreadLeakControl.forkTimeoutingTask(ThreadLeakControl.java:817)
	at com.carrotsearch.randomizedtesting.ThreadLeakControl$3.evaluate(ThreadLeakControl.java:468)
	at com.carrotsearch.randomizedtesting.RandomizedRunner.runSingleTest(RandomizedRunner.java:916)
	at com.carrotsearch.randomizedtesting.RandomizedRunner$5.evaluate(RandomizedRunner.java:802)
	at com.carrotsearch.randomizedtesting.RandomizedRunner$6.evaluate(RandomizedRunner.java:852)
	at com.carrotsearch.randomizedtesting.RandomizedRunner$7.evaluate(RandomizedRunner.java:863)
	at com.carrotsearch.randomizedtesting.rules.StatementAdapter.evaluate(StatementAdapter.java:36)
	at com.carrotsearch.randomizedtesting.rules.SystemPropertiesRestoreRule$1.evaluate(SystemPropertiesRestoreRule.java:57)
	at org.apache.lucene.util.AbstractBeforeAfterRule$1.evaluate(AbstractBeforeAfterRule.java:45)
	at com.carrotsearch.randomizedtesting.rules.StatementAdapter.evaluate(StatementAdapter.java:36)
	at org.apache.lucene.util.TestRuleStoreClassName$1.evaluate(TestRuleStoreClassName.java:41)
	at com.carrotsearch.randomizedtesting.rules.NoShadowingOrOverridesOnMethodsRule$1.evaluate(NoShadowingOrOverridesOnMethodsRule.java:40)
	at com.carrotsearch.randomizedtesting.rules.NoShadowingOrOverridesOnMethodsRule$1.evaluate(NoShadowingOrOverridesOnMethodsRule.java:40)
	at com.carrotsearch.randomizedtesting.rules.StatementAdapter.evaluate(StatementAdapter.java:36)
	at com.carrotsearch.randomizedtesting.rules.StatementAdapter.evaluate(StatementAdapter.java:36)
	at com.carrotsearch.randomizedtesting.rules.StatementAdapter.evaluate(StatementAdapter.java:36)
	at org.apache.lucene.util.TestRuleAssertionsRequired$1.evaluate(TestRuleAssertionsRequired.java:53)
	at org.apache.lucene.util.TestRuleMarkFailure$1.evaluate(TestRuleMarkFailure.java:47)
	at org.apache.lucene.util.TestRuleIgnoreAfterMaxFailures$1.evaluate(TestRuleIgnoreAfterMaxFailures.java:64)
	at org.apache.lucene.util.TestRuleIgnoreTestSuites$1.evaluate(TestRuleIgnoreTestSuites.java:54)
	at com.carrotsearch.randomizedtesting.rules.StatementAdapter.evaluate(StatementAdapter.java:36)
	at com.carrotsearch.randomizedtesting.ThreadLeakControl$StatementRunner.run(ThreadLeakControl.java:368)
	at java.lang.Thread.run(Thread.java:748)


FAILED:  org.apache.solr.util.TestMaxTokenLenTokenizer.testSingleFieldSameAnalyzers

Error Message:
Exception during query

Stack Trace:
java.lang.RuntimeException: Exception during query
	at __randomizedtesting.SeedInfo.seed([8134D2D4AC565D62:EBE6EDBBF4B58DAD]:0)
	at org.apache.solr.SolrTestCaseJ4.assertQ(SolrTestCaseJ4.java:895)
	at org.apache.solr.util.TestMaxTokenLenTokenizer.testSingleFieldSameAnalyzers(TestMaxTokenLenTokenizer.java:104)
	at sun.reflect.NativeMethodAccessorImpl.invoke0(Native Method)
	at sun.reflect.NativeMethodAccessorImpl.invoke(NativeMethodAccessorImpl.java:62)
	at sun.reflect.DelegatingMethodAccessorImpl.invoke(DelegatingMethodAccessorImpl.java:43)
	at java.lang.reflect.Method.invoke(Method.java:498)
	at com.carrotsearch.randomizedtesting.RandomizedRunner.invoke(RandomizedRunner.java:1713)
	at com.carrotsearch.randomizedtesting.RandomizedRunner$8.evaluate(RandomizedRunner.java:907)
	at com.carrotsearch.randomizedtesting.RandomizedRunner$9.evaluate(RandomizedRunner.java:943)
	at com.carrotsearch.randomizedtesting.RandomizedRunner$10.evaluate(RandomizedRunner.java:957)
	at com.carrotsearch.randomizedtesting.rules.SystemPropertiesRestoreRule$1.evaluate(SystemPropertiesRestoreRule.java:57)
	at org.apache.lucene.util.TestRuleSetupTeardownChained$1.evaluate(TestRuleSetupTeardownChained.java:49)
	at org.apache.lucene.util.AbstractBeforeAfterRule$1.evaluate(AbstractBeforeAfterRule.java:45)
	at org.apache.lucene.util.TestRuleThreadAndTestName$1.evaluate(TestRuleThreadAndTestName.java:48)
	at org.apache.lucene.util.TestRuleIgnoreAfterMaxFailures$1.evaluate(TestRuleIgnoreAfterMaxFailures.java:64)
	at org.apache.lucene.util.TestRuleMarkFailure$1.evaluate(TestRuleMarkFailure.java:47)
	at com.carrotsearch.randomizedtesting.rules.StatementAdapter.evaluate(StatementAdapter.java:36)
	at com.carrotsearch.randomizedtesting.ThreadLeakControl$StatementRunner.run(ThreadLeakControl.java:368)
	at com.carrotsearch.randomizedtesting.ThreadLeakControl.forkTimeoutingTask(ThreadLeakControl.java:817)
	at com.carrotsearch.randomizedtesting.ThreadLeakControl$3.evaluate(ThreadLeakControl.java:468)
	at com.carrotsearch.randomizedtesting.RandomizedRunner.runSingleTest(RandomizedRunner.java:916)
	at com.carrotsearch.randomizedtesting.RandomizedRunner$5.evaluate(RandomizedRunner.java:802)
	at com.carrotsearch.randomizedtesting.RandomizedRunner$6.evaluate(RandomizedRunner.java:852)
	at com.carrotsearch.randomizedtesting.RandomizedRunner$7.evaluate(RandomizedRunner.java:863)
	at com.carrotsearch.randomizedtesting.rules.StatementAdapter.evaluate(StatementAdapter.java:36)
	at com.carrotsearch.randomizedtesting.rules.SystemPropertiesRestoreRule$1.evaluate(SystemPropertiesRestoreRule.java:57)
	at org.apache.lucene.util.AbstractBeforeAfterRule$1.evaluate(AbstractBeforeAfterRule.java:45)
	at com.carrotsearch.randomizedtesting.rules.StatementAdapter.evaluate(StatementAdapter.java:36)
	at org.apache.lucene.util.TestRuleStoreClassName$1.evaluate(TestRuleStoreClassName.java:41)
	at com.carrotsearch.randomizedtesting.rules.NoShadowingOrOverridesOnMethodsRule$1.evaluate(NoShadowingOrOverridesOnMethodsRule.java:40)
	at com.carrotsearch.randomizedtesting.rules.NoShadowingOrOverridesOnMethodsRule$1.evaluate(NoShadowingOrOverridesOnMethodsRule.java:40)
	at com.carrotsearch.randomizedtesting.rules.StatementAdapter.evaluate(StatementAdapter.java:36)
	at com.carrotsearch.randomizedtesting.rules.StatementAdapter.evaluate(StatementAdapter.java:36)
	at com.carrotsearch.randomizedtesting.rules.StatementAdapter.evaluate(StatementAdapter.java:36)
	at org.apache.lucene.util.TestRuleAssertionsRequired$1.evaluate(TestRuleAssertionsRequired.java:53)
	at org.apache.lucene.util.TestRuleMarkFailure$1.evaluate(TestRuleMarkFailure.java:47)
	at org.apache.lucene.util.TestRuleIgnoreAfterMaxFailures$1.evaluate(TestRuleIgnoreAfterMaxFailures.java:64)
	at org.apache.lucene.util.TestRuleIgnoreTestSuites$1.evaluate(TestRuleIgnoreTestSuites.java:54)
	at com.carrotsearch.randomizedtesting.rules.StatementAdapter.evaluate(StatementAdapter.java:36)
	at com.carrotsearch.randomizedtesting.ThreadLeakControl$StatementRunner.run(ThreadLeakControl.java:368)
	at java.lang.Thread.run(Thread.java:748)
Caused by: java.lang.RuntimeException: REQUEST FAILED: xpath=//result[@numFound=1]
	xml response was: <?xml version="1.0" encoding="UTF-8"?>
<response>
<lst name="responseHeader"><int name="status">0</int><int name="QTime">0</int></lst><result name="response" numFound="0" start="0"></result>
</response>

	request was:q=letter0:lett&wt=xml
	at org.apache.solr.SolrTestCaseJ4.assertQ(SolrTestCaseJ4.java:888)
	... 40 more




Build Log:
[...truncated 11192 lines...]
   [junit4] Suite: org.apache.solr.cloud.TestSolrCloudWithDelegationTokens
   [junit4]   2> Creating dataDir: /home/jenkins/workspace/Lucene-Solr-6.x-Linux/solr/build/solr-core/test/J1/temp/solr.cloud.TestSolrCloudWithDelegationTokens_8134D2D4AC565D62-001/init-core-data-001
   [junit4]   2> 178491 WARN  (SUITE-TestSolrCloudWithDelegationTokens-seed#[8134D2D4AC565D62]-worker) [    ] o.a.s.SolrTestCaseJ4 startTrackingSearchers: numOpens=1 numCloses=1
   [junit4]   2> 178491 INFO  (SUITE-TestSolrCloudWithDelegationTokens-seed#[8134D2D4AC565D62]-worker) [    ] o.a.s.SolrTestCaseJ4 Using PointFields
   [junit4]   2> 178492 INFO  (SUITE-TestSolrCloudWithDelegationTokens-seed#[8134D2D4AC565D62]-worker) [    ] o.a.s.SolrTestCaseJ4 Randomized ssl (false) and clientAuth (false) via: @org.apache.solr.SolrTestCaseJ4$SuppressSSL(bugUrl=None)
   [junit4]   2> 178493 INFO  (SUITE-TestSolrCloudWithDelegationTokens-seed#[8134D2D4AC565D62]-worker) [    ] o.a.s.c.MiniSolrCloudCluster Starting cluster of 2 servers in /home/jenkins/workspace/Lucene-Solr-6.x-Linux/solr/build/solr-core/test/J1/temp/solr.cloud.TestSolrCloudWithDelegationTokens_8134D2D4AC565D62-001/tempDir-001
   [junit4]   2> 178493 INFO  (SUITE-TestSolrCloudWithDelegationTokens-seed#[8134D2D4AC565D62]-worker) [    ] o.a.s.c.ZkTestServer STARTING ZK TEST SERVER
   [junit4]   2> 178493 INFO  (Thread-184) [    ] o.a.s.c.ZkTestServer client port:0.0.0.0/0.0.0.0:0
   [junit4]   2> 178493 INFO  (Thread-184) [    ] o.a.s.c.ZkTestServer Starting server
   [junit4]   2> 178494 ERROR (Thread-184) [    ] o.a.z.s.ZooKeeperServer ZKShutdownHandler is not registered, so ZooKeeper server won't take any action on ERROR or SHUTDOWN server state changes
   [junit4]   2> 178593 INFO  (SUITE-TestSolrCloudWithDelegationTokens-seed#[8134D2D4AC565D62]-worker) [    ] o.a.s.c.ZkTestServer start zk server on port:44705
   [junit4]   2> 178600 INFO  (jetty-launcher-218-thread-1) [    ] o.e.j.s.Server jetty-9.3.14.v20161028
   [junit4]   2> 178600 INFO  (jetty-launcher-218-thread-2) [    ] o.e.j.s.Server jetty-9.3.14.v20161028
   [junit4]   2> 178602 INFO  (jetty-launcher-218-thread-2) [    ] o.e.j.s.h.ContextHandler Started o.e.j.s.ServletContextHandler@2592e17d{/solr,null,AVAILABLE}
   [junit4]   2> 178602 INFO  (jetty-launcher-218-thread-1) [    ] o.e.j.s.h.ContextHandler Started o.e.j.s.ServletContextHandler@43546505{/solr,null,AVAILABLE}
   [junit4]   2> 178604 INFO  (jetty-launcher-218-thread-2) [    ] o.e.j.s.AbstractConnector Started ServerConnector@d55c591{HTTP/1.1,[http/1.1]}{127.0.0.1:42721}
   [junit4]   2> 178604 INFO  (jetty-launcher-218-thread-1) [    ] o.e.j.s.AbstractConnector Started ServerConnector@2c2c1817{HTTP/1.1,[http/1.1]}{127.0.0.1:35081}
   [junit4]   2> 178604 INFO  (jetty-launcher-218-thread-2) [    ] o.e.j.s.Server Started @180181ms
   [junit4]   2> 178604 INFO  (jetty-launcher-218-thread-1) [    ] o.e.j.s.Server Started @180181ms
   [junit4]   2> 178604 INFO  (jetty-launcher-218-thread-2) [    ] o.a.s.c.s.e.JettySolrRunner Jetty properties: {hostContext=/solr, hostPort=42721}
   [junit4]   2> 178604 INFO  (jetty-launcher-218-thread-1) [    ] o.a.s.c.s.e.JettySolrRunner Jetty properties: {hostContext=/solr, hostPort=35081}
   [junit4]   2> 178605 ERROR (jetty-launcher-218-thread-2) [    ] o.a.s.s.StartupLoggingUtils Missing Java Option solr.log.dir. Logging may be missing or incomplete.
   [junit4]   2> 178605 ERROR (jetty-launcher-218-thread-1) [    ] o.a.s.s.StartupLoggingUtils Missing Java Option solr.log.dir. Logging may be missing or incomplete.
   [junit4]   2> 178605 INFO  (jetty-launcher-218-thread-2) [    ] o.a.s.s.SolrDispatchFilter  ___      _       Welcome to Apache Solr? version 6.7.0
   [junit4]   2> 178605 INFO  (jetty-launcher-218-thread-1) [    ] o.a.s.s.SolrDispatchFilter  ___      _       Welcome to Apache Solr? version 6.7.0
   [junit4]   2> 178605 INFO  (jetty-launcher-218-thread-2) [    ] o.a.s.s.SolrDispatchFilter / __| ___| |_ _   Starting in cloud mode on port null
   [junit4]   2> 178606 INFO  (jetty-launcher-218-thread-2) [    ] o.a.s.s.SolrDispatchFilter \__ \/ _ \ | '_|  Install dir: null
   [junit4]   2> 178606 INFO  (jetty-launcher-218-thread-1) [    ] o.a.s.s.SolrDispatchFilter / __| ___| |_ _   Starting in cloud mode on port null
   [junit4]   2> 178606 INFO  (jetty-launcher-218-thread-2) [    ] o.a.s.s.SolrDispatchFilter |___/\___/_|_|    Start time: 2017-05-30T21:41:00.862Z
   [junit4]   2> 178606 INFO  (jetty-launcher-218-thread-1) [    ] o.a.s.s.SolrDispatchFilter \__ \/ _ \ | '_|  Install dir: null
   [junit4]   2> 178606 INFO  (jetty-launcher-218-thread-1) [    ] o.a.s.s.SolrDispatchFilter |___/\___/_|_|    Start time: 2017-05-30T21:41:00.862Z
   [junit4]   2> 178609 INFO  (jetty-launcher-218-thread-2) [    ] o.a.s.s.SolrDispatchFilter solr.xml found in ZooKeeper. Loading...
   [junit4]   2> 178610 INFO  (jetty-launcher-218-thread-1) [    ] o.a.s.s.SolrDispatchFilter solr.xml found in ZooKeeper. Loading...
   [junit4]   2> 178617 INFO  (jetty-launcher-218-thread-2) [    ] o.a.s.u.UpdateShardHandler Creating UpdateShardHandler HTTP client with params: socketTimeout=340000&connTimeout=45000&retry=true
   [junit4]   2> 178618 INFO  (jetty-launcher-218-thread-1) [    ] o.a.s.u.UpdateShardHandler Creating UpdateShardHandler HTTP client with params: socketTimeout=340000&connTimeout=45000&retry=true
   [junit4]   2> 178618 INFO  (jetty-launcher-218-thread-2) [    ] o.a.s.c.ZkContainer Zookeeper client=127.0.0.1:44705/solr
   [junit4]   2> 178619 INFO  (jetty-launcher-218-thread-1) [    ] o.a.s.c.ZkContainer Zookeeper client=127.0.0.1:44705/solr
   [junit4]   2> 178623 WARN  (NIOServerCxn.Factory:0.0.0.0/0.0.0.0:0) [    ] o.a.z.s.NIOServerCnxn caught end of stream exception
   [junit4]   2> EndOfStreamException: Unable to read additional data from client sessionid 0x15c5b4e0cce0003, likely client has closed socket
   [junit4]   2> 	at org.apache.zookeeper.server.NIOServerCnxn.doIO(NIOServerCnxn.java:239)
   [junit4]   2> 	at org.apache.zookeeper.server.NIOServerCnxnFactory.run(NIOServerCnxnFactory.java:203)
   [junit4]   2> 	at java.lang.Thread.run(Thread.java:748)
   [junit4]   2> 178635 INFO  (jetty-launcher-218-thread-1) [n:127.0.0.1:35081_solr    ] o.a.s.c.Overseer Overseer (id=null) closing
   [junit4]   2> 178635 INFO  (jetty-launcher-218-thread-2) [n:127.0.0.1:42721_solr    ] o.a.s.c.Overseer Overseer (id=null) closing
   [junit4]   2> 178636 INFO  (jetty-launcher-218-thread-1) [n:127.0.0.1:35081_solr    ] o.a.s.c.OverseerElectionContext I am going to be the leader 127.0.0.1:35081_solr
   [junit4]   2> 178636 INFO  (jetty-launcher-218-thread-2) [n:127.0.0.1:42721_solr    ] o.a.s.c.ZkController Register node as live in ZooKeeper:/live_nodes/127.0.0.1:42721_solr
   [junit4]   2> 178636 INFO  (jetty-launcher-218-thread-1) [n:127.0.0.1:35081_solr    ] o.a.s.c.Overseer Overseer (id=98053682675712005-127.0.0.1:35081_solr-n_0000000000) starting
   [junit4]   2> 178637 INFO  (zkCallback-229-thread-1-processing-n:127.0.0.1:35081_solr) [n:127.0.0.1:35081_solr    ] o.a.s.c.c.ZkStateReader Updated live nodes from ZooKeeper... (0) -> (1)
   [junit4]   2> 178638 INFO  (zkCallback-230-thread-1-processing-n:127.0.0.1:42721_solr) [n:127.0.0.1:42721_solr    ] o.a.s.c.c.ZkStateReader Updated live nodes from ZooKeeper... (0) -> (1)
   [junit4]   2> 178649 INFO  (jetty-launcher-218-thread-1) [n:127.0.0.1:35081_solr    ] o.a.s.c.ZkController Register node as live in ZooKeeper:/live_nodes/127.0.0.1:35081_solr
   [junit4]   2> 178650 INFO  (zkCallback-230-thread-1-processing-n:127.0.0.1:42721_solr) [n:127.0.0.1:42721_solr    ] o.a.s.c.c.ZkStateReader Updated live nodes from ZooKeeper... (1) -> (2)
   [junit4]   2> 178650 INFO  (zkCallback-229-thread-1-processing-n:127.0.0.1:35081_solr) [n:127.0.0.1:35081_solr    ] o.a.s.c.c.ZkStateReader Updated live nodes from ZooKeeper... (1) -> (2)
   [junit4]   2> 178679 INFO  (jetty-launcher-218-thread-2) [n:127.0.0.1:42721_solr    ] o.a.s.c.CoreContainer Initializing authentication plugin: org.apache.solr.security.HttpParamDelegationTokenPlugin
   [junit4]   2> 178688 WARN  (jetty-launcher-218-thread-2) [n:127.0.0.1:42721_solr    ] o.a.s.c.s.i.Krb5HttpClientConfigurer org.apache.solr.client.solrj.impl.Krb5HttpClientConfigurer is configured without specifying system property 'java.security.auth.login.config'
   [junit4]   2> 178707 INFO  (jetty-launcher-218-thread-2) [n:127.0.0.1:42721_solr    ] o.a.s.s.KerberosPlugin Params: {token.valid=30, delegation-token.token-kind=solr-dt, cookie.domain=127.0.0.1, cookie.path=/, zk-dt-secret-manager.znodeWorkingPath=solr/security/zkdtsm, token.validity=36000, signer.secret.provider.zookeeper.path=/token, type=kerberos, zk-dt-secret-manager.enable=true, kerberos.name.rules=DEFAULT, signer.secret.provider=zookeeper}
   [junit4]   2> 178733 INFO  (jetty-launcher-218-thread-1) [n:127.0.0.1:35081_solr    ] o.a.s.c.CoreContainer Initializing authentication plugin: org.apache.solr.security.HttpParamDelegationTokenPlugin
   [junit4]   2> 178733 WARN  (jetty-launcher-218-thread-1) [n:127.0.0.1:35081_solr    ] o.a.s.c.s.i.Krb5HttpClientConfigurer org.apache.solr.client.solrj.impl.Krb5HttpClientConfigurer is configured without specifying system property 'java.security.auth.login.config'
   [junit4]   2> 178734 INFO  (jetty-launcher-218-thread-1) [n:127.0.0.1:35081_solr    ] o.a.s.s.KerberosPlugin Params: {token.valid=30, delegation-token.token-kind=solr-dt, cookie.domain=127.0.0.1, cookie.path=/, zk-dt-secret-manager.znodeWorkingPath=solr/security/zkdtsm, token.validity=36000, signer.secret.provider.zookeeper.path=/token, type=kerberos, zk-dt-secret-manager.enable=true, kerberos.name.rules=DEFAULT, signer.secret.provider=zookeeper}
   [junit4]   2> 178774 INFO  (jetty-launcher-218-thread-1) [n:127.0.0.1:35081_solr    ] o.a.c.f.i.CuratorFrameworkImpl Starting
   [junit4]   2> 178774 INFO  (jetty-launcher-218-thread-2) [n:127.0.0.1:42721_solr    ] o.a.c.f.i.CuratorFrameworkImpl Starting
   [junit4]   2> 178786 INFO  (jetty-launcher-218-thread-1-EventThread) [n:127.0.0.1:35081_solr    ] o.a.c.f.s.ConnectionStateManager State change: CONNECTED
   [junit4]   2> 178786 INFO  (jetty-launcher-218-thread-2-EventThread) [n:127.0.0.1:42721_solr    ] o.a.c.f.s.ConnectionStateManager State change: CONNECTED
   [junit4]   2> 178884 INFO  (jetty-launcher-218-thread-2) [n:127.0.0.1:42721_solr    ] o.a.s.h.c.HttpShardHandlerFactory Reconfiguring the default client with: org.apache.solr.security.HttpParamDelegationTokenPlugin$2@6a5d4c24
   [junit4]   2> 178884 INFO  (jetty-launcher-218-thread-1) [n:127.0.0.1:35081_solr    ] o.a.s.h.c.HttpShardHandlerFactory Reconfiguring the default client with: org.apache.solr.security.HttpParamDelegationTokenPlugin$2@18199285
   [junit4]   2> 178884 WARN  (jetty-launcher-218-thread-1) [n:127.0.0.1:35081_solr    ] o.a.s.c.s.i.Krb5HttpClientConfigurer org.apache.solr.security.HttpParamDelegationTokenPlugin$2 is configured without specifying system property 'java.security.auth.login.config'
   [junit4]   2> 178884 WARN  (jetty-launcher-218-thread-2) [n:127.0.0.1:42721_solr    ] o.a.s.c.s.i.Krb5HttpClientConfigurer org.apache.solr.security.HttpParamDelegationTokenPlugin$2 is configured without specifying system property 'java.security.auth.login.config'
   [junit4]   2> 178884 INFO  (jetty-launcher-218-thread-2) [n:127.0.0.1:42721_solr    ] o.a.s.u.UpdateShardHandler Reconfiguring the default client with: org.apache.solr.security.HttpParamDelegationTokenPlugin$2@6a5d4c24
   [junit4]   2> 178884 INFO  (jetty-launcher-218-thread-1) [n:127.0.0.1:35081_solr    ] o.a.s.u.UpdateShardHandler Reconfiguring the default client with: org.apache.solr.security.HttpParamDelegationTokenPlugin$2@18199285
   [junit4]   2> 178884 WARN  (jetty-launcher-218-thread-2) [n:127.0.0.1:42721_solr    ] o.a.s.c.s.i.Krb5HttpClientConfigurer org.apache.solr.security.HttpParamDelegationTokenPlugin$2 is configured without specifying system property 'java.security.auth.login.config'
   [junit4]   2> 178884 WARN  (jetty-launcher-218-thread-1) [n:127.0.0.1:35081_solr    ] o.a.s.c.s.i.Krb5HttpClientConfigurer org.apache.solr.security.HttpParamDelegationTokenPlugin$2 is configured without specifying system property 'java.security.auth.login.config'
   [junit4]   2> 178895 INFO  (jetty-launcher-218-thread-2) [n:127.0.0.1:42721_solr    ] o.a.s.c.CorePropertiesLocator Found 0 core definitions underneath /home/jenkins/workspace/Lucene-Solr-6.x-Linux/solr/build/solr-core/test/J1/temp/solr.cloud.TestSolrCloudWithDelegationTokens_8134D2D4AC565D62-001/tempDir-001/node2/.
   [junit4]   2> 178896 INFO  (jetty-launcher-218-thread-1) [n:127.0.0.1:35081_solr    ] o.a.s.c.CorePropertiesLocator Found 0 core definitions underneath /home/jenkins/workspace/Lucene-Solr-6.x-Linux/solr/build/solr-core/test/J1/temp/solr.cloud.TestSolrCloudWithDelegationTokens_8134D2D4AC565D62-001/tempDir-001/node1/.
   [junit4]   2> 178903 WARN  (SUITE-TestSolrCloudWithDelegationTokens-seed#[8134D2D4AC565D62]-worker) [    ] o.a.s.c.s.i.Krb5HttpClientConfigurer org.apache.solr.security.HttpParamDelegationTokenPlugin$2 is configured without specifying system property 'java.security.auth.login.config'
   [junit4]   2> 178903 WARN  (SUITE-TestSolrCloudWithDelegationTokens-seed#[8134D2D4AC565D62]-worker) [    ] o.a.s.c.s.i.Krb5HttpClientConfigurer org.apache.solr.security.HttpParamDelegationTokenPlugin$2 is configured without specifying system property 'java.security.auth.login.config'
   [junit4]   2> 178904 WARN  (SUITE-TestSolrCloudWithDelegationTokens-seed#[8134D2D4AC565D62]-worker) [    ] o.a.s.c.s.i.Krb5HttpClientConfigurer org.apache.solr.security.HttpParamDelegationTokenPlugin$2 is configured without specifying system property 'java.security.auth.login.config'
   [junit4]   2> 178904 WARN  (SUITE-TestSolrCloudWithDelegationTokens-seed#[8134D2D4AC565D62]-worker) [    ] o.a.s.c.s.i.Krb5HttpClientConfigurer org.apache.solr.security.HttpParamDelegationTokenPlugin$2 is configured without specifying system property 'java.security.auth.login.config'
   [junit4]   2> 178904 WARN  (SUITE-TestSolrCloudWithDelegationTokens-seed#[8134D2D4AC565D62]-worker) [    ] o.a.s.c.s.i.Krb5HttpClientConfigurer org.apache.solr.security.HttpParamDelegationTokenPlugin$2 is configured without specifying system property 'java.security.auth.login.config'
   [junit4]   2> 178904 WARN  (SUITE-TestSolrCloudWithDelegationTokens-seed#[8134D2D4AC565D62]-worker) [    ] o.a.s.c.s.i.Krb5HttpClientConfigurer org.apache.solr.security.HttpParamDelegationTokenPlugin$2 is configured without specifying system property 'java.security.auth.login.config'
   [junit4]   2> 178914 INFO  (TEST-TestSolrCloudWithDelegationTokens.testDelegationTokenCancel-seed#[8134D2D4AC565D62]) [    ] o.a.s.SolrTestCaseJ4 ###Starting testDelegationTokenCancel
   [junit4]   2> 179146 WARN  (TEST-TestSolrCloudWithDelegationTokens.testDelegationTokenCancel-seed#[8134D2D4AC565D62]) [    ] o.a.s.c.s.i.Krb5HttpClientConfigurer org.apache.solr.security.HttpParamDelegationTokenPlugin$2 is configured without specifying system property 'java.security.auth.login.config'
   [junit4]   2> 179147 WARN  (TEST-TestSolrCloudWithDelegationTokens.testDelegationTokenCancel-seed#[8134D2D4AC565D62]) [    ] o.a.s.c.s.i.Krb5HttpClientConfigurer org.apache.solr.security.HttpParamDelegationTokenPlugin$2 is configured without specifying system property 'java.security.auth.login.config'
   [junit4]   2> 179149 INFO  (TEST-TestSolrCloudWithDelegationTokens.testDelegationTokenCancel-seed#[8134D2D4AC565D62]) [    ] o.a.s.c.c.ZkStateReader Updated live nodes from ZooKeeper... (0) -> (2)
   [junit4]   2> 179149 INFO  (TEST-TestSolrCloudWithDelegationTokens.testDelegationTokenCancel-seed#[8134D2D4AC565D62]) [    ] o.a.s.c.s.i.ZkClientClusterStateProvider Cluster at 127.0.0.1:44705/solr ready
   [junit4]   2> 179152 ERROR (qtp751553974-1224) [    ] o.a.h.s.t.d.ZKDelegationTokenSecretManager No node in path [/ZKDTSMTokensRoot/DT_1]
   [junit4]   2> 179161 WARN  (TEST-TestSolrCloudWithDelegationTokens.testDelegationTokenCancel-seed#[8134D2D4AC565D62]) [    ] o.a.s.c.s.i.Krb5HttpClientConfigurer org.apache.solr.security.HttpParamDelegationTokenPlugin$2 is configured without specifying system property 'java.security.auth.login.config'
   [junit4]   2> 179161 WARN  (TEST-TestSolrCloudWithDelegationTokens.testDelegationTokenCancel-seed#[8134D2D4AC565D62]) [    ] o.a.s.c.s.i.Krb5HttpClientConfigurer org.apache.solr.security.HttpParamDelegationTokenPlugin$2 is configured without specifying system property 'java.security.auth.login.config'
   [junit4]   2> 179165 INFO  (TEST-TestSolrCloudWithDelegationTokens.testDelegationTokenCancel-seed#[8134D2D4AC565D62]) [    ] o.a.s.c.c.ZkStateReader Updated live nodes from ZooKeeper... (0) -> (2)
   [junit4]   2> 179165 INFO  (TEST-TestSolrCloudWithDelegationTokens.testDelegationTokenCancel-seed#[8134D2D4AC565D62]) [    ] o.a.s.c.s.i.ZkClientClusterStateProvider Cluster at 127.0.0.1:44705/solr ready
   [junit4]   2> 179174 WARN  (TEST-TestSolrCloudWithDelegationTokens.testDelegationTokenCancel-seed#[8134D2D4AC565D62]) [    ] o.a.s.c.s.i.Krb5HttpClientConfigurer org.apache.solr.security.HttpParamDelegationTokenPlugin$2 is configured without specifying system property 'java.security.auth.login.config'
   [junit4]   2> 179174 WARN  (TEST-TestSolrCloudWithDelegationTokens.testDelegationTokenCancel-seed#[8134D2D4AC565D62]) [    ] o.a.s.c.s.i.Krb5HttpClientConfigurer org.apache.solr.security.HttpParamDelegationTokenPlugin$2 is configured without specifying system property 'java.security.auth.login.config'
   [junit4]   2> 179180 INFO  (TEST-TestSolrCloudWithDelegationTokens.testDelegationTokenCancel-seed#[8134D2D4AC565D62]) [    ] o.a.s.c.c.ZkStateReader Updated live nodes from ZooKeeper... (0) -> (2)
   [junit4]   2> 179180 INFO  (TEST-TestSolrCloudWithDelegationTokens.testDelegationTokenCancel-seed#[8134D2D4AC565D62]) [    ] o.a.s.c.s.i.ZkClientClusterStateProvider Cluster at 127.0.0.1:44705/solr ready
   [junit4]   2> 179193 WARN  (TEST-TestSolrCloudWithDelegationTokens.testDelegationTokenCancel-seed#[8134D2D4AC565D62]) [    ] o.a.s.c.s.i.Krb5HttpClientConfigurer org.apache.solr.security.HttpParamDelegationTokenPlugin$2 is configured without specifying system property 'java.security.auth.login.config'
   [junit4]   2> 179193 WARN  (TEST-TestSolrCloudWithDelegationTokens.testDelegationTokenCancel-seed#[8134D2D4AC565D62]) [    ] o.a.s.c.s.i.Krb5HttpClientConfigurer org.apache.solr.security.HttpParamDelegationTokenPlugin$2 is configured without specifying system property 'java.security.auth.login.config'
   [junit4]   2> 179195 INFO  (TEST-TestSolrCloudWithDelegationTokens.testDelegationTokenCancel-seed#[8134D2D4AC565D62]) [    ] o.a.s.c.c.ZkStateReader Updated live nodes from ZooKeeper... (0) -> (2)
   [junit4]   2> 179195 INFO  (TEST-TestSolrCloudWithDelegationTokens.testDelegationTokenCancel-seed#[8134D2D4AC565D62]) [    ] o.a.s.c.s.i.ZkClientClusterStateProvider Cluster at 127.0.0.1:44705/solr ready
   [junit4]   2> 179197 ERROR (qtp751553974-1227) [    ] o.a.h.s.t.d.ZKDelegationTokenSecretManager No node in path [/ZKDTSMTokensRoot/DT_2]
   [junit4]   2> 179199 WARN  (TEST-TestSolrCloudWithDelegationTokens.testDelegationTokenCancel-seed#[8134D2D4AC565D62]) [    ] o.a.s.c.s.i.Krb5HttpClientConfigurer org.apache.solr.security.HttpParamDelegationTokenPlugin$2 is configured without specifying system property 'java.security.auth.login.config'
   [junit4]   2> 179199 WARN  (TEST-TestSolrCloudWithDelegationTokens.testDelegationTokenCancel-seed#[8134D2D4AC565D62]) [    ] o.a.s.c.s.i.Krb5HttpClientConfigurer org.apache.solr.security.HttpParamDelegationTokenPlugin$2 is configured without specifying system property 'java.security.auth.login.config'
   [junit4]   2> 179202 INFO  (TEST-TestSolrCloudWithDelegationTokens.testDelegationTokenCancel-seed#[8134D2D4AC565D62]) [    ] o.a.s.c.c.ZkStateReader Updated live nodes from ZooKeeper... (0) -> (2)
   [junit4]   2> 179202 INFO  (TEST-TestSolrCloudWithDelegationTokens.testDelegationTokenCancel-seed#[8134D2D4AC565D62]) [    ] o.a.s.c.s.i.ZkClientClusterStateProvider Cluster at 127.0.0.1:44705/solr ready
   [junit4]   2> 179204 WARN  (TEST-TestSolrCloudWithDelegationTokens.testDelegationTokenCancel-seed#[8134D2D4AC565D62]) [    ] o.a.s.c.s.i.Krb5HttpClientConfigurer org.apache.solr.security.HttpParamDelegationTokenPlugin$2 is configured without specifying system property 'java.security.auth.login.config'
   [junit4]   2> 179204 WARN  (TEST-TestSolrCloudWithDelegationTokens.testDelegationTokenCancel-seed#[8134D2D4AC565D62]) [    ] o.a.s.c.s.i.Krb5HttpClientConfigurer org.apache.solr.security.HttpParamDelegationTokenPlugin$2 is configured without specifying system property 'java.security.auth.login.config'
   [junit4]   2> 179206 INFO  (TEST-TestSolrCloudWithDelegationTokens.testDelegationTokenCancel-seed#[8134D2D4AC565D62]) [    ] o.a.s.c.c.ZkStateReader Updated live nodes from ZooKeeper... (0) -> (2)
   [junit4]   2> 179207 INFO  (TEST-TestSolrCloudWithDelegationTokens.testDelegationTokenCancel-seed#[8134D2D4AC565D62]) [    ] o.a.s.c.s.i.ZkClientClusterStateProvider Cluster at 127.0.0.1:44705/solr ready
   [junit4]   2> 179209 INFO  (TEST-TestSolrCloudWithDelegationTokens.testDelegationTokenCancel-seed#[8134D2D4AC565D62]) [    ] o.a.s.SolrTestCaseJ4 ###Ending testDelegationTokenCancel
   [junit4]   2> 179217 INFO  (TEST-TestSolrCloudWithDelegationTokens.testDelegationOtherOp-seed#[8134D2D4AC565D62]) [    ] o.a.s.SolrTestCaseJ4 ###Starting testDelegationOtherOp
   [junit4]   2> 179217 WARN  (TEST-TestSolrCloudWithDelegationTokens.testDelegationOtherOp-seed#[8134D2D4AC565D62]) [    ] o.a.s.c.s.i.Krb5HttpClientConfigurer org.apache.solr.security.HttpParamDelegationTokenPlugin$2 is configured without specifying system property 'java.security.auth.login.config'
   [junit4]   2> 179217 WARN  (TEST-TestSolrCloudWithDelegationTokens.testDelegationOtherOp-seed#[8134D2D4AC565D62]) [    ] o.a.s.c.s.i.Krb5HttpClientConfigurer org.apache.solr.security.HttpParamDelegationTokenPlugin$2 is configured without specifying system property 'java.security.auth.login.config'
   [junit4]   2> 179219 INFO  (TEST-TestSolrCloudWithDelegationTokens.testDelegationOtherOp-seed#[8134D2D4AC565D62]) [    ] o.a.s.c.c.ZkStateReader Updated live nodes from ZooKeeper... (0) -> (2)
   [junit4]   2> 179219 INFO  (TEST-TestSolrCloudWithDelegationTokens.testDelegationOtherOp-seed#[8134D2D4AC565D62]) [    ] o.a.s.c.s.i.ZkClientClusterStateProvider Cluster at 127.0.0.1:44705/solr ready
   [junit4]   2> 179223 INFO  (qtp751553974-1227) [n:127.0.0.1:42721_solr    ] o.a.s.h.a.CollectionsHandler Invoked Collection Action :list with params op=someSolrOperation&action=LIST&wt=javabin&version=2 and sendToOCPQueue=true
   [junit4]   2> 179223 INFO  (qtp751553974-1227) [n:127.0.0.1:42721_solr    ] o.a.s.s.HttpSolrCall [admin] webapp=null path=/admin/collections params={op=someSolrOperation&action=LIST&wt=javabin&version=2} status=0 QTime=0
   [junit4]   2> 179225 INFO  (TEST-TestSolrCloudWithDelegationTokens.testDelegationOtherOp-seed#[8134D2D4AC565D62]) [    ] o.a.s.SolrTestCaseJ4 ###Ending testDelegationOtherOp
   [junit4]   2> 179233 INFO  (TEST-TestSolrCloudWithDelegationTokens.testDelegationTokenRenew-seed#[8134D2D4AC565D62]) [    ] o.a.s.SolrTestCaseJ4 ###Starting testDelegationTokenRenew
   [junit4]   2> 179240 WARN  (qtp751553974-1228) [    ] o.a.h.s.a.s.AuthenticationFilter Authentication exception: org.apache.hadoop.security.AccessControlException: bar is trying to renew a token with wrong password
   [junit4]   2> 179240 WARN  (qtp751553974-1228) [    ] o.a.s.s.KerberosPlugin Could not find org.apache.solr.security.authentication.requestcontinues
   [junit4]   2> 179241 INFO  (TEST-TestSolrCloudWithDelegationTokens.testDelegationTokenRenew-seed#[8134D2D4AC565D62]) [    ] o.a.s.SolrTestCaseJ4 ###Ending testDelegationTokenRenew
   [junit4]   2> NOTE: reproduce with: ant test  -Dtestcase=TestSolrCloudWithDelegationTokens -Dtests.method=testDelegationTokenRenew -Dtests.seed=8134D2D4AC565D62 -Dtests.multiplier=3 -Dtests.slow=true -Dtests.locale=en-IN -Dtests.timezone=AGT -Dtests.asserts=true -Dtests.file.encoding=ISO-8859-1
   [junit4] FAILURE 0.02s J1 | TestSolrCloudWithDelegationTokens.testDelegationTokenRenew <<<
   [junit4]    > Throwable #1: java.lang.AssertionError: expected:<200> but was:<403>
   [junit4]    > 	at __randomizedtesting.SeedInfo.seed([8134D2D4AC565D62:B6AF26CA949A80C6]:0)
   [junit4]    > 	at org.apache.solr.cloud.TestSolrCloudWithDelegationTokens.renewDelegationToken(TestSolrCloudWithDelegationTokens.java:131)
   [junit4]    > 	at org.apache.solr.cloud.TestSolrCloudWithDelegationTokens.verifyDelegationTokenRenew(TestSolrCloudWithDelegationTokens.java:317)
   [junit4]    > 	at org.apache.solr.cloud.TestSolrCloudWithDelegationTokens.testDelegationTokenRenew(TestSolrCloudWithDelegationTokens.java:334)
   [junit4]    > 	at java.lang.Thread.run(Thread.java:748)
   [junit4]   2> 179251 INFO  (TEST-TestSolrCloudWithDelegationTokens.testDelegationTokenVerify-seed#[8134D2D4AC565D62]) [    ] o.a.s.SolrTestCaseJ4 ###Starting testDelegationTokenVerify
   [junit4]   2> 179255 WARN  (TEST-TestSolrCloudWithDelegationTokens.testDelegationTokenVerify-seed#[8134D2D4AC565D62]) [    ] o.a.s.c.s.i.Krb5HttpClientConfigurer org.apache.solr.security.HttpParamDelegationTokenPlugin$2 is configured without specifying system property 'java.security.auth.login.config'
   [junit4]   2> 179255 WARN  (TEST-TestSolrCloudWithDelegationTokens.testDelegationTokenVerify-seed#[8134D2D4AC565D62]) [    ] o.a.s.c.s.i.Krb5HttpClientConfigurer org.apache.solr.security.HttpParamDelegationTokenPlugin$2 is configured without specifying system property 'java.security.auth.login.config'
   [junit4]   2> 179256 INFO  (qtp751553974-1224) [n:127.0.0.1:42721_solr    ] o.a.s.h.a.CollectionsHandler Invoked Collection Action :list with params action=LIST&delegation=GgADYmFyA2JhcgCKAVxbTg_FigFcf1qTxQQEFJqQLPGesX38ssqquIgelwMLLTcoB3NvbHItZHQA&wt=javabin&version=2 and sendToOCPQueue=true
   [junit4]   2> 179256 INFO  (qtp751553974-1224) [n:127.0.0.1:42721_solr    ] o.a.s.s.HttpSolrCall [admin] webapp=null path=/admin/collections params={action=LIST&delegation=GgADYmFyA2JhcgCKAVxbTg_FigFcf1qTxQQEFJqQLPGesX38ssqquIgelwMLLTcoB3NvbHItZHQA&wt=javabin&version=2} status=0 QTime=0
   [junit4]   2> 179257 WARN  (TEST-TestSolrCloudWithDelegationTokens.testDelegationTokenVerify-seed#[8134D2D4AC565D62]) [    ] o.a.s.c.s.i.Krb5HttpClientConfigurer org.apache.solr.security.HttpParamDelegationTokenPlugin$2 is configured without specifying system property 'java.security.auth.login.config'
   [junit4]   2> 179257 WARN  (TEST-TestSolrCloudWithDelegationTokens.testDelegationTokenVerify-seed#[8134D2D4AC565D62]) [    ] o.a.s.c.s.i.Krb5HttpClientConfigurer org.apache.solr.security.HttpParamDelegationTokenPlugin$2 is configured without specifying system property 'java.security.auth.login.config'
   [junit4]   2> 179261 INFO  (TEST-TestSolrCloudWithDelegationTokens.testDelegationTokenVerify-seed#[8134D2D4AC565D62]) [    ] o.a.s.c.c.ZkStateReader Updated live nodes from ZooKeeper... (0) -> (2)
   [junit4]   2> 179262 INFO  (TEST-TestSolrCloudWithDelegationTokens.testDelegationTokenVerify-seed#[8134D2D4AC565D62]) [    ] o.a.s.c.s.i.ZkClientClusterStateProvider Cluster at 127.0.0.1:44705/solr ready
   [junit4]   2> 179264 WARN  (TEST-TestSolrCloudWithDelegationTokens.testDelegationTokenVerify-seed#[8134D2D4AC565D62]) [    ] o.a.s.c.s.i.Krb5HttpClientConfigurer org.apache.solr.security.HttpParamDelegationTokenPlugin$2 is configured without specifying system property 'java.security.auth.login.config'
   [junit4]   2> 179264 WARN  (TEST-TestSolrCloudWithDelegationTokens.testDelegationTokenVerify-seed#[8134D2D4AC565D62]) [    ] o.a.s.c.s.i.Krb5HttpClientConfigurer org.apache.solr.security.HttpParamDelegationTokenPlugin$2 is configured without specifying system property 'java.security.auth.login.config'
   [junit4]   2> 179268 INFO  (TEST-TestSolrCloudWithDelegationTokens.testDelegationTokenVerify-seed#[8134D2D4AC565D62]) [    ] o.a.s.c.c.ZkStateReader Updated live nodes from ZooKeeper... (0) -> (2)
   [junit4]   2> 179268 INFO  (TEST-TestSolrCloudWithDelegationTokens.testDelegationTokenVerify-seed#[8134D2D4AC565D62]) [    ] o.a.s.c.s.i.ZkClientClusterStateProvider Cluster at 127.0.0.1:44705/solr ready
   [junit4]   2> 179270 INFO  (qtp751553974-1231) [n:127.0.0.1:42721_solr    ] o.a.s.h.a.CollectionsHandler Invoked Collection Action :list with params action=LIST&delegation=GgADYmFyA2JhcgCKAVxbTg_FigFcf1qTxQQEFJqQLPGesX38ssqquIgelwMLLTcoB3NvbHItZHQA&wt=javabin&version=2 and sendToOCPQueue=true
   [junit4]   2> 179270 INFO  (qtp751553974-1231) [n:127.0.0.1:42721_solr    ] o.a.s.s.HttpSolrCall [admin] webapp=null path=/admin/collections params={action=LIST&delegation=GgADYmFyA2JhcgCKAVxbTg_FigFcf1qTxQQEFJqQLPGesX38ssqquIgelwMLLTcoB3NvbHItZHQA&wt=javabin&version=2} status=0 QTime=0
   [junit4]   2> 179271 WARN  (TEST-TestSolrCloudWithDelegationTokens.testDelegationTokenVerify-seed#[8134D2D4AC565D62]) [    ] o.a.s.c.s.i.Krb5HttpClientConfigurer org.apache.solr.security.HttpParamDelegationTokenPlugin$2 is configured without specifying system property 'java.security.auth.login.config'
   [junit4]   2> 179271 WARN  (TEST-TestSolrCloudWithDelegationTokens.testDelegationTokenVerify-seed#[8134D2D4AC565D62]) [    ] o.a.s.c.s.i.Krb5HttpClientConfigurer org.apache.solr.security.HttpParamDelegationTokenPlugin$2 is configured without specifying system property 'java.security.auth.login.config'
   [junit4]   2> 179274 INFO  (TEST-TestSolrCloudWithDelegationTokens.testDelegationTokenVerify-seed#[8134D2D4AC565D62]) [    ] o.a.s.c.c.ZkStateReader Updated live nodes from ZooKeeper... (0) -> (2)
   [junit4]   2> 179274 INFO  (TEST-TestSolrCloudWithDelegationTokens.testDelegationTokenVerify-seed#[8134D2D4AC565D62]) [    ] o.a.s.c.s.i.ZkClientClusterStateProvider Cluster at 127.0.0.1:44705/solr ready
   [junit4]   2> 179277 INFO  (TEST-TestSolrCloudWithDelegationTokens.testDelegationTokenVerify-seed#[8134D2D4AC565D62]) [    ] o.a.s.SolrTestCaseJ4 ###Ending testDelegationTokenVerify
   [junit4]   2> 179286 INFO  (TEST-TestSolrCloudWithDelegationTokens.testZNodePaths-seed#[8134D2D4AC565D62]) [    ] o.a.s.SolrTestCaseJ4 ###Starting testZNodePaths
   [junit4]   2> 179292 INFO  (TEST-TestSolrCloudWithDelegationTokens.testZNodePaths-seed#[8134D2D4AC565D62]) [    ] o.a.s.SolrTestCaseJ4 ###Ending testZNodePaths
   [junit4]   2> 179302 INFO  (TEST-TestSolrCloudWithDelegationTokens.testDelegationTokenSolrClient-seed#[8134D2D4AC565D62]) [    ] o.a.s.SolrTestCaseJ4 ###Starting testDelegationTokenSolrClient
   [junit4]   2> 179307 WARN  (TEST-TestSolrCloudWithDelegationTokens.testDelegationTokenSolrClient-seed#[8134D2D4AC565D62]) [    ] o.a.s.c.s.i.Krb5HttpClientConfigurer org.apache.solr.security.HttpParamDelegationTokenPlugin$2 is configured without specifying system property 'java.security.auth.login.config'
   [junit4]   2> 179307 WARN  (TEST-TestSolrCloudWithDelegationTokens.testDelegationTokenSolrClient-seed#[8134D2D4AC565D62]) [    ] o.a.s.c.s.i.Krb5HttpClientConfigurer org.apache.solr.security.HttpParamDelegationTokenPlugin$2 is configured without specifying system property 'java.security.auth.login.config'
   [junit4]   2> 179309 WARN  (TEST-TestSolrCloudWithDelegationTokens.testDelegationTokenSolrClient-seed#[8134D2D4AC565D62]) [    ] o.a.s.c.s.i.Krb5HttpClientConfigurer org.apache.solr.security.HttpParamDelegationTokenPlugin$2 is configured without specifying system property 'java.security.auth.login.config'
   [junit4]   2> 179309 WARN  (TEST-TestSolrCloudWithDelegationTokens.testDelegationTokenSolrClient-seed#[8134D2D4AC565D62]) [    ] o.a.s.c.s.i.Krb5HttpClientConfigurer org.apache.solr.security.HttpParamDelegationTokenPlugin$2 is configured without specifying system property 'java.security.auth.login.config'
   [junit4]   2> 179310 INFO  (qtp751553974-1228) [n:127.0.0.1:42721_solr    ] o.a.s.h.a.CollectionsHandler Invoked Collection Action :list with params action=LIST&delegation=GgADYmFyA2JhcgCKAVxbTg_4igFcf1qT-AYEFJdhvS5s5OqALqGrv3qhQ396rveGB3NvbHItZHQA&wt=javabin&version=2 and sendToOCPQueue=true
   [junit4]   2> 179311 INFO  (qtp751553974-1228) [n:127.0.0.1:42721_solr    ] o.a.s.s.HttpSolrCall [admin] webapp=null path=/admin/collections params={action=LIST&delegation=GgADYmFyA2JhcgCKAVxbTg_4igFcf1qT-AYEFJdhvS5s5OqALqGrv3qhQ396rveGB3NvbHItZHQA&wt=javabin&version=2} status=0 QTime=0
   [junit4]   2> 179311 INFO  (TEST-TestSolrCloudWithDelegationTokens.testDelegationTokenSolrClient-seed#[8134D2D4AC565D62]) [    ] o.a.s.SolrTestCaseJ4 ###Ending testDelegationTokenSolrClient
   [junit4]   2> 179322 INFO  (TEST-TestSolrCloudWithDelegationTokens.testDelegationTokenRenewFail-seed#[8134D2D4AC565D62]) [    ] o.a.s.SolrTestCaseJ4 ###Starting testDelegationTokenRenewFail
   [junit4]   2> 179328 WARN  (qtp751553974-1228) [n:127.0.0.1:42721_solr    ] o.a.h.s.a.s.AuthenticationFilter Authentication exception: org.apache.hadoop.security.AccessControlException: foo tries to renew a token with renewer bar
   [junit4]   2> 179328 WARN  (qtp751553974-1228) [n:127.0.0.1:42721_solr    ] o.a.s.s.KerberosPlugin Could not find org.apache.solr.security.authentication.requestcontinues
   [junit4]   2> 179331 WARN  (qtp361841193-1234) [    ] o.a.h.s.a.s.AuthenticationFilter Authentication exception: org.apache.hadoop.security.AccessControlException: foo tries to renew a token with renewer bar
   [junit4]   2> 179332 WARN  (qtp361841193-1234) [    ] o.a.s.s.KerberosPlugin Could not find org.apache.solr.security.authentication.requestcontinues
   [junit4]   2> 179339 WARN  (qtp751553974-1226) [    ] o.a.h.s.a.s.AuthenticationFilter Authentication exception: org.apache.hadoop.security.AccessControlException: notRenewUser tries to renew a token with renewer renewUser
   [junit4]   2> 179339 WARN  (qtp751553974-1226) [    ] o.a.s.s.KerberosPlugin Could not find org.apache.solr.security.authentication.requestcontinues
   [junit4]   2> 179342 WARN  (qtp361841193-1236) [    ] o.a.h.s.a.s.AuthenticationFilter Authentication exception: org.apache.hadoop.security.AccessControlException: notRenewUser tries to renew a token with renewer renewUser
   [junit4]   2> 179342 WARN  (qtp361841193-1236) [    ] o.a.s.s.KerberosPlugin Could not find org.apache.solr.security.authentication.requestcontinues
   [junit4]   2> 179342 INFO  (TEST-TestSolrCloudWithDelegationTokens.testDelegationTokenRenewFail-seed#[8134D2D4AC565D62]) [    ] o.a.s.SolrTestCaseJ4 ###Ending testDelegationTokenRenewFail
   [junit4] IGNOR/A 0.00s J1 | TestSolrCloudWithDelegationTokens.testDelegationTokenCancelFail
   [junit4]    > Assumption #1: 'awaitsfix' test group is disabled (@AwaitsFix(bugUrl=https://issues.apache.org/jira/browse/HADOOP-14044))
   [junit4]   2> 179344 INFO  (jetty-closer-219-thread-2) [    ] o.e.j.s.AbstractConnector Stopped ServerConnector@2c2c1817{HTTP/1.1,[http/1.1]}{127.0.0.1:0}
   [junit4]   2> 179344 INFO  (jetty-closer-219-thread-1) [    ] o.e.j.s.AbstractConnector Stopped ServerConnector@d55c591{HTTP/1.1,[http/1.1]}{127.0.0.1:0}
   [junit4]   2> 179344 INFO  (jetty-closer-219-thread-2) [    ] o.a.s.c.CoreContainer Shutting down CoreContainer instance=1335483288
   [junit4]   2> 179344 INFO  (jetty-closer-219-thread-1) [    ] o.a.s.c.CoreContainer Shutting down CoreContainer instance=459021652
   [junit4]   2> 179345 INFO  (jetty-closer-219-thread-2) [    ] o.a.s.m.SolrMetricManager Closing metric reporters for: solr.node
   [junit4]   2> 179345 INFO  (jetty-closer-219-thread-1) [    ] o.a.s.m.SolrMetricManager Closing metric reporters for: solr.node
   [junit4]   2> 179345 INFO  (jetty-closer-219-thread-2) [    ] o.a.s.m.SolrMetricManager Closing metric reporters for: solr.jvm
   [junit4]   2> 179345 INFO  (jetty-closer-219-thread-1) [    ] o.a.s.m.SolrMetricManager Closing metric reporters for: solr.jvm
   [junit4]   2> 179345 INFO  (jetty-closer-219-thread-2) [    ] o.a.s.m.SolrMetricManager Closing metric reporters for: solr.jetty
   [junit4]   2> 179345 INFO  (jetty-closer-219-thread-1) [    ] o.a.s.m.SolrMetricManager Closing metric reporters for: solr.jetty
   [junit4]   2> 179345 INFO  (jetty-closer-219-thread-1) [    ] o.a.s.c.TransientSolrCoreCacheDefault Allocating transient cache for 2147483647 transient cores
   [junit4]   2> 179345 INFO  (jetty-closer-219-thread-2) [    ] o.a.s.c.TransientSolrCoreCacheDefault Allocating transient cache for 2147483647 transient cores
   [junit4]   2> 179349 INFO  (jetty-closer-219-thread-2) [    ] o.a.s.c.Overseer Overseer (id=98053682675712005-127.0.0.1:35081_solr-n_0000000000) closing
   [junit4]   2> 179349 INFO  (OverseerStateUpdate-98053682675712005-127.0.0.1:35081_solr-n_0000000000) [n:127.0.0.1:35081_solr    ] o.a.s.c.Overseer Overseer Loop exiting : 127.0.0.1:35081_solr
   [junit4]   2> 179349 WARN  (zkCallback-230-thread-1-processing-n:127.0.0.1:42721_solr) [n:127.0.0.1:42721_solr    ] o.a.s.c.c.ZkStateReader ZooKeeper watch triggered, but Solr cannot talk to ZK: [KeeperErrorCode = Session expired for /live_nodes]
   [junit4]   2> 179350 INFO  (zkCallback-229-thread-2-processing-n:127.0.0.1:35081_solr) [n:127.0.0.1:35081_solr    ] o.a.s.c.c.ZkStateReader Updated live nodes from ZooKeeper... (2) -> (1)
   [junit4]   2> 179351 ERROR (Thread[Thread-203,5,TGRP-TestSolrCloudWithDelegationTokens]) [n:127.0.0.1:42721_solr    ] o.a.h.s.t.d.AbstractDelegationTokenSecretManager ExpiredTokenRemover received java.lang.InterruptedException: sleep interrupted
   [junit4]   2> 179351 WARN  (zkCallback-229-thread-2-processing-n:127.0.0.1:35081_solr) [n:127.0.0.1:35081_solr    ] o.a.s.c.c.ZkStateReader ZooKeeper watch triggered, but Solr cannot talk to ZK: [KeeperErrorCode = Session expired for /live_nodes]
   [junit4]   2> 179351 ERROR (Thread[Thread-202,5,TGRP-TestSolrCloudWithDelegationTokens]) [n:127.0.0.1:35081_solr    ] o.a.h.s.t.d.AbstractDelegationTokenSecretManager ExpiredTokenRemover received java.lang.InterruptedException: sleep interrupted
   [junit4]   2> 179361 WARN  (NIOServerCxn.Factory:0.0.0.0/0.0.0.0:0) [    ] o.a.z.s.NIOServerCnxn caught end of stream exception
   [junit4]   2> EndOfStreamException: Unable to read additional data from client sessionid 0x15c5b4e0cce0007, likely client has closed socket
   [junit4]   2> 	at org.apache.zookeeper.server.NIOServerCnxn.doIO(NIOServerCnxn.java:239)
   [junit4]   2> 	at org.apache.zookeeper.server.NIOServerCnxnFactory.run(NIOServerCnxnFactory.java:203)
   [junit4]   2> 	at java.lang.Thread.run(Thread.java:748)
   [junit4]   2> 179361 INFO  (jetty-closer-219-thread-1) [    ] o.e.j.s.h.ContextHandler Stopped o.e.j.s.ServletContextHandler@2592e17d{/solr,null,UNAVAILABLE}
   [junit4]   2> 179361 INFO  (jetty-closer-219-thread-2) [    ] o.e.j.s.h.ContextHandler Stopped o.e.j.s.ServletContextHandler@43546505{/solr,null,UNAVAILABLE}
   [junit4]   2> 179362 ERROR (SUITE-TestSolrCloudWithDelegationTokens-seed#[8134D2D4AC565D62]-worker) [    ] o.a.z.s.ZooKeeperServer ZKShutdownHandler is not registered, so ZooKeeper server won't take any action on ERROR or SHUTDOWN server state changes
   [junit4]   2> 179362 INFO  (SUITE-TestSolrCloudWithDelegationTokens-seed#[8134D2D4AC565D62]-worker) [    ] o.a.s.c.ZkTestServer connecting to 127.0.0.1:44705 44705
   [junit4]   2> 179478 INFO  (Thread-184) [    ] o.a.s.c.ZkTestServer connecting to 127.0.0.1:44705 44705
   [junit4]   2> 179479 WARN  (Thread-184) [    ] o.a.s.c.ZkTestServer Watch limit violations: 
   [junit4]   2> Maximum concurrent create/delete watches above limit:
   [junit4]   2> 
   [junit4]   2> 	12	/solr/aliases.json
   [junit4]   2> 	12	/solr/clusterprops.json
   [junit4]   2> 	2	/solr/security.json
   [junit4]   2> 
   [junit4]   2> Maximum concurrent data watches above limit:
   [junit4]   2> 
   [junit4]   2> 	12	/solr/clusterstate.json
   [junit4]   2> 	4	/solr/security/zkdtsm/ZKDTSMRoot/ZKDTSMKeyIdRoot
   [junit4]   2> 	2	/solr/security/zkdtsm/ZKDTSMRoot/ZKDTSMTokensRoot/DT_7
   [junit4]   2> 	2	/solr/security/zkdtsm/ZKDTSMRoot/ZKDTSMTokensRoot/DT_6
   [junit4]   2> 	2	/solr/security/zkdtsm/ZKDTSMRoot/ZKDTSMTokensRoot/DT_8
   [junit4]   2> 	2	/solr/security/zkdtsm/ZKDTSMRoot/ZKDTSMMasterKeyRoot/DK_1
   [junit4]   2> 	2	/solr/security/zkdtsm/ZKDTSMRoot/ZKDTSMTokensRoot/DT_1
   [junit4]   2> 	2	/solr/security/zkdtsm/ZKDTSMRoot/ZKDTSMTokensRoot/DT_3
   [junit4]   2> 	2	/solr/security/zkdtsm/ZKDTSMRoot/ZKDTSMMasterKeyRoot/DK_2
   [junit4]   2> 	2	/solr/security/zkdtsm/ZKDTSMRoot/ZKDTSMTokensRoot/DT_2
   [junit4]   2> 	2	/solr/security/zkdtsm/ZKDTSMRoot/ZKDTSMTokensRoot/DT_5
   [junit4]   2> 	2	/solr/security/zkdtsm/ZKDTSMRoot/ZKDTSMMasterKeyRoot/DK_4
   [junit4]   2> 	2	/solr/security/zkdtsm/ZKDTSMRoot/ZKDTSMTokensRoot/DT_4
   [junit4]   2> 	2	/solr/security/zkdtsm/ZKDTSMRoot/ZKDTSMSeqNumRoot
   [junit4]   2> 
   [junit4]   2> Maximum concurrent children watches above limit:
   [junit4]   2> 
   [junit4]   2> 	12	/solr/live_nodes
   [junit4]   2> 	12	/solr/collections
   [junit4]   2> 	2	/solr/security/zkdtsm/ZKDTSMRoot/ZKDTSMMasterKeyRoot
   [junit4]   2> 	2	/solr/security/zkdtsm/ZKDTSMRoot/ZKDTSMTokensRoot
   [junit4]   2> 
   [junit4]   2> 179479 INFO  (SUITE-TestSolrCloudWithDelegationTokens-seed#[8134D2D4AC565D62]-worker) [    ] o.a.s.SolrTestCaseJ4 ###deleteCore
   [junit4]   2> NOTE: leaving temporary files on disk at: /home/jenkins/workspace/Lucene-Solr-6.x-Linux/solr/build/solr-core/test/J1/temp/solr.cloud.TestSolrCloudWithDelegationTokens_8134D2D4AC565D62-001
   [junit4]   2> May 30, 2017 9:41:01 PM com.carrotsearch.randomizedtesting.ThreadLeakControl checkThreadLeaks
   [junit4]   2> WARNING: Will linger awaiting termination of 1 leaked thread(s).
   [junit4]   2> NOTE: test params are: codec=Asserting(Lucene62): {}, docValues:{}, maxPointsInLeafNode=871, maxMBSortInHeap=6.452913742923396, sim=RandomSimilarity(queryNorm=true,coord=crazy): {}, locale=en-IN, timezone=AGT
   [junit4]   2> NOTE: Linux 4.10.0-21-generic amd64/Oracle Corporation 1.8.0_131 (64-bit)/cpus=8,threads=1,free=139192640,total=518979584
   [junit4]   2> NOTE: All tests run in this JVM: [TestStressUserVersions, BitVectorTest, TestConfigSets, TestSimpleQParserPlugin, LeaderInitiatedRecoveryOnShardRestartTest, SmileWriterTest, TemplateUpdateProcessorTest, TestPartialUpdateDeduplication, CopyFieldTest, DistanceFunctionTest, TestFiltering, SolrMetricReporterTest, HdfsBasicDistributedZkTest, ClassificationUpdateProcessorFactoryTest, SchemaVersionSpecificBehaviorTest, HttpSolrCallGetCoreTest, HighlighterMaxOffsetTest, CollectionsAPIDistributedZkTest, SharedFSAutoReplicaFailoverUtilsTest, HdfsRecoveryZkTest, TestShardHandlerFactory, TestHashPartitioner, TestUpdate, InfixSuggestersTest, TestIntervalFaceting, LeaderFailoverAfterPartitionTest, CoreSorterTest, TestCustomDocTransformer, UUIDUpdateProcessorFallbackTest, TestNumericTerms64, TestSolrCloudWithDelegationTokens]
   [junit4] Completed [70/715 (1!)] on J1 in 1.50s, 8 tests, 1 failure, 1 skipped <<< FAILURES!

[...truncated 2087 lines...]
   [junit4] Suite: org.apache.solr.util.TestMaxTokenLenTokenizer
   [junit4]   2> Creating dataDir: /home/jenkins/workspace/Lucene-Solr-6.x-Linux/solr/build/solr-core/test/J1/temp/solr.util.TestMaxTokenLenTokenizer_8134D2D4AC565D62-001/init-core-data-001
   [junit4]   2> 1651832 INFO  (SUITE-TestMaxTokenLenTokenizer-seed#[8134D2D4AC565D62]-worker) [    ] o.a.s.SolrTestCaseJ4 Using PointFields
   [junit4]   2> 1651833 INFO  (SUITE-TestMaxTokenLenTokenizer-seed#[8134D2D4AC565D62]-worker) [    ] o.a.s.SolrTestCaseJ4 Randomized ssl (false) and clientAuth (true) via: @org.apache.solr.util.RandomizeSSL(reason=, value=NaN, ssl=NaN, clientAuth=NaN)
   [junit4]   2> 1651833 INFO  (SUITE-TestMaxTokenLenTokenizer-seed#[8134D2D4AC565D62]-worker) [    ] o.a.s.SolrTestCaseJ4 ####initCore
   [junit4]   2> 1651833 INFO  (SUITE-TestMaxTokenLenTokenizer-seed#[8134D2D4AC565D62]-worker) [    ] o.a.s.c.SolrResourceLoader [null] Added 2 libs to classloader, from paths: [/home/jenkins/workspace/Lucene-Solr-6.x-Linux/solr/core/src/test-files/solr/collection1/lib, /home/jenkins/workspace/Lucene-Solr-6.x-Linux/solr/core/src/test-files/solr/collection1/lib/classes]
   [junit4]   2> 1651854 WARN  (SUITE-TestMaxTokenLenTokenizer-seed#[8134D2D4AC565D62]-worker) [    ] o.a.s.c.Config Beginning with Solr 5.5, <mergePolicy> is deprecated, use <mergePolicyFactory> instead.
   [junit4]   2> 1651856 INFO  (SUITE-TestMaxTokenLenTokenizer-seed#[8134D2D4AC565D62]-worker) [    ] o.a.s.c.SolrConfig Using Lucene MatchVersion: 6.7.0
   [junit4]   2> 1651872 INFO  (SUITE-TestMaxTokenLenTokenizer-seed#[8134D2D4AC565D62]-worker) [    ] o.a.s.s.IndexSchema [null] Schema name=test
   [junit4]   2> 1651876 INFO  (SUITE-TestMaxTokenLenTokenizer-seed#[8134D2D4AC565D62]-worker) [    ] o.a.s.s.IndexSchema Loaded schema test/1.0 with uniqueid field id
   [junit4]   2> 1651878 INFO  (SUITE-TestMaxTokenLenTokenizer-seed#[8134D2D4AC565D62]-worker) [    ] o.a.s.u.UpdateShardHandler Creating UpdateShardHandler HTTP client with params: socketTimeout=30000&connTimeout=30000&retry=true
   [junit4]   2> 1651889 INFO  (SUITE-TestMaxTokenLenTokenizer-seed#[8134D2D4AC565D62]-worker) [    ] o.a.s.m.r.SolrJmxReporter JMX monitoring for 'solr.node' (registry 'solr.node') enabled at server: com.sun.jmx.mbeanserver.JmxMBeanServer@3c67b316
   [junit4]   2> 1651891 INFO  (SUITE-TestMaxTokenLenTokenizer-seed#[8134D2D4AC565D62]-worker) [    ] o.a.s.m.r.SolrJmxReporter JMX monitoring for 'solr.jvm' (registry 'solr.jvm') enabled at server: com.sun.jmx.mbeanserver.JmxMBeanServer@3c67b316
   [junit4]   2> 1651891 INFO  (SUITE-TestMaxTokenLenTokenizer-seed#[8134D2D4AC565D62]-worker) [    ] o.a.s.m.r.SolrJmxReporter JMX monitoring for 'solr.jetty' (registry 'solr.jetty') enabled at server: com.sun.jmx.mbeanserver.JmxMBeanServer@3c67b316
   [junit4]   2> 1651892 INFO  (coreLoadExecutor-6230-thread-1) [    x:collection1] o.a.s.c.SolrResourceLoader [null] Added 2 libs to classloader, from paths: [/home/jenkins/workspace/Lucene-Solr-6.x-Linux/solr/core/src/test-files/solr/collection1/lib, /home/jenkins/workspace/Lucene-Solr-6.x-Linux/solr/core/src/test-files/solr/collection1/lib/classes]
   [junit4]   2> 1651909 WARN  (coreLoadExecutor-6230-thread-1) [    x:collection1] o.a.s.c.Config Beginning with Solr 5.5, <mergePolicy> is deprecated, use <mergePolicyFactory> instead.
   [junit4]   2> 1651910 INFO  (coreLoadExecutor-6230-thread-1) [    x:collection1] o.a.s.c.SolrConfig Using Lucene MatchVersion: 6.7.0
   [junit4]   2> 1651926 INFO  (coreLoadExecutor-6230-thread-1) [    x:collection1] o.a.s.s.IndexSchema [collection1] Schema name=test
   [junit4]   2> 1651930 INFO  (coreLoadExecutor-6230-thread-1) [    x:collection1] o.a.s.s.IndexSchema Loaded schema test/1.0 with uniqueid field id
   [junit4]   2> 1651930 INFO  (coreLoadExecutor-6230-thread-1) [    x:collection1] o.a.s.c.CoreContainer Creating SolrCore 'collection1' using configuration from instancedir /home/jenkins/workspace/Lucene-Solr-6.x-Linux/solr/core/src/test-files/solr/collection1, trusted=true
   [junit4]   2> 1651930 INFO  (coreLoadExecutor-6230-thread-1) [    x:collection1] o.a.s.m.r.SolrJmxReporter JMX monitoring for 'solr.core.collection1' (registry 'solr.core.collection1') enabled at server: com.sun.jmx.mbeanserver.JmxMBeanServer@3c67b316
   [junit4]   2> 1651930 INFO  (coreLoadExecutor-6230-thread-1) [    x:collection1] o.a.s.c.SolrCore solr.RecoveryStrategy.Builder
   [junit4]   2> 1651930 INFO  (coreLoadExecutor-6230-thread-1) [    x:collection1] o.a.s.c.SolrCore [[collection1] ] Opening new SolrCore at [/home/jenkins/workspace/Lucene-Solr-6.x-Linux/solr/core/src/test-files/solr/collection1], dataDir=[/home/jenkins/workspace/Lucene-Solr-6.x-Linux/solr/build/solr-core/test/J1/temp/solr.util.TestMaxTokenLenTokenizer_8134D2D4AC565D62-001/init-core-data-001/]
   [junit4]   2> 1651931 INFO  (coreLoadExecutor-6230-thread-1) [    x:collection1] o.a.s.u.RandomMergePolicy RandomMergePolicy wrapping class org.apache.lucene.index.TieredMergePolicy: [TieredMergePolicy: maxMergeAtOnce=22, maxMergeAtOnceExplicit=32, maxMergedSegmentMB=47.5283203125, floorSegmentMB=1.744140625, forceMergeDeletesPctAllowed=26.40447730882631, segmentsPerTier=34.0, maxCFSSegmentSizeMB=8.796093022207999E12, noCFSRatio=1.0
   [junit4]   2> 1651951 INFO  (coreLoadExecutor-6230-thread-1) [    x:collection1] o.a.s.u.CommitTracker Hard AutoCommit: disabled
   [junit4]   2> 1651951 INFO  (coreLoadExecutor-6230-thread-1) [    x:collection1] o.a.s.u.CommitTracker Soft AutoCommit: disabled
   [junit4]   2> 1651952 INFO  (coreLoadExecutor-6230-thread-1) [    x:collection1] o.a.s.u.RandomMergePolicy RandomMergePolicy wrapping class org.apache.lucene.index.AlcoholicMergePolicy: [AlcoholicMergePolicy: minMergeSize=0, mergeFactor=10, maxMergeSize=81949437, maxMergeSizeForForcedMerge=9223372036854775807, calibrateSizeByDeletes=true, maxMergeDocs=2147483647, maxCFSSegmentSizeMB=8.796093022207999E12, noCFSRatio=0.1]
   [junit4]   2> 1651952 INFO  (coreLoadExecutor-6230-thread-1) [    x:collection1] o.a.s.s.SolrIndexSearcher Opening [Searcher@442ba484[collection1] main]
   [junit4]   2> 1651952 WARN  (coreLoadExecutor-6230-thread-1) [    x:collection1] o.a.s.r.ManagedResourceStorage Cannot write to config directory /home/jenkins/workspace/Lucene-Solr-6.x-Linux/solr/core/src/test-files/solr/collection1/conf; switching to use InMemory storage instead.
   [junit4]   2> 1651952 INFO  (coreLoadExecutor-6230-thread-1) [    x:collection1] o.a.s.h.ReplicationHandler Commits will be reserved for  10000
   [junit4]   2> 1651952 INFO  (searcherExecutor-6231-thread-1-processing-x:collection1) [    x:collection1] o.a.s.c.SolrCore [collection1] Registered new searcher Searcher@442ba484[collection1] main{ExitableDirectoryReader(UninvertingDirectoryReader())}
   [junit4]   2> 1651953 INFO  (SUITE-TestMaxTokenLenTokenizer-seed#[8134D2D4AC565D62]-worker) [    ] o.a.s.SolrTestCaseJ4 ####initCore end
   [junit4]   2> 1651954 INFO  (TEST-TestMaxTokenLenTokenizer.testSingleFieldSameAnalyzers-seed#[8134D2D4AC565D62]) [    ] o.a.s.SolrTestCaseJ4 ###Starting testSingleFieldSameAnalyzers
   [junit4]   2> 1651955 INFO  (TEST-TestMaxTokenLenTokenizer.testSingleFieldSameAnalyzers-seed#[8134D2D4AC565D62]) [    ] o.a.s.u.DirectUpdateHandler2 [collection1] REMOVING ALL DOCUMENTS FROM INDEX
   [junit4]   2> 1651955 INFO  (TEST-TestMaxTokenLenTokenizer.testSingleFieldSameAnalyzers-seed#[8134D2D4AC565D62]) [    ] o.a.s.u.p.LogUpdateProcessorFactory [collection1]  webapp=null path=null params={_version_=-9223372036854775807&update.distrib=FROMLEADER&versions=true&wt=json&indent=true}{deleteByQuery=*:*} 0 0
   [junit4]   2> 1651955 INFO  (TEST-TestMaxTokenLenTokenizer.testSingleFieldSameAnalyzers-seed#[8134D2D4AC565D62]) [    ] o.a.s.u.DirectUpdateHandler2 start commit{,optimize=false,openSearcher=true,waitSearcher=true,expungeDeletes=false,softCommit=false,prepareCommit=false}
   [junit4]   2> 1651955 INFO  (TEST-TestMaxTokenLenTokenizer.testSingleFieldSameAnalyzers-seed#[8134D2D4AC565D62]) [    ] o.a.s.u.SolrIndexWriter Calling setCommitData with IW:org.apache.solr.update.SolrIndexWriter@3e1bdfe8
   [junit4]   2> 1651956 INFO  (TEST-TestMaxTokenLenTokenizer.testSingleFieldSameAnalyzers-seed#[8134D2D4AC565D62]) [    ] o.a.s.s.SolrIndexSearcher Opening [Searcher@3f95cb4d[collection1] main]
   [junit4]   2> 1651957 INFO  (TEST-TestMaxTokenLenTokenizer.testSingleFieldSameAnalyzers-seed#[8134D2D4AC565D62]) [    ] o.a.s.u.DirectUpdateHandler2 end_commit_flush
   [junit4]   2> 1651957 INFO  (searcherExecutor-6231-thread-1) [    ] o.a.s.c.SolrCore [collection1] Registered new searcher Searcher@3f95cb4d[collection1] main{ExitableDirectoryReader(UninvertingDirectoryReader(Uninverting(_0(6.7.0):C1)))}
   [junit4]   2> 1651957 INFO  (TEST-TestMaxTokenLenTokenizer.testSingleFieldSameAnalyzers-seed#[8134D2D4AC565D62]) [    ] o.a.s.u.p.LogUpdateProcessorFactory [collection1]  webapp=null path=null params={wt=json&indent=true}{add=[1],commit=} 0 1
   [junit4]   2> 1651957 INFO  (TEST-TestMaxTokenLenTokenizer.testSingleFieldSameAnalyzers-seed#[8134D2D4AC565D62]) [    ] o.a.s.u.DirectUpdateHandler2 start commit{,optimize=false,openSearcher=true,waitSearcher=true,expungeDeletes=false,softCommit=false,prepareCommit=false}
   [junit4]   2> 1651957 INFO  (TEST-TestMaxTokenLenTokenizer.testSingleFieldSameAnalyzers-seed#[8134D2D4AC565D62]) [    ] o.a.s.u.SolrIndexWriter Calling setCommitData with IW:org.apache.solr.update.SolrIndexWriter@3e1bdfe8
   [junit4]   2> 1651958 INFO  (TEST-TestMaxTokenLenTokenizer.testSingleFieldSameAnalyzers-seed#[8134D2D4AC565D62]) [    ] o.a.s.s.SolrIndexSearcher Opening [Searcher@418e557a[collection1] main]
   [junit4]   2> 1651958 INFO  (TEST-TestMaxTokenLenTokenizer.testSingleFieldSameAnalyzers-seed#[8134D2D4AC565D62]) [    ] o.a.s.u.DirectUpdateHandler2 end_commit_flush
   [junit4]   2> 1651958 INFO  (searcherExecutor-6231-thread-1) [    ] o.a.s.c.SolrCore [collection1] Registered new searcher Searcher@418e557a[collection1] main{ExitableDirectoryReader(UninvertingDirectoryReader(Uninverting(_0(6.7.0):C1) Uninverting(_1(6.7.0):C1)))}
   [junit4]   2> 1651958 INFO  (TEST-TestMaxTokenLenTokenizer.testSingleFieldSameAnalyzers-seed#[8134D2D4AC565D62]) [    ] o.a.s.u.p.LogUpdateProcessorFactory [collection1]  webapp=null path=null params={wt=json&indent=true}{add=[2],commit=} 0 1
   [junit4]   2> 1651958 INFO  (TEST-TestMaxTokenLenTokenizer.testSingleFieldSameAnalyzers-seed#[8134D2D4AC565D62]) [    ] o.a.s.u.DirectUpdateHandler2 start commit{,optimize=false,openSearcher=true,waitSearcher=true,expungeDeletes=false,softCommit=false,prepareCommit=false}
   [junit4]   2> 1651958 INFO  (TEST-TestMaxTokenLenTokenizer.testSingleFieldSameAnalyzers-seed#[8134D2D4AC565D62]) [    ] o.a.s.u.SolrIndexWriter Calling setCommitData with IW:org.apache.solr.update.SolrIndexWriter@3e1bdfe8
   [junit4]   2> 1651959 INFO  (TEST-TestMaxTokenLenTokenizer.testSingleFieldSameAnalyzers-seed#[8134D2D4AC565D62]) [    ] o.a.s.s.SolrIndexSearcher Opening [Searcher@501dabb[collection1] main]
   [junit4]   2> 1651959 INFO  (TEST-TestMaxTokenLenTokenizer.testSingleFieldSameAnalyzers-seed#[8134D2D4AC565D62]) [    ] o.a.s.u.DirectUpdateHandler2 end_commit_flush
   [junit4]   2> 1651959 INFO  (searcherExecutor-6231-thread-1) [    ] o.a.s.c.SolrCore [collection1] Registered new searcher Searcher@501dabb[collection1] main{ExitableDirectoryReader(UninvertingDirectoryReader(Uninverting(_0(6.7.0):C1) Uninverting(_1(6.7.0):C1) Uninverting(_2(6.7.0):C1)))}
   [junit4]   2> 1651959 INFO  (TEST-TestMaxTokenLenTokenizer.testSingleFieldSameAnalyzers-seed#[8134D2D4AC565D62]) [    ] o.a.s.u.p.LogUpdateProcessorFactory [collection1]  webapp=null path=null params={wt=json&indent=true}{add=[3],commit=} 0 0
   [junit4]   2> 1651959 INFO  (TEST-TestMaxTokenLenTokenizer.testSingleFieldSameAnalyzers-seed#[8134D2D4AC565D62]) [    ] o.a.s.u.DirectUpdateHandler2 start commit{,optimize=false,openSearcher=true,waitSearcher=true,expungeDeletes=false,softCommit=false,prepareCommit=false}
   [junit4]   2> 1651959 INFO  (TEST-TestMaxTokenLenTokenizer.testSingleFieldSameAnalyzers-seed#[8134D2D4AC565D62]) [    ] o.a.s.u.SolrIndexWriter Calling setCommitData with IW:org.apache.solr.update.SolrIndexWriter@3e1bdfe8
   [junit4]   2> 1651959 INFO  (TEST-TestMaxTokenLenTokenizer.testSingleFieldSameAnalyzers-seed#[8134D2D4AC565D62]) [    ] o.a.s.s.SolrIndexSearcher Opening [Searcher@57c887a1[collection1] main]
   [junit4]   2> 1651960 INFO  (TEST-TestMaxTokenLenTokenizer.testSingleFieldSameAnalyzers-seed#[8134D2D4AC565D62]) [    ] o.a.s.u.DirectUpdateHandler2 end_commit_flush
   [junit4]   2> 1651960 INFO  (searcherExecutor-6231-thread-1) [    ] o.a.s.c.SolrCore [collection1] Registered new searcher Searcher@57c887a1[collection1] main{ExitableDirectoryReader(UninvertingDirectoryReader(Uninverting(_0(6.7.0):C1) Uninverting(_1(6.7.0):C1) Uninverting(_2(6.7.0):C1) Uninverting(_3(6.7.0):C1)))}
   [junit4]   2> 1651960 INFO  (TEST-TestMaxTokenLenTokenizer.testSingleFieldSameAnalyzers-seed#[8134D2D4AC565D62]) [    ] o.a.s.u.p.LogUpdateProcessorFactory [collection1]  webapp=null path=null params={wt=json&indent=true}{add=[4],commit=} 0 0
   [junit4]   2> 1651960 INFO  (TEST-TestMaxTokenLenTokenizer.testSingleFieldSameAnalyzers-seed#[8134D2D4AC565D62]) [    ] o.a.s.u.DirectUpdateHandler2 start commit{,optimize=false,openSearcher=true,waitSearcher=true,expungeDeletes=false,softCommit=false,prepareCommit=false}
   [junit4]   2> 1651960 INFO  (TEST-TestMaxTokenLenTokenizer.testSingleFieldSameAnalyzers-seed#[8134D2D4AC565D62]) [    ] o.a.s.u.SolrIndexWriter Calling setCommitData with IW:org.apache.solr.update.SolrIndexWriter@3e1bdfe8
   [junit4]   2> 1651961 INFO  (TEST-TestMaxTokenLenTokenizer.testSingleFieldSameAnalyzers-seed#[8134D2D4AC565D62]) [    ] o.a.s.s.SolrIndexSearcher Opening [Searcher@7dde3689[collection1] main]
   [junit4]   2> 1651961 INFO  (TEST-TestMaxTokenLenTokenizer.testSingleFieldSameAnalyzers-seed#[8134D2D4AC565D62]) [    ] o.a.s.u.DirectUpdateHandler2 end_commit_flush
   [junit4]   2> 1651961 INFO  (searcherExecutor-6231-thread-1) [    ] o.a.s.c.SolrCore [collection1] Registered new searcher Searcher@7dde3689[collection1] main{ExitableDirectoryReader(UninvertingDirectoryReader(Uninverting(_0(6.7.0):C1) Uninverting(_1(6.7.0):C1) Uninverting(_2(6.7.0):C1) Uninverting(_3(6.7.0):C1) Uninverting(_4(6.7.0):C1)))}
   [junit4]   2> 1651961 INFO  (TEST-TestMaxTokenLenTokenizer.testSingleFieldSameAnalyzers-seed#[8134D2D4AC565D62]) [    ] o.a.s.u.p.LogUpdateProcessorFactory [collection1]  webapp=null path=null params={wt=json&indent=true}{add=[5],commit=} 0 1
   [junit4]   2> 1651961 INFO  (TEST-TestMaxTokenLenTokenizer.testSingleFieldSameAnalyzers-seed#[8134D2D4AC565D62]) [    ] o.a.s.u.DirectUpdateHandler2 start commit{,optimize=false,openSearcher=true,waitSearcher=true,expungeDeletes=false,softCommit=false,prepareCommit=false}
   [junit4]   2> 1651961 INFO  (TEST-TestMaxTokenLenTokenizer.testSingleFieldSameAnalyzers-seed#[8134D2D4AC565D62]) [    ] o.a.s.u.DirectUpdateHandler2 No uncommitted changes. Skipping IW.commit.
   [junit4]   2> 1651961 INFO  (TEST-TestMaxTokenLenTokenizer.testSingleFieldSameAnalyzers-seed#[8134D2D4AC565D62]) [    ] o.a.s.u.DirectUpdateHandler2 end_commit_flush
   [junit4]   2> 1651961 INFO  (TEST-TestMaxTokenLenTokenizer.testSingleFieldSameAnalyzers-seed#[8134D2D4AC565D62]) [    ] o.a.s.u.p.LogUpdateProcessorFactory [collection1]  webapp=null path=null params={}{commit=} 0 0
   [junit4]   2> 1651963 INFO  (TEST-TestMaxTokenLenTokenizer.testSingleFieldSameAnalyzers-seed#[8134D2D4AC565D62]) [    ] o.a.s.c.S.Request [collection1]  webapp=null path=null params={q=*:*&wt=xml} hits=5 status=0 QTime=0
   [junit4]   2> 1651963 INFO  (TEST-TestMaxTokenLenTokenizer.testSingleFieldSameAnalyzers-seed#[8134D2D4AC565D62]) [    ] o.a.s.c.S.Request [collection1]  webapp=null path=null params={q=letter0:l&wt=xml} hits=0 status=0 QTime=0
   [junit4]   2> 1651963 INFO  (TEST-TestMaxTokenLenTokenizer.testSingleFieldSameAnalyzers-seed#[8134D2D4AC565D62]) [    ] o.a.s.c.S.Request [collection1]  webapp=null path=null params={q=letter0:let&wt=xml} hits=1 status=0 QTime=0
   [junit4]   2> 1651963 INFO  (TEST-TestMaxTokenLenTokenizer.testSingleFieldSameAnalyzers-seed#[8134D2D4AC565D62]) [    ] o.a.s.c.S.Request [collection1]  webapp=null path=null params={q=letter0:lett&wt=xml} hits=0 status=0 QTime=0
   [junit4]   2> 1651963 ERROR (TEST-TestMaxTokenLenTokenizer.testSingleFieldSameAnalyzers-seed#[8134D2D4AC565D62]) [    ] o.a.s.SolrTestCaseJ4 REQUEST FAILED: xpath=//result[@numFound=1]
   [junit4]   2> 	xml response was: <?xml version="1.0" encoding="UTF-8"?>
   [junit4]   2> <response>
   [junit4]   2> <lst name="responseHeader"><int name="status">0</int><int name="QTime">0</int></lst><result name="response" numFound="0" start="0"></result>
   [junit4]   2> </response>
   [junit4]   2> 
   [junit4]   2> 	request was:q=letter0:lett&wt=xml
   [junit4]   2> 1651964 ERROR (TEST-TestMaxTokenLenTokenizer.testSingleFieldSameAnalyzers-seed#[8134D2D4AC565D62]) [    ] o.a.s.SolrTestCaseJ4 REQUEST FAILED: q=letter0:lett&wt=xml:java.lang.RuntimeException: REQUEST FAILED: xpath=//result[@numFound=1]
   [junit4]   2> 	xml response was: <?xml version="1.0" encoding="UTF-8"?>
   [junit4]   2> <response>
   [junit4]   2> <lst name="responseHeader"><int name="status">0</int><int name="QTime">0</int></lst><result name="response" numFound="0" start="0"></result>
   [junit4]   2> </response>
   [junit4]   2> 
   [junit4]   2> 	request was:q=letter0:lett&wt=xml
   [junit4]   2> 	at org.apache.solr.SolrTestCaseJ4.assertQ(SolrTestCaseJ4.java:888)
   [junit4]   2> 	at org.apache.solr.util.TestMaxTokenLenTokenizer.testSingleFieldSameAnalyzers(TestMaxTokenLenTokenizer.java:104)
   [junit4]   2> 	at sun.reflect.NativeMethodAccessorImpl.invoke0(Native Method)
   [junit4]   2> 	at sun.reflect.NativeMethodAccessorImpl.invoke(NativeMethodAccessorImpl.java:62)
   [junit4]   2> 	at sun.reflect.DelegatingMethodAccessorImpl.invoke(DelegatingMethodAccessorImpl.java:43)
   [junit4]   2> 	at java.lang.reflect.Method.invoke(Method.java:498)
   [junit4]   2> 	at com.carrotsearch.randomizedtesting.RandomizedRunner.invoke(RandomizedRunner.java:1713)
   [junit4]   2> 	at com.carrotsearch.randomizedtesting.RandomizedRunner$8.evaluate(RandomizedRunner.java:907)
   [junit4]   2> 	at com.carrotsearch.randomizedtesting.RandomizedRunner$9.evaluate(RandomizedRunner.java:943)
   [junit4]   2> 	at com.carrotsearch.randomizedtesting.RandomizedRunner$10.evaluate(RandomizedRunner.java:957)
   [junit4]   2> 	at com.carrotsearch.randomizedtesting.rules.SystemPropertiesRestoreRule$1.evaluate(SystemPropertiesRestoreRule.java:57)
   [junit4]   2> 	at org.apache.lucene.util.TestRuleSetupTeardownChained$1.evaluate(TestRuleSetupTeardownChained.java:49)
   [junit4]   2> 	at org.apache.lucene.util.AbstractBeforeAfterRule$1.evaluate(AbstractBeforeAfterRule.java:45)
   [junit4]   2> 	at org.apache.lucene.util.TestRuleThreadAndTestName$1.evaluate(TestRuleThreadAndTestName.java:48)
   [junit4]   2> 	at org.apache.lucene.util.TestRuleIgnoreAfterMaxFailures$1.evaluate(TestRuleIgnoreAfterMaxFailures.java:64)
   [junit4]   2> 	at org.apache.lucene.util.TestRuleMarkFailure$1.evaluate(TestRuleMarkFailure.java:47)
   [junit4]   2> 	at com.carrotsearch.randomizedtesting.rules.StatementAdapter.evaluate(StatementAdapter.java:36)
   [junit4]   2> 	at com.carrotsearch.randomizedtesting.ThreadLeakControl$StatementRunner.run(ThreadLeakControl.java:368)
   [junit4]   2> 	at com.carrotsearch.randomizedtesting.ThreadLeakControl.forkTimeoutingTask(ThreadLeakControl.java:817)
   [junit4]   2> 	at com.carrotsearch.randomizedtesting.ThreadLeakControl$3.evaluate(ThreadLeakControl.java:468)
   [junit4]   2> 	at com.carrotsearch.randomizedtesting.RandomizedRunner.runSingleTest(RandomizedRunner.java:916)
   [junit4]   2> 	at com.carrotsearch.randomizedtesting.RandomizedRunner$5.evaluate(RandomizedRunner.java:802)
   [junit4]   2> 	at com.carrotsearch.randomizedtesting.RandomizedRunner$6.evaluate(RandomizedRunner.java:852)
   [junit4]   2> 	at com.carrotsearch.randomizedtesting.RandomizedRunner$7.evaluate(RandomizedRunner.java:863)
   [junit4]   2> 	at com.carrotsearch.randomizedtesting.rules.StatementAdapter.evaluate(StatementAdapter.java:36)
   [junit4]   2> 	at com.carrotsearch.randomizedtesting.rules.SystemPropertiesRestoreRule$1.evaluate(SystemPropertiesRestoreRule.java:57)
   [junit4]   2> 	at org.apache.lucene.util.AbstractBeforeAfterRule$1.evaluate(AbstractBeforeAfterRule.java:45)
   [junit4]   2> 	at com.carrotsearch.randomizedtesting.rules.StatementAdapter.evaluate(StatementAdapter.java:36)
   [junit4]   2> 	at org.apache.lucene.util.TestRuleStoreClassName$1.evaluate(TestRuleStoreClassName.java:41)
   [junit4]   2> 	at com.carrotsearch.randomizedtesting.rules.NoShadowingOrOverridesOnMethodsRule$1.evaluate(NoShadowingOrOverridesOnMethodsRule.java:40)
   [junit4]   2> 	at com.carrotsearch.randomizedtesting.rules.NoShadowingOrOverridesOnMethodsRule$1.evaluate(NoShadowingOrOverridesOnMethodsRule.java:40)
   [junit4]   2> 	at com.carrotsearch.randomizedtesting.rules.StatementAdapter.evaluate(StatementAdapter.java:36)
   [junit4]   2> 	at com.carrotsearch.randomizedtesting.rules.StatementAdapter.evaluate(StatementAdapter.java:36)
   [junit4]   2> 	at com.carrotsearch.randomizedtesting.rules.StatementAdapter.evaluate(StatementAdapter.java:36)
   [junit4]   2> 	at org.apache.lucene.util.TestRuleAssertionsRequired$1.evaluate(TestRuleAssertionsRequired.java:53)
   [junit4]   2> 	at org.apache.lucene.util.TestRuleMarkFailure$1.evaluate(TestRuleMarkFailure.java:47)
   [junit4]   2> 	at org.apache.lucene.util.TestRuleIgnoreAfterMaxFailures$1.evaluate(TestRuleIgnoreAfterMaxFailures.java:64)
   [junit4]   2> 	at org.apache.lucene.util.TestRuleIgnoreTestSuites$1.evaluate(TestRuleIgnoreTestSuites.java:54)
   [junit4]   2> 	at com.carrotsearch.randomizedtesting.rules.StatementAdapter.evaluate(StatementAdapter.java:36)
   [junit4]   2> 	at com.carrotsearch.randomizedtesting.ThreadLeakControl$StatementRunner.run(ThreadLeakControl.java:368)
   [junit4]   2> 	at java.lang.Thread.run(Thread.java:748)
   [junit4]   2> 
   [junit4]   2> 1651964 INFO  (TEST-TestMaxTokenLenTokenizer.testSingleFieldSameAnalyzers-seed#[8134D2D4AC565D62]) [    ] o.a.s.SolrTestCaseJ4 ###Ending testSingleFieldSameAnalyzers
   [junit4]   2> NOTE: reproduce with: ant test  -Dtestcase=TestMaxTokenLenTokenizer -Dtests.method=testSingleFieldSameAnalyzers -Dtests.seed=8134D2D4AC565D62 -Dtests.multiplier=3 -Dtests.slow=true -Dtests.locale=mk -Dtests.timezone=Africa/Ceuta -Dtests.asserts=true -Dtests.file.encoding=ISO-8859-1
   [junit4] ERROR   0.01s J1 | TestMaxTokenLenTokenizer.testSingleFieldSameAnalyzers <<<
   [junit4]    > Throwable #1: java.lang.RuntimeException: Exception during query
   [junit4]    > 	at __randomizedtesting.SeedInfo.seed([8134D2D4AC565D62:EBE6EDBBF4B58DAD]:0)
   [junit4]    > 	at org.apache.solr.SolrTestCaseJ4.assertQ(SolrTestCaseJ4.java:895)
   [junit4]    > 	at org.apache.solr.util.TestMaxTokenLenTokenizer.testSingleFieldSameAnalyzers(TestMaxTokenLenTokenizer.java:104)
   [junit4]    > 	at java.lang.Thread.run(Thread.java:748)
   [junit4]    > Caused by: java.lang.RuntimeException: REQUEST FAILED: xpath=//result[@numFound=1]
   [junit4]    > 	xml response was: <?xml version="1.0" encoding="UTF-8"?>
   [junit4]    > <response>
   [junit4]    > <lst name="responseHeader"><int name="status">0</int><int name="QTime">0</int></lst><result name="response" numFound="0" start="0"></result>
   [junit4]    > </response>
   [junit4]    > 	request was:q=letter0:lett&wt=xml
   [junit4]    > 	at org.apache.solr.SolrTestCaseJ4.assertQ(SolrTestCaseJ4.java:888)
   [junit4]    > 	... 40 more
   [junit4]   2> 1651966 INFO  (TEST-TestMaxTokenLenTokenizer.testSingleFieldDiffAnalyzers-seed#[8134D2D4AC565D62]) [    ] o.a.s.SolrTestCaseJ4 ###Starting testSingleFieldDiffAnalyzers
   [junit4]   2> 1651966 INFO  (TEST-TestMaxTokenLenTokenizer.testSingleFieldDiffAnalyzers-seed#[8134D2D4AC565D62]) [    ] o.a.s.u.DirectUpdateHandler2 [collection1] REMOVING ALL DOCUMENTS FROM INDEX
   [junit4]   2> 1651966 INFO  (TEST-TestMaxTokenLenTokenizer.testSingleFieldDiffAnalyzers-seed#[8134D2D4AC565D62]) [    ] o.a.s.u.p.LogUpdateProcessorFactory [collection1]  webapp=null path=null params={_version_=-9223372036854775807&update.distrib=FROMLEADER&versions=true&wt=json&indent=true}{deleteByQuery=*:*} 0 0
   [junit4]   2> 1651966 INFO  (TEST-TestMaxTokenLenTokenizer.testSingleFieldDiffAnalyzers-seed#[8134D2D4AC565D62]) [    ] o.a.s.u.DirectUpdateHandler2 start commit{,optimize=false,openSearcher=true,waitSearcher=true,expungeDeletes=false,softCommit=false,prepareCommit=false}
   [junit4]   2> 1651966 INFO  (TEST-TestMaxTokenLenTokenizer.testSingleFieldDiffAnalyzers-seed#[8134D2D4AC565D62]) [    ] o.a.s.u.SolrIndexWriter Calling setCommitData with IW:org.apache.solr.update.SolrIndexWriter@3e1bdfe8
   [junit4]   2> 1651967 INFO  (TEST-TestMaxTokenLenTokenizer.testSingleFieldDiffAnalyzers-seed#[8134D2D4AC565D62]) [    ] o.a.s.s.SolrIndexSearcher Opening [Searcher@10b9b962[collection1] main]
   [junit4]   2> 1651967 INFO  (TEST-TestMaxTokenLenTokenizer.testSingleFieldDiffAnalyzers-seed#[8134D2D4AC565D62]) [    ] o.a.s.u.DirectUpdateHandler2 end_commit_flush
   [junit4]   2> 1651967 INFO  (searcherExecutor-6231-thread-1) [    ] o.a.s.c.SolrCore [collection1] Registered new searcher Searcher@10b9b962[collection1] main{ExitableDirectoryReader(UninvertingDirectoryReader(Uninverting(_5(6.7.0):C1)))}
   [junit4]   2> 1651968 INFO  (TEST-TestMaxTokenLenTokenizer.testSingleFieldDiffAnalyzers-seed#[8134D2D4AC565D62]) [    ] o.a.s.u.p.LogUpdateProcessorFactory [collection1]  webapp=null path=null params={wt=json&indent=true}{add=[1],commit=} 0 1
   [junit4]   2> 1651968 INFO  (TEST-TestMaxTokenLenTokenizer.testSingleFieldDiffAnalyzers-seed#[8134D2D4AC565D62]) [    ] o.a.s.u.DirectUpdateHandler2 start commit{,optimize=false,openSearcher=true,waitSearcher=true,expungeDeletes=false,softCommit=false,prepareCommit=false}
   [junit4]   2> 1651968 INFO  (TEST-TestMaxTokenLenTokenizer.testSingleFieldDiffAnalyzers-seed#[8134D2D4AC565D62]) [    ] o.a.s.u.SolrIndexWriter Calling setCommitData with IW:org.apache.solr.update.SolrIndexWriter@3e1bdfe8
   [junit4]   2> 1651968 INFO  (TEST-TestMaxTokenLenTokenizer.testSingleFieldDiffAnalyzers-seed#[8134D2D4AC565D62]) [    ] o.a.s.s.SolrIndexSearcher Opening [Searcher@36709fab[collection1] main]
   [junit4]   2> 1651968 INFO  (TEST-TestMaxTokenLenTokenizer.testSingleFieldDiffAnalyzers-seed#[8134D2D4AC565D62]) [    ] o.a.s.u.DirectUpdateHandler2 end_commit_flush
   [junit4]   2> 1651969 INFO  (searcherExecutor-6231-thread-1) [    ] o.a.s.c.SolrCore [collection1] Registered new searcher Searcher@36709fab[collection1] main{ExitableDirectoryReader(UninvertingDirectoryReader(Uninverting(_5(6.7.0):C1) Uninverting(_6(6.7.0):C1)))}
   [junit4]   2> 1651969 INFO  (TEST-TestMaxTokenLenTokenizer.testSingleFieldDiffAnalyzers-seed#[8134D2D4AC565D62]) [    ] o.a.s.u.p.LogUpdateProcessorFactory [collection1]  webapp=null path=null params={wt=json&indent=true}{add=[2],commit=} 0 1
   [junit4]   2> 1651969 INFO  (TEST-TestMaxTokenLenTokenizer.testSingleFieldDiffAnalyzers-seed#[8134D2D4AC565D62]) [    ] o.a.s.u.DirectUpdateHandler2 start commit{,optimize=false,openSearcher=true,waitSearcher=true,expungeDeletes=false,softCommit=false,prepareCommit=false}
   [junit4]   2> 1651969 INFO  (TEST-TestMaxTokenLenTokenizer.testSingleFieldDiffAnalyzers-seed#[8134D2D4AC565D62]) [    ] o.a.s.u.SolrIndexWriter Calling setCommitData with IW:org.apache.solr.update.SolrIndexWriter@3e1bdfe8
   [junit4]   2> 1651969 INFO  (TEST-TestMaxTokenLenTokenizer.testSingleFieldDiffAnalyzers-seed#[8134D2D4AC565D62]) [    ] o.a.s.s.SolrIndexSearcher Opening [Searcher@9c4eee9[collection1] main]
   [junit4]   2> 1651970 INFO  (TEST-TestMaxTokenLenTokenizer.testSingleFieldDiffAnalyzers-seed#[8134D2D4AC565D62]) [    ] o.a.s.u.DirectUpdateHandler2 end_commit_flush
   [junit4]   2> 1651970 INFO  (searcherExecutor-6231-thread-1) [    ] o.a.s.c.SolrCore [collection1] Registered new searcher Searcher@9c4eee9[collection1] main{ExitableDirectoryReader(UninvertingDirectoryReader(Uninverting(_5(6.7.0):C1) Uninverting(_6(6.7.0):C1) Uninverting(_7(6.7.0):C1)))}
   [junit4]   2> 1651970 INFO  (TEST-TestMaxTokenLenTokenizer.testSingleFieldDiffAnalyzers-seed#[8134D2D4AC565D62]) [    ] o.a.s.u.p.LogUpdateProcessorFactory [collection1]  webapp=null path=null params={wt=json&indent=true}{add=[3],commit=} 0 1
   [junit4]   2> 1651970 INFO  (TEST-TestMaxTokenLenTokenizer.testSingleFieldDiffAnalyzers-seed#[8134D2D4AC565D62]) [    ] o.a.s.u.DirectUpdateHandler2 start commit{,optimize=false,openSearcher=true,waitSearcher=true,expungeDeletes=false,softCommit=false,prepareCommit=false}
   [junit4]   2> 1651970 INFO  (TEST-TestMaxTokenLenTokenizer.testSingleFieldDiffAnalyzers-seed#[8134D2D4AC565D62]) [    ] o.a.s.u.SolrIndexWriter Calling setCommitData with IW:org.apache.solr.update.SolrIndexWriter@3e1bdfe8
   [junit4]   2> 1651971 INFO  (TEST-TestMaxTokenLenTokenizer.testSingleFieldDiffAnalyzers-seed#[8134D2D4AC565D62]) [    ] o.a.s.s.SolrIndexSearcher Opening [Searcher@32477203[collection1] main]
   [junit4]   2> 1651971 INFO  (TEST-TestMaxTokenLenTokenizer.testSingleFieldDiffAnalyzers-seed#[8134D2D4AC565D62]) [    ] o.a.s.u.DirectUpdateHandler2 end_commit_flush
   [junit4]   2> 1651971 INFO  (searcherExecutor-6231-thread-1) [    ] o.a.s.c.SolrCore [collection1] Registered new searcher Searcher@32477203[collection1] main{ExitableDirectoryReader(UninvertingDirectoryReader(Uninverting(_5(6.7.0):C1) Uninverting(_6(6.7.0):C1) Uninverting(_7(6.7.0):C1) Uninverting(_8(6.7.0):C1)))}
   [junit4]   2> 1651971 INFO  (TEST-TestMaxTokenLenTokenizer.testSingleFieldDiffAnalyzers-seed#[8134D2D4AC565D62]) [    ] o.a.s.u.p.LogUpdateProcessorFactory [collection1]  webapp=null path=null params={wt=json&indent=true}{add=[4],commit=} 0 1
   [junit4]   2> 1651971 INFO  (TEST-TestMaxTokenLenTokenizer.testSingleFieldDiffAnalyzers-seed#[8134D2D4AC565D62]) [    ] o.a.s.u.DirectUpdateHandler2 start commit{,optimize=false,openSearcher=true,waitSearcher=true,expungeDeletes=false,softCommit=false,prepareCommit=false}
   [junit4]   2> 1651971 INFO  (TEST-TestMaxTokenLenTokenizer.testSingleFieldDiffAnalyzers-seed#[8134D2D4AC565D62]) [    ] o.a.s.u.SolrIndexWriter Calling setCommitData with IW:org.apache.solr.update.SolrIndexWriter@3e1bdfe8
   [junit4]   2> 1651972 INFO  (TEST-TestMaxTokenLenTokenizer.testSingleFieldDiffAnalyzers-seed#[8134D2D4AC565D62]) [    ] o.a.s.s.SolrIndexSearcher Opening [Searcher@23d19fa2[collection1] main]
   [junit4]   2> 1651972 INFO  (TEST-TestMaxTokenLenTokenizer.testSingleFieldDiffAnalyzers-seed#[8134D2D4AC565D62]) [    ] o.a.s.u.DirectUpdateHandler2 end_commit_flush
   [junit4]   2> 1651972 INFO  (searcherExecutor-6231-thread-1) [    ] o.a.s.c.SolrCore [collection1] Registered new searcher Searcher@23d19fa2[collection1] main{ExitableDirectoryReader(UninvertingDirectoryReader(Uninverting(_5(6.7.0):C1) Uninverting(_6(6.7.0):C1) Uninverting(_7(6.7.0):C1) Uninverting(_8(6.7.0):C1) Uninverting(_9(6.7.0):C1)))}
   [junit4]   2> 1651972 INFO  (TEST-TestMaxTokenLenTokenizer.testSingleFieldDiffAnalyzers-seed#[8134D2D4AC565D62]) [    ] o.a.s.u.p.LogUpdateProcessorFactory [collection1]  webapp=null path=null params={wt=json&indent=true}{add=[5],commit=} 0 1
   [junit4]   2> 1651972 INFO  (TEST-TestMaxTokenLenTokenizer.testSingleFieldDiffAnalyzers-seed#[8134D2D4AC565D62]) [    ] o.a.s.u.DirectUpdateHandler2 start commit{,optimize=false,openSearcher=true,waitSearcher=true,expungeDeletes=false,softCommit=false,prepareCommit=false}
   [junit4]   2> 1651972 INFO  (TEST-TestMaxTokenLenTokenizer.testSingleFieldDiffAnalyzers-seed#[8134D2D4AC565D62]) [    ] o.a.s.u.DirectUpdateHandler2 No uncommitted changes. Skipping IW.commit.
   [junit4]   2> 1651972 INFO  (TEST-TestMaxTokenLenTokenizer.testSingleFieldDiffAnalyzers-seed#[8134D2D4AC565D62]) [    ] o.a.s.u.DirectUpdateHandler2 end_commit_flush
   [junit4]   2> 1651972 INFO  (TEST-TestMaxTokenLenTokenizer.testSingleFieldDiffAnalyzers-seed#[8134D2D4AC565D62]) [    ] o.a.s.u.p.LogUpdateProcessorFactory [collection1]  webapp=null path=null params={}{commit=} 0 0
   [junit4]   2> 1651973 INFO  (TEST-TestMaxTokenLenTokenizer.testSingleFieldDiffAnalyzers-seed#[8134D2D4AC565D62]) [    ] o.a.s.c.S.Request [collection1]  webapp=null path=null params={q=*:*&wt=xml} hits=5 status=0 QTime=0
   [junit4]   2> 1651973 INFO  (TEST-TestMaxTokenLenTokenizer.testSingleFieldDiffAnalyzers-seed#[8134D2D4AC565D62]) [    ] o.a.s.c.S.Request [collection1]  webapp=null path=null params={q=letter:let&wt=xml} hits=1 status=0 QTime=0
   [junit4]   2> 1651973 INFO  (TEST-TestMaxTokenLenTokenizer.testSingleFieldDiffAnalyzers-seed#[8134D2D4AC565D62]) [    ] o.a.s.c.S.Request [collection1]  webapp=null path=null params={q=letter:lett&wt=xml} hits=0 status=0 QTime=0
   [junit4]   2> 1651973 INFO  (TEST-TestMaxTokenLenTokenizer.testSingleFieldDiffAnalyzers-seed#[8134D2D4AC565D62]) [    ] o.a.s.c.S.Request [collection1]  webapp=null path=null params={q=lowerCase:low&wt=xml} hits=1 status=0 QTime=0
   [junit4]   2> 1651973 INFO  (TEST-TestMaxTokenLenTokenizer.testSingleFieldDiffAnalyzers-seed#[8134D2D4AC565D62]) [    ] o.a.s.c.S.Request [collection1]  webapp=null path=null params={q=lowerCase:l&wt=xml} hits=0 status=0 QTime=0
   [junit4]   2> 1651973 INFO  (TEST-TestMaxTokenLenTokenizer.testSingleFieldDiffAnalyzers-seed#[8134D2D4AC565D62]) [    ] o.a.s.c.S.Request [collection1]  webapp=null path=null params={q=lowerCase:lo&wt=xml} hits=0 status=0 QTime=0
   [junit4]   2> 1651974 INFO  (TEST-TestMaxTokenLenTokenizer.testSingleFieldDiffAnalyzers-seed#[8134D2D4AC565D62]) [    ] o.a.s.c.S.Request [collection1]  webapp=null path=null params={q=lowerCase:lower&wt=xml} hits=0 status=0 QTime=0
   [junit4]   2> 1651974 INFO  (TEST-TestMaxTokenLenTokenizer.testSingleFieldDiffAnalyzers-seed#[8134D2D4AC565D62]) [    ] o.a.s.c.S.Request [collection1]  webapp=null path=null params={q=whiteSpace:whi&wt=xml} hits=1 status=0 QTime=0
   [junit4]   2> 1651974 INFO  (TEST-TestMaxTokenLenTokenizer.testSingleFieldDiffAnalyzers-seed#[8134D2D4AC565D62]) [    ] o.a.s.c.S.Request [collection1]  webapp=null path=null params={q=whiteSpace:teS&wt=xml} hits=1 status=0 QTime=0
   [junit4]   2> 1651974 INFO  (TEST-TestMaxTokenLenTokenizer.testSingleFieldDiffAnalyzers-seed#[8134D2D4AC565D62]) [    ] o.a.s.c.S.Request [collection1]  webapp=null path=null params={q=whiteSpace:in&wt=xml} hits=1 status=0 QTime=0
   [junit4]   2> 1651974 INFO  (TEST-TestMaxTokenLenTokenizer.testSingleFieldDiffAnalyzers-seed#[8134D2D4AC565D62]) [    ] o.a.s.c.S.Request [collection1]  webapp=null path=null params={q=whiteSpace:white&wt=xml} hits=0 status=0 QTime=0
   [junit4]   2> 1651974 INFO  (TEST-TestMaxTokenLenTokenizer.testSingleFieldDiffAnalyzers-seed#[8134D2D4AC565D62]) [    ] o.a.s.c.S.Request [collection1]  webapp=null path=null params={q=unicodeWhiteSpace:uni&wt=xml} hits=1 status=0 QTime=0
   [junit4]   2> 1651974 INFO  (TEST-TestMaxTokenLenTokenizer.testSingleFieldDiffAnalyzers-seed#[8134D2D4AC565D62]) [    ] o.a.s.c.S.Request [collection1]  webapp=null path=null params={q=unicodeWhiteSpace:cod&wt=xml} hits=1 status=0 QTime=0
   [junit4]   2> 1651975 INFO  (TEST-TestMaxTokenLenTokenizer.testSingleFieldDiffAnalyzers-seed#[8134D2D4AC565D62]) [    ] o.a.s.c.S.Request [collection1]  webapp=null path=null params={q=unicodeWhiteSpace:e&wt=xml} hits=1 status=0 QTime=0
   [junit4]   2> 1651975 INFO  (TEST-TestMaxTokenLenTokenizer.testSingleFieldDiffAnalyzers-seed#[8134D2D4AC565D62]) [    ] o.a.s.c.S.Request [collection1]  webapp=null path=null params={q=unicodeWhiteSpace:unico&wt=xml} hits=0 status=0 QTime=0
   [junit4]   2> 1651975 INFO  (TEST-TestMaxTokenLenTokenizer.testSingleFieldDiffAnalyzers-seed#[8134D2D4AC565D62]) [    ] o.a.s.c.S.Request [collection1]  webapp=null path=null params={q=keyword:keyword&wt=xml} hits=1 status=0 QTime=0
   [junit4]   2> 1651975 INFO  (TEST-TestMaxTokenLenTokenizer.testSingleFieldDiffAnalyzers-seed#[8134D2D4AC565D62]) [    ] o.a.s.c.S.Request [collection1]  webapp=null path=null params={q=keyword:key&wt=xml} hits=0 status=0 QTime=0
   [junit4]   2> 1651975 INFO  (TEST-TestMaxTokenLenTokenizer.testSingleFieldDiffAnalyzers-seed#[8134D2D4AC565D62]) [    ] o.a.s.SolrTestCaseJ4 ###Ending testSingleFieldDiffAnalyzers
   [junit4]   2> 1651975 INFO  (SUITE-TestMaxTokenLenTokenizer-seed#[8134D2D4AC565D62]-worker) [    ] o.a.s.SolrTestCaseJ4 ###deleteCore
   [junit4]   2> 1651975 INFO  (SUITE-TestMaxTokenLenTokenizer-seed#[8134D2D4AC565D62]-worker) [    ] o.a.s.c.CoreContainer Shutting down CoreContainer instance=420370204
   [junit4]   2> 1651975 INFO  (SUITE-TestMaxTokenLenTokenizer-seed#[8134D2D4AC565D62]-worker) [    ] o.a.s.m.SolrMetricManager Closing metric reporters for: solr.node
   [junit4]   2> 1651976 INFO  (SUITE-TestMaxTokenLenTokenizer-seed#[8134D2D4AC565D62]-worker) [    ] o.a.s.m.SolrMetricManager Closing metric reporters for: solr.jvm
   [junit4]   2> 1651976 INFO  (SUITE-TestMaxTokenLenTokenizer-seed#[8134D2D4AC565D62]-worker) [    ] o.a.s.m.SolrMetricManager Closing metric reporters for: solr.jetty
   [junit4]   2> 1651976 INFO  (SUITE-TestMaxTokenLenTokenizer-seed#[8134D2D4AC565D62]-worker) [    ] o.a.s.c.TransientSolrCoreCacheDefault Allocating transient cache for 2147483647 transient cores
   [junit4]   2> 1651977 INFO  (coreCloseExecutor-6235-thread-1) [    x:collection1] o.a.s.c.SolrCore [collection1]  CLOSING SolrCore org.apache.solr.core.SolrCore@65413724
   [junit4]   2> 1651977 INFO  (coreCloseExecutor-6235-thread-1) [    x:collection1] o.a.s.m.SolrMetricManager Closing metric reporters for: solr.core.collection1
   [junit4]   2> NOTE: leaving temporary files on disk at: /home/jenkins/workspace/Lucene-Solr-6.x-Linux/solr/build/solr-core/test/J1/temp/solr.util.TestMaxTokenLenTokenizer_8134D2D4AC565D62-001
   [junit4]   2> NOTE: test params are: codec=FastDecompressionCompressingStoredFields(storedFieldsFormat=CompressingStoredFieldsFormat(compressionMode=FAST_DECOMPRESSION, chunkSize=7, maxDocsPerChunk=3, blockSize=922), termVectorsFormat=CompressingTermVectorsFormat(compressionMode=FAST_DECOMPRESSION, chunkSize=7, blockSize=922)), sim=RandomSimilarity(queryNorm=false,coord=crazy): {}, locale=mk, timezone=Africa/Ceuta
   [junit4]   2> NOTE: Linux 4.10.0-21-generic amd64/Oracle Corporation 1.8.0_131 (64-bit)/cpus=8,threads=1,free=152463592,total=518979584
   [junit4]   2> NOTE: All tests run in this JVM: [TestStressUserVersions, BitVectorTest, TestConfigSets, TestSimpleQParserPlugin, LeaderInitiatedRecoveryOnShardRestartTest, SmileWriterTest, TemplateUpdateProcessorTest, TestPartialUpdateDeduplication, CopyFieldTest, DistanceFunctionTest, TestFiltering, SolrMetricReporterTest, HdfsBasicDistributedZkTest, ClassificationUpdateProcessorFactoryTest, SchemaVersionSpecificBehaviorTest, HttpSolrCallGetCoreTest, HighlighterMaxOffsetTest, CollectionsAPIDistributedZkTest, SharedFSAutoReplicaFailoverUtilsTest, HdfsRecoveryZkTest, TestShardHandlerFactory, TestHashPartitioner, TestUpdate, InfixSuggestersTest, TestIntervalFaceting, LeaderFailoverAfterPartitionTest, CoreSorterTest, TestCustomDocTransformer, UUIDUpdateProcessorFallbackTest, TestNumericTerms64, TestSolrCloudWithDelegationTokens, MergeStrategyTest, TestFastOutputStream, CloneFieldUpdateProcessorFactoryTest, ZkSolrClientTest, BJQParserTest, BadCopyFieldTest, ChaosMonkeySafeLeaderTest, TestDistributedGrouping, CollectionStateFormat2Test, TestWordDelimiterFilterFactory, TestSolrCLIRunExample, SpellingQueryConverterTest, TestUseDocValuesAsStored, DocumentBuilderTest, TestStressVersions, RAMDirectoryFactoryTest, JSONWriterTest, TestFieldCacheWithThreads, TestConfigOverlay, TestPointFields, SampleTest, CollectionsAPISolrJTest, IndexBasedSpellCheckerTest, TestSystemCollAutoCreate, RemoteQueryErrorTest, CSVRequestHandlerTest, CdcrRequestHandlerTest, SpellCheckComponentTest, JsonLoaderTest, TestFieldCollectionResource, TestSweetSpotSimilarityFactory, DistributedQueueTest, WrapperMergePolicyFactoryTest, TestFieldCache, AnalysisErrorHandlingTest, TestManagedStopFilterFactory, TestSchemaSimilarityResource, TestRTGBase, TestRecoveryHdfs, HdfsDirectoryFactoryTest, TestJsonRequest, TestInitParams, ShardRoutingTest, TestSubQueryTransformerDistrib, SolrIndexSplitterTest, SearchHandlerTest, DistributedFacetPivotLargeTest, OutOfBoxZkACLAndCredentialsProvidersTest, TestReqParamsAPI, TestStressCloudBlindAtomicUpdates, TestSolrIndexConfig, DocValuesTest, BlockCacheTest, SpellCheckCollatorWithCollapseTest, TestInPlaceUpdatesStandalone, TestCopyFieldCollectionResource, DistributedDebugComponentTest, TestDeleteCollectionOnDownNodes, DateMathParserTest, CdcrBootstrapTest, TestQuerySenderListener, SpellCheckCollatorTest, TestSolrCoreSnapshots, TestDistributedStatsComponentCardinality, MetricsHandlerTest, TestEmbeddedSolrServerConstructors, ConnectionReuseTest, TestGraphMLResponseWriter, CoreAdminRequestStatusTest, TestFieldCacheSort, SolrCloudExampleTest, TestMultiWordSynonyms, SolrInfoMBeanTest, TestMinMaxOnMultiValuedField, TestFileDictionaryLookup, TestCloudDeleteByQuery, TestCollectionAPIs, TestLMDirichletSimilarityFactory, TestSuggestSpellingConverter, RestartWhileUpdatingTest, TestSegmentSorting, DistributedMLTComponentTest, TestLeaderElectionZkExpiry, TriLevelCompositeIdRoutingTest, TestFilteredDocIdSet, ZkStateReaderTest, CustomCollectionTest, DistribCursorPagingTest, HttpPartitionTest, OverseerCollectionConfigSetProcessorTest, OverseerModifyCollectionTest, OverseerStatusTest, OverseerTaskQueueTest, ReplaceNodeTest, SharedFSAutoReplicaFailoverTest, SolrCLIZkUtilsTest, SolrXmlInZkTest, TestCloudInspectUtil, TestCloudJSONFacetJoinDomain, TestCloudRecovery, TestRequestForwarding, TestSSLRandomization, TestShortCircuitedRequests, TestSolrCloudWithSecureImpersonation, TestStressLiveNodes, HdfsChaosMonkeySafeLeaderTest, HdfsCollectionsAPIDistributedZkTest, HdfsNNFailoverTest, HdfsRecoverLeaseTest, HdfsThreadLeakTest, HdfsWriteToMultipleCollectionsTest, TestClusterStateMutator, RuleEngineTest, RulesTest, TestReloadAndDeleteDocs, TestSimpleTextCodec, TestSolrDynamicMBean, TestSolrXml, TestSolrCloudSnapshots, TestHdfsBackupRestoreCore, TestReplicationHandlerBackup, InfoHandlerTest, SegmentsInfoRequestHandlerTest, TestConfigsApi, TestCoreAdminApis, DistributedFacetExistsSmallTest, DistributedFacetPivotWhiteBoxTest, DistributedSuggestComponentTest, SuggestComponentContextFilterQueryTest, TestExpandComponent, TestHttpShardHandlerFactory, TestPivotHelperCode, JavabinLoaderTest, JvmMetricsTest, SolrCoreMetricManagerTest, SolrMetricManagerTest, SolrMetricsIntegrationTest, SolrJmxReporterTest, SolrSlf4jReporterTest, TestMacroExpander, TestExportWriter, TestRawResponseWriter, TestChildDocTransformer, TestManagedResourceStorage, TestBulkSchemaAPI, BooleanFieldTest, DateRangeFieldTest, ManagedSchemaRoundRobinCloudTest, TestCloudSchemaless, TestSortByMinMaxFunction, BlockJoinFacetDistribTest, CloudMLTQParserTest, SimpleMLTQParserTest, TestClassicSimilarityFactory, TestPerFieldSimilarityClassic, TestPerFieldSimilarityWithDefaultOverride, TestExactSharedStatsCache, BasicAuthIntegrationTest, TestAuthorizationFramework, ParsingFieldUpdateProcessorsTest, PreAnalyzedUpdateProcessorTest, TolerantUpdateProcessorTest, JsonValidatorTest, TestMaxTokenLenTokenizer]
   [junit4] Completed [706/715 (2!)] on J1 in 0.16s, 2 tests, 1 error <<< FAILURES!

[...truncated 43513 lines...]

Mime
View raw message