lucene-dev mailing list archives

Site index · List index
Message view « Date » · « Thread »
Top « Date » · « Thread »
From Apache Jenkins Server <jenk...@builds.apache.org>
Subject [JENKINS] Lucene-Solr-Tests-master - Build # 1841 - Failure
Date Sat, 20 May 2017 15:25:25 GMT
Build: https://builds.apache.org/job/Lucene-Solr-Tests-master/1841/

4 tests failed.
FAILED:  org.apache.solr.ltr.TestLTRQParserPlugin.ltrMoreResultsThanReRankedTest

Error Message:
mismatch: '0.09271725'!='0.105360515' @ response/docs/[3]/score

Stack Trace:
java.lang.RuntimeException: mismatch: '0.09271725'!='0.105360515' @ response/docs/[3]/score
	at __randomizedtesting.SeedInfo.seed([A5EE8440912DEDD3:6C9635274EE2BA12]:0)
	at org.apache.solr.util.RestTestBase.assertJQ(RestTestBase.java:248)
	at org.apache.solr.util.RestTestBase.assertJQ(RestTestBase.java:192)
	at org.apache.solr.ltr.TestLTRQParserPlugin.ltrMoreResultsThanReRankedTest(TestLTRQParserPlugin.java:94)
	at sun.reflect.NativeMethodAccessorImpl.invoke0(Native Method)
	at sun.reflect.NativeMethodAccessorImpl.invoke(NativeMethodAccessorImpl.java:62)
	at sun.reflect.DelegatingMethodAccessorImpl.invoke(DelegatingMethodAccessorImpl.java:43)
	at java.lang.reflect.Method.invoke(Method.java:498)
	at com.carrotsearch.randomizedtesting.RandomizedRunner.invoke(RandomizedRunner.java:1713)
	at com.carrotsearch.randomizedtesting.RandomizedRunner$8.evaluate(RandomizedRunner.java:907)
	at com.carrotsearch.randomizedtesting.RandomizedRunner$9.evaluate(RandomizedRunner.java:943)
	at com.carrotsearch.randomizedtesting.RandomizedRunner$10.evaluate(RandomizedRunner.java:957)
	at com.carrotsearch.randomizedtesting.rules.SystemPropertiesRestoreRule$1.evaluate(SystemPropertiesRestoreRule.java:57)
	at org.apache.lucene.util.TestRuleSetupTeardownChained$1.evaluate(TestRuleSetupTeardownChained.java:49)
	at org.apache.lucene.util.AbstractBeforeAfterRule$1.evaluate(AbstractBeforeAfterRule.java:45)
	at org.apache.lucene.util.TestRuleThreadAndTestName$1.evaluate(TestRuleThreadAndTestName.java:48)
	at org.apache.lucene.util.TestRuleIgnoreAfterMaxFailures$1.evaluate(TestRuleIgnoreAfterMaxFailures.java:64)
	at org.apache.lucene.util.TestRuleMarkFailure$1.evaluate(TestRuleMarkFailure.java:47)
	at com.carrotsearch.randomizedtesting.rules.StatementAdapter.evaluate(StatementAdapter.java:36)
	at com.carrotsearch.randomizedtesting.ThreadLeakControl$StatementRunner.run(ThreadLeakControl.java:368)
	at com.carrotsearch.randomizedtesting.ThreadLeakControl.forkTimeoutingTask(ThreadLeakControl.java:817)
	at com.carrotsearch.randomizedtesting.ThreadLeakControl$3.evaluate(ThreadLeakControl.java:468)
	at com.carrotsearch.randomizedtesting.RandomizedRunner.runSingleTest(RandomizedRunner.java:916)
	at com.carrotsearch.randomizedtesting.RandomizedRunner$5.evaluate(RandomizedRunner.java:802)
	at com.carrotsearch.randomizedtesting.RandomizedRunner$6.evaluate(RandomizedRunner.java:852)
	at com.carrotsearch.randomizedtesting.RandomizedRunner$7.evaluate(RandomizedRunner.java:863)
	at com.carrotsearch.randomizedtesting.rules.StatementAdapter.evaluate(StatementAdapter.java:36)
	at com.carrotsearch.randomizedtesting.rules.SystemPropertiesRestoreRule$1.evaluate(SystemPropertiesRestoreRule.java:57)
	at org.apache.lucene.util.AbstractBeforeAfterRule$1.evaluate(AbstractBeforeAfterRule.java:45)
	at com.carrotsearch.randomizedtesting.rules.StatementAdapter.evaluate(StatementAdapter.java:36)
	at org.apache.lucene.util.TestRuleStoreClassName$1.evaluate(TestRuleStoreClassName.java:41)
	at com.carrotsearch.randomizedtesting.rules.NoShadowingOrOverridesOnMethodsRule$1.evaluate(NoShadowingOrOverridesOnMethodsRule.java:40)
	at com.carrotsearch.randomizedtesting.rules.NoShadowingOrOverridesOnMethodsRule$1.evaluate(NoShadowingOrOverridesOnMethodsRule.java:40)
	at com.carrotsearch.randomizedtesting.rules.StatementAdapter.evaluate(StatementAdapter.java:36)
	at com.carrotsearch.randomizedtesting.rules.StatementAdapter.evaluate(StatementAdapter.java:36)
	at com.carrotsearch.randomizedtesting.rules.StatementAdapter.evaluate(StatementAdapter.java:36)
	at org.apache.lucene.util.TestRuleAssertionsRequired$1.evaluate(TestRuleAssertionsRequired.java:53)
	at org.apache.lucene.util.TestRuleMarkFailure$1.evaluate(TestRuleMarkFailure.java:47)
	at org.apache.lucene.util.TestRuleIgnoreAfterMaxFailures$1.evaluate(TestRuleIgnoreAfterMaxFailures.java:64)
	at org.apache.lucene.util.TestRuleIgnoreTestSuites$1.evaluate(TestRuleIgnoreTestSuites.java:54)
	at com.carrotsearch.randomizedtesting.rules.StatementAdapter.evaluate(StatementAdapter.java:36)
	at com.carrotsearch.randomizedtesting.ThreadLeakControl$StatementRunner.run(ThreadLeakControl.java:368)
	at java.lang.Thread.run(Thread.java:745)


FAILED:  org.apache.solr.ltr.TestParallelWeightCreation.testLTRScoringQueryParallelWeightCreationResultOrder

Error Message:
mismatch: '3'!='4' @ response/docs/[0]/id

Stack Trace:
java.lang.RuntimeException: mismatch: '3'!='4' @ response/docs/[0]/id
	at __randomizedtesting.SeedInfo.seed([A5EE8440912DEDD3:C0A2A4205B4F8A3B]:0)
	at org.apache.solr.util.RestTestBase.assertJQ(RestTestBase.java:248)
	at org.apache.solr.util.RestTestBase.assertJQ(RestTestBase.java:192)
	at org.apache.solr.ltr.TestParallelWeightCreation.testLTRScoringQueryParallelWeightCreationResultOrder(TestParallelWeightCreation.java:45)
	at sun.reflect.NativeMethodAccessorImpl.invoke0(Native Method)
	at sun.reflect.NativeMethodAccessorImpl.invoke(NativeMethodAccessorImpl.java:62)
	at sun.reflect.DelegatingMethodAccessorImpl.invoke(DelegatingMethodAccessorImpl.java:43)
	at java.lang.reflect.Method.invoke(Method.java:498)
	at com.carrotsearch.randomizedtesting.RandomizedRunner.invoke(RandomizedRunner.java:1713)
	at com.carrotsearch.randomizedtesting.RandomizedRunner$8.evaluate(RandomizedRunner.java:907)
	at com.carrotsearch.randomizedtesting.RandomizedRunner$9.evaluate(RandomizedRunner.java:943)
	at com.carrotsearch.randomizedtesting.RandomizedRunner$10.evaluate(RandomizedRunner.java:957)
	at com.carrotsearch.randomizedtesting.rules.SystemPropertiesRestoreRule$1.evaluate(SystemPropertiesRestoreRule.java:57)
	at org.apache.lucene.util.TestRuleSetupTeardownChained$1.evaluate(TestRuleSetupTeardownChained.java:49)
	at org.apache.lucene.util.AbstractBeforeAfterRule$1.evaluate(AbstractBeforeAfterRule.java:45)
	at org.apache.lucene.util.TestRuleThreadAndTestName$1.evaluate(TestRuleThreadAndTestName.java:48)
	at org.apache.lucene.util.TestRuleIgnoreAfterMaxFailures$1.evaluate(TestRuleIgnoreAfterMaxFailures.java:64)
	at org.apache.lucene.util.TestRuleMarkFailure$1.evaluate(TestRuleMarkFailure.java:47)
	at com.carrotsearch.randomizedtesting.rules.StatementAdapter.evaluate(StatementAdapter.java:36)
	at com.carrotsearch.randomizedtesting.ThreadLeakControl$StatementRunner.run(ThreadLeakControl.java:368)
	at com.carrotsearch.randomizedtesting.ThreadLeakControl.forkTimeoutingTask(ThreadLeakControl.java:817)
	at com.carrotsearch.randomizedtesting.ThreadLeakControl$3.evaluate(ThreadLeakControl.java:468)
	at com.carrotsearch.randomizedtesting.RandomizedRunner.runSingleTest(RandomizedRunner.java:916)
	at com.carrotsearch.randomizedtesting.RandomizedRunner$5.evaluate(RandomizedRunner.java:802)
	at com.carrotsearch.randomizedtesting.RandomizedRunner$6.evaluate(RandomizedRunner.java:852)
	at com.carrotsearch.randomizedtesting.RandomizedRunner$7.evaluate(RandomizedRunner.java:863)
	at com.carrotsearch.randomizedtesting.rules.StatementAdapter.evaluate(StatementAdapter.java:36)
	at com.carrotsearch.randomizedtesting.rules.SystemPropertiesRestoreRule$1.evaluate(SystemPropertiesRestoreRule.java:57)
	at org.apache.lucene.util.AbstractBeforeAfterRule$1.evaluate(AbstractBeforeAfterRule.java:45)
	at com.carrotsearch.randomizedtesting.rules.StatementAdapter.evaluate(StatementAdapter.java:36)
	at org.apache.lucene.util.TestRuleStoreClassName$1.evaluate(TestRuleStoreClassName.java:41)
	at com.carrotsearch.randomizedtesting.rules.NoShadowingOrOverridesOnMethodsRule$1.evaluate(NoShadowingOrOverridesOnMethodsRule.java:40)
	at com.carrotsearch.randomizedtesting.rules.NoShadowingOrOverridesOnMethodsRule$1.evaluate(NoShadowingOrOverridesOnMethodsRule.java:40)
	at com.carrotsearch.randomizedtesting.rules.StatementAdapter.evaluate(StatementAdapter.java:36)
	at com.carrotsearch.randomizedtesting.rules.StatementAdapter.evaluate(StatementAdapter.java:36)
	at com.carrotsearch.randomizedtesting.rules.StatementAdapter.evaluate(StatementAdapter.java:36)
	at org.apache.lucene.util.TestRuleAssertionsRequired$1.evaluate(TestRuleAssertionsRequired.java:53)
	at org.apache.lucene.util.TestRuleMarkFailure$1.evaluate(TestRuleMarkFailure.java:47)
	at org.apache.lucene.util.TestRuleIgnoreAfterMaxFailures$1.evaluate(TestRuleIgnoreAfterMaxFailures.java:64)
	at org.apache.lucene.util.TestRuleIgnoreTestSuites$1.evaluate(TestRuleIgnoreTestSuites.java:54)
	at com.carrotsearch.randomizedtesting.rules.StatementAdapter.evaluate(StatementAdapter.java:36)
	at com.carrotsearch.randomizedtesting.ThreadLeakControl$StatementRunner.run(ThreadLeakControl.java:368)
	at java.lang.Thread.run(Thread.java:745)


FAILED:  org.apache.solr.ltr.TestSelectiveWeightCreation.testSelectiveWeightsRequestFeaturesFromDifferentStore

Error Message:
mismatch: '3'!='4' @ response/docs/[0]/id

Stack Trace:
java.lang.RuntimeException: mismatch: '3'!='4' @ response/docs/[0]/id
	at __randomizedtesting.SeedInfo.seed([A5EE8440912DEDD3:F8DF93851C119AB8]:0)
	at org.apache.solr.util.RestTestBase.assertJQ(RestTestBase.java:248)
	at org.apache.solr.util.RestTestBase.assertJQ(RestTestBase.java:192)
	at org.apache.solr.ltr.TestSelectiveWeightCreation.testSelectiveWeightsRequestFeaturesFromDifferentStore(TestSelectiveWeightCreation.java:230)
	at sun.reflect.NativeMethodAccessorImpl.invoke0(Native Method)
	at sun.reflect.NativeMethodAccessorImpl.invoke(NativeMethodAccessorImpl.java:62)
	at sun.reflect.DelegatingMethodAccessorImpl.invoke(DelegatingMethodAccessorImpl.java:43)
	at java.lang.reflect.Method.invoke(Method.java:498)
	at com.carrotsearch.randomizedtesting.RandomizedRunner.invoke(RandomizedRunner.java:1713)
	at com.carrotsearch.randomizedtesting.RandomizedRunner$8.evaluate(RandomizedRunner.java:907)
	at com.carrotsearch.randomizedtesting.RandomizedRunner$9.evaluate(RandomizedRunner.java:943)
	at com.carrotsearch.randomizedtesting.RandomizedRunner$10.evaluate(RandomizedRunner.java:957)
	at com.carrotsearch.randomizedtesting.rules.SystemPropertiesRestoreRule$1.evaluate(SystemPropertiesRestoreRule.java:57)
	at org.apache.lucene.util.TestRuleSetupTeardownChained$1.evaluate(TestRuleSetupTeardownChained.java:49)
	at org.apache.lucene.util.AbstractBeforeAfterRule$1.evaluate(AbstractBeforeAfterRule.java:45)
	at org.apache.lucene.util.TestRuleThreadAndTestName$1.evaluate(TestRuleThreadAndTestName.java:48)
	at org.apache.lucene.util.TestRuleIgnoreAfterMaxFailures$1.evaluate(TestRuleIgnoreAfterMaxFailures.java:64)
	at org.apache.lucene.util.TestRuleMarkFailure$1.evaluate(TestRuleMarkFailure.java:47)
	at com.carrotsearch.randomizedtesting.rules.StatementAdapter.evaluate(StatementAdapter.java:36)
	at com.carrotsearch.randomizedtesting.ThreadLeakControl$StatementRunner.run(ThreadLeakControl.java:368)
	at com.carrotsearch.randomizedtesting.ThreadLeakControl.forkTimeoutingTask(ThreadLeakControl.java:817)
	at com.carrotsearch.randomizedtesting.ThreadLeakControl$3.evaluate(ThreadLeakControl.java:468)
	at com.carrotsearch.randomizedtesting.RandomizedRunner.runSingleTest(RandomizedRunner.java:916)
	at com.carrotsearch.randomizedtesting.RandomizedRunner$5.evaluate(RandomizedRunner.java:802)
	at com.carrotsearch.randomizedtesting.RandomizedRunner$6.evaluate(RandomizedRunner.java:852)
	at com.carrotsearch.randomizedtesting.RandomizedRunner$7.evaluate(RandomizedRunner.java:863)
	at com.carrotsearch.randomizedtesting.rules.StatementAdapter.evaluate(StatementAdapter.java:36)
	at com.carrotsearch.randomizedtesting.rules.SystemPropertiesRestoreRule$1.evaluate(SystemPropertiesRestoreRule.java:57)
	at org.apache.lucene.util.AbstractBeforeAfterRule$1.evaluate(AbstractBeforeAfterRule.java:45)
	at com.carrotsearch.randomizedtesting.rules.StatementAdapter.evaluate(StatementAdapter.java:36)
	at org.apache.lucene.util.TestRuleStoreClassName$1.evaluate(TestRuleStoreClassName.java:41)
	at com.carrotsearch.randomizedtesting.rules.NoShadowingOrOverridesOnMethodsRule$1.evaluate(NoShadowingOrOverridesOnMethodsRule.java:40)
	at com.carrotsearch.randomizedtesting.rules.NoShadowingOrOverridesOnMethodsRule$1.evaluate(NoShadowingOrOverridesOnMethodsRule.java:40)
	at com.carrotsearch.randomizedtesting.rules.StatementAdapter.evaluate(StatementAdapter.java:36)
	at com.carrotsearch.randomizedtesting.rules.StatementAdapter.evaluate(StatementAdapter.java:36)
	at com.carrotsearch.randomizedtesting.rules.StatementAdapter.evaluate(StatementAdapter.java:36)
	at org.apache.lucene.util.TestRuleAssertionsRequired$1.evaluate(TestRuleAssertionsRequired.java:53)
	at org.apache.lucene.util.TestRuleMarkFailure$1.evaluate(TestRuleMarkFailure.java:47)
	at org.apache.lucene.util.TestRuleIgnoreAfterMaxFailures$1.evaluate(TestRuleIgnoreAfterMaxFailures.java:64)
	at org.apache.lucene.util.TestRuleIgnoreTestSuites$1.evaluate(TestRuleIgnoreTestSuites.java:54)
	at com.carrotsearch.randomizedtesting.rules.StatementAdapter.evaluate(StatementAdapter.java:36)
	at com.carrotsearch.randomizedtesting.ThreadLeakControl$StatementRunner.run(ThreadLeakControl.java:368)
	at java.lang.Thread.run(Thread.java:745)


FAILED:  org.apache.solr.ltr.feature.TestFieldLengthFeature.testRanking

Error Message:
mismatch: '8'!='1' @ response/docs/[0]/id

Stack Trace:
java.lang.RuntimeException: mismatch: '8'!='1' @ response/docs/[0]/id
	at __randomizedtesting.SeedInfo.seed([A5EE8440912DEDD3:3AD82DDE0957F21C]:0)
	at org.apache.solr.util.RestTestBase.assertJQ(RestTestBase.java:248)
	at org.apache.solr.util.RestTestBase.assertJQ(RestTestBase.java:192)
	at org.apache.solr.ltr.feature.TestFieldLengthFeature.testRanking(TestFieldLengthFeature.java:117)
	at sun.reflect.NativeMethodAccessorImpl.invoke0(Native Method)
	at sun.reflect.NativeMethodAccessorImpl.invoke(NativeMethodAccessorImpl.java:62)
	at sun.reflect.DelegatingMethodAccessorImpl.invoke(DelegatingMethodAccessorImpl.java:43)
	at java.lang.reflect.Method.invoke(Method.java:498)
	at com.carrotsearch.randomizedtesting.RandomizedRunner.invoke(RandomizedRunner.java:1713)
	at com.carrotsearch.randomizedtesting.RandomizedRunner$8.evaluate(RandomizedRunner.java:907)
	at com.carrotsearch.randomizedtesting.RandomizedRunner$9.evaluate(RandomizedRunner.java:943)
	at com.carrotsearch.randomizedtesting.RandomizedRunner$10.evaluate(RandomizedRunner.java:957)
	at com.carrotsearch.randomizedtesting.rules.SystemPropertiesRestoreRule$1.evaluate(SystemPropertiesRestoreRule.java:57)
	at org.apache.lucene.util.TestRuleSetupTeardownChained$1.evaluate(TestRuleSetupTeardownChained.java:49)
	at org.apache.lucene.util.AbstractBeforeAfterRule$1.evaluate(AbstractBeforeAfterRule.java:45)
	at org.apache.lucene.util.TestRuleThreadAndTestName$1.evaluate(TestRuleThreadAndTestName.java:48)
	at org.apache.lucene.util.TestRuleIgnoreAfterMaxFailures$1.evaluate(TestRuleIgnoreAfterMaxFailures.java:64)
	at org.apache.lucene.util.TestRuleMarkFailure$1.evaluate(TestRuleMarkFailure.java:47)
	at com.carrotsearch.randomizedtesting.rules.StatementAdapter.evaluate(StatementAdapter.java:36)
	at com.carrotsearch.randomizedtesting.ThreadLeakControl$StatementRunner.run(ThreadLeakControl.java:368)
	at com.carrotsearch.randomizedtesting.ThreadLeakControl.forkTimeoutingTask(ThreadLeakControl.java:817)
	at com.carrotsearch.randomizedtesting.ThreadLeakControl$3.evaluate(ThreadLeakControl.java:468)
	at com.carrotsearch.randomizedtesting.RandomizedRunner.runSingleTest(RandomizedRunner.java:916)
	at com.carrotsearch.randomizedtesting.RandomizedRunner$5.evaluate(RandomizedRunner.java:802)
	at com.carrotsearch.randomizedtesting.RandomizedRunner$6.evaluate(RandomizedRunner.java:852)
	at com.carrotsearch.randomizedtesting.RandomizedRunner$7.evaluate(RandomizedRunner.java:863)
	at com.carrotsearch.randomizedtesting.rules.StatementAdapter.evaluate(StatementAdapter.java:36)
	at com.carrotsearch.randomizedtesting.rules.SystemPropertiesRestoreRule$1.evaluate(SystemPropertiesRestoreRule.java:57)
	at org.apache.lucene.util.AbstractBeforeAfterRule$1.evaluate(AbstractBeforeAfterRule.java:45)
	at com.carrotsearch.randomizedtesting.rules.StatementAdapter.evaluate(StatementAdapter.java:36)
	at org.apache.lucene.util.TestRuleStoreClassName$1.evaluate(TestRuleStoreClassName.java:41)
	at com.carrotsearch.randomizedtesting.rules.NoShadowingOrOverridesOnMethodsRule$1.evaluate(NoShadowingOrOverridesOnMethodsRule.java:40)
	at com.carrotsearch.randomizedtesting.rules.NoShadowingOrOverridesOnMethodsRule$1.evaluate(NoShadowingOrOverridesOnMethodsRule.java:40)
	at com.carrotsearch.randomizedtesting.rules.StatementAdapter.evaluate(StatementAdapter.java:36)
	at com.carrotsearch.randomizedtesting.rules.StatementAdapter.evaluate(StatementAdapter.java:36)
	at com.carrotsearch.randomizedtesting.rules.StatementAdapter.evaluate(StatementAdapter.java:36)
	at org.apache.lucene.util.TestRuleAssertionsRequired$1.evaluate(TestRuleAssertionsRequired.java:53)
	at org.apache.lucene.util.TestRuleMarkFailure$1.evaluate(TestRuleMarkFailure.java:47)
	at org.apache.lucene.util.TestRuleIgnoreAfterMaxFailures$1.evaluate(TestRuleIgnoreAfterMaxFailures.java:64)
	at org.apache.lucene.util.TestRuleIgnoreTestSuites$1.evaluate(TestRuleIgnoreTestSuites.java:54)
	at com.carrotsearch.randomizedtesting.rules.StatementAdapter.evaluate(StatementAdapter.java:36)
	at com.carrotsearch.randomizedtesting.ThreadLeakControl$StatementRunner.run(ThreadLeakControl.java:368)
	at java.lang.Thread.run(Thread.java:745)




Build Log:
[...truncated 19663 lines...]
   [junit4] Suite: org.apache.solr.ltr.feature.TestFieldLengthFeature
   [junit4]   2> 0    INFO  (SUITE-TestFieldLengthFeature-seed#[A5EE8440912DEDD3]) [    ] o.a.s.c.SolrResourceLoader solr home defaulted to 'solr/' (could not find system property or JNDI)
   [junit4]   2> Creating dataDir: /x1/jenkins/jenkins-slave/workspace/Lucene-Solr-Tests-master/solr/build/contrib/solr-ltr/test/J0/temp/solr.ltr.feature.TestFieldLengthFeature_A5EE8440912DEDD3-001/init-core-data-001
   [junit4]   2> 919  INFO  (SUITE-TestFieldLengthFeature-seed#[A5EE8440912DEDD3]-worker) [    ] o.a.s.SolrTestCaseJ4 Using TrieFields
   [junit4]   2> 962  INFO  (SUITE-TestFieldLengthFeature-seed#[A5EE8440912DEDD3]-worker) [    ] o.e.j.u.log Logging initialized @3037ms
   [junit4]   2> 973  INFO  (SUITE-TestFieldLengthFeature-seed#[A5EE8440912DEDD3]-worker) [    ] o.a.s.SolrTestCaseJ4 Randomized ssl (true) and clientAuth (false) via: @org.apache.solr.util.RandomizeSSL(reason=, ssl=NaN, value=NaN, clientAuth=NaN)
   [junit4]   2> 1397 INFO  (SUITE-TestFieldLengthFeature-seed#[A5EE8440912DEDD3]-worker) [    ] o.a.s.SolrTestCaseJ4 ####initCore
   [junit4]   2> 1454 INFO  (SUITE-TestFieldLengthFeature-seed#[A5EE8440912DEDD3]-worker) [    ] o.a.s.c.SolrResourceLoader Using system property solr.solr.home: /x1/jenkins/jenkins-slave/workspace/Lucene-Solr-Tests-master/solr/contrib/ltr/src/test-files/solr
   [junit4]   2> 1663 INFO  (SUITE-TestFieldLengthFeature-seed#[A5EE8440912DEDD3]-worker) [    ] o.a.s.c.SolrConfig Using Lucene MatchVersion: 6.0.0
   [junit4]   2> 1902 INFO  (SUITE-TestFieldLengthFeature-seed#[A5EE8440912DEDD3]-worker) [    ] o.a.s.s.IndexSchema [null] Schema name=example
   [junit4]   2> 2241 INFO  (SUITE-TestFieldLengthFeature-seed#[A5EE8440912DEDD3]-worker) [    ] o.a.s.s.IndexSchema Loaded schema example/1.5 with uniqueid field id
   [junit4]   2> 3163 WARN  (SUITE-TestFieldLengthFeature-seed#[A5EE8440912DEDD3]-worker) [    ] o.a.s.m.r.SolrJmxReporter No JMX server found. Not exposing Solr metrics via JMX.
   [junit4]   2> 3163 WARN  (SUITE-TestFieldLengthFeature-seed#[A5EE8440912DEDD3]-worker) [    ] o.a.s.m.r.SolrJmxReporter No JMX server found. Not exposing Solr metrics via JMX.
   [junit4]   2> 3163 WARN  (SUITE-TestFieldLengthFeature-seed#[A5EE8440912DEDD3]-worker) [    ] o.a.s.m.r.SolrJmxReporter No JMX server found. Not exposing Solr metrics via JMX.
   [junit4]   2> 3250 INFO  (coreLoadExecutor-6-thread-1) [    x:collection1] o.a.s.c.SolrConfig Using Lucene MatchVersion: 6.0.0
   [junit4]   2> 3327 INFO  (coreLoadExecutor-6-thread-1) [    x:collection1] o.a.s.s.IndexSchema [collection1] Schema name=example
   [junit4]   2> 3368 INFO  (coreLoadExecutor-6-thread-1) [    x:collection1] o.a.s.s.IndexSchema Loaded schema example/1.5 with uniqueid field id
   [junit4]   2> 3381 INFO  (coreLoadExecutor-6-thread-1) [    x:collection1] o.a.s.c.CoreContainer Creating SolrCore 'collection1' using configuration from instancedir /x1/jenkins/jenkins-slave/workspace/Lucene-Solr-Tests-master/solr/contrib/ltr/src/test-files/solr/collection1, trusted=true
   [junit4]   2> 3473 WARN  (coreLoadExecutor-6-thread-1) [    x:collection1] o.a.s.m.r.SolrJmxReporter No JMX server found. Not exposing Solr metrics via JMX.
   [junit4]   2> 3481 INFO  (coreLoadExecutor-6-thread-1) [    x:collection1] o.a.s.c.SolrCore solr.RecoveryStrategy.Builder
   [junit4]   2> 3490 INFO  (coreLoadExecutor-6-thread-1) [    x:collection1] o.a.s.c.SolrCore [[collection1] ] Opening new SolrCore at [/x1/jenkins/jenkins-slave/workspace/Lucene-Solr-Tests-master/solr/contrib/ltr/src/test-files/solr/collection1], dataDir=[/x1/jenkins/jenkins-slave/workspace/Lucene-Solr-Tests-master/solr/build/contrib/solr-ltr/test/J0/temp/solr.ltr.feature.TestFieldLengthFeature_A5EE8440912DEDD3-001/init-core-data-001/]
   [junit4]   2> 4539 WARN  (coreLoadExecutor-6-thread-1) [    x:collection1] o.a.s.c.RequestHandlers no default request handler is registered (either '/select' or 'standard')
   [junit4]   2> 4577 INFO  (coreLoadExecutor-6-thread-1) [    x:collection1] o.a.s.u.UpdateHandler Using UpdateLog implementation: org.apache.solr.update.UpdateLog
   [junit4]   2> 4586 INFO  (coreLoadExecutor-6-thread-1) [    x:collection1] o.a.s.u.UpdateLog Initializing UpdateLog: dataDir= defaultSyncLevel=FLUSH numRecordsToKeep=100 maxNumLogsToKeep=10 numVersionBuckets=65536
   [junit4]   2> 4623 INFO  (coreLoadExecutor-6-thread-1) [    x:collection1] o.a.s.u.CommitTracker Hard AutoCommit: if uncommited for 15000ms; 
   [junit4]   2> 4624 INFO  (coreLoadExecutor-6-thread-1) [    x:collection1] o.a.s.u.CommitTracker Soft AutoCommit: if uncommited for 1000ms; 
   [junit4]   2> 4693 INFO  (coreLoadExecutor-6-thread-1) [    x:collection1] o.a.s.s.SolrIndexSearcher Opening [Searcher@773b405b[collection1] main]
   [junit4]   2> 4744 WARN  (coreLoadExecutor-6-thread-1) [    x:collection1] o.a.s.r.ManagedResourceStorage Cannot write to config directory /x1/jenkins/jenkins-slave/workspace/Lucene-Solr-Tests-master/solr/contrib/ltr/src/test-files/solr/collection1/conf; switching to use InMemory storage instead.
   [junit4]   2> 4801 INFO  (coreLoadExecutor-6-thread-1) [    x:collection1] o.a.s.r.RestManager Registered ManagedResource impl org.apache.solr.ltr.store.rest.ManagedFeatureStore for path /schema/feature-store
   [junit4]   2> 4802 WARN  (coreLoadExecutor-6-thread-1) [    x:collection1] o.a.s.r.ManagedResource No stored data found for /schema/feature-store
   [junit4]   2> 4802 INFO  (coreLoadExecutor-6-thread-1) [    x:collection1] o.a.s.l.s.r.ManagedFeatureStore ------ managed feature ~ loading ------
   [junit4]   2> 4802 INFO  (coreLoadExecutor-6-thread-1) [    x:collection1] o.a.s.r.ManagedResource Notified 1 observers of /schema/feature-store
   [junit4]   2> 4802 INFO  (coreLoadExecutor-6-thread-1) [    x:collection1] o.a.s.r.RestManager Registered new managed resource /schema/feature-store
   [junit4]   2> 4805 INFO  (coreLoadExecutor-6-thread-1) [    x:collection1] o.a.s.r.RestManager Registered ManagedResource impl org.apache.solr.ltr.store.rest.ManagedModelStore for path /schema/model-store
   [junit4]   2> 4820 WARN  (coreLoadExecutor-6-thread-1) [    x:collection1] o.a.s.r.ManagedResource No stored data found for /schema/model-store
   [junit4]   2> 4820 INFO  (coreLoadExecutor-6-thread-1) [    x:collection1] o.a.s.l.s.r.ManagedModelStore INIT model store
   [junit4]   2> 4820 INFO  (coreLoadExecutor-6-thread-1) [    x:collection1] o.a.s.l.s.r.ManagedModelStore ------ managed models ~ loading ------
   [junit4]   2> 4821 INFO  (coreLoadExecutor-6-thread-1) [    x:collection1] o.a.s.r.ManagedResource Notified 1 observers of /schema/model-store
   [junit4]   2> 4821 INFO  (coreLoadExecutor-6-thread-1) [    x:collection1] o.a.s.r.RestManager Registered new managed resource /schema/model-store
   [junit4]   2> 4867 INFO  (coreLoadExecutor-6-thread-1) [    x:collection1] o.a.s.h.ReplicationHandler Commits will be reserved for  10000
   [junit4]   2> 5105 INFO  (searcherExecutor-7-thread-1-processing-x:collection1) [    x:collection1] o.a.s.c.SolrCore [collection1] Registered new searcher Searcher@773b405b[collection1] main{ExitableDirectoryReader(UninvertingDirectoryReader())}
   [junit4]   2> 5107 INFO  (coreLoadExecutor-6-thread-1) [    x:collection1] o.a.s.u.UpdateLog Could not find max version in index or recent updates, using new clock 1567929126650642432
   [junit4]   2> 5130 INFO  (SUITE-TestFieldLengthFeature-seed#[A5EE8440912DEDD3]-worker) [    ] o.a.s.SolrTestCaseJ4 ####initCore end
   [junit4]   2> 5160 INFO  (SUITE-TestFieldLengthFeature-seed#[A5EE8440912DEDD3]-worker) [    ] o.a.s.SolrTestCaseJ4 ####initCore
   [junit4]   2> 5160 INFO  (SUITE-TestFieldLengthFeature-seed#[A5EE8440912DEDD3]-worker) [    ] o.a.s.SolrTestCaseJ4 ####initCore end
   [junit4]   2> 5163 INFO  (SUITE-TestFieldLengthFeature-seed#[A5EE8440912DEDD3]-worker) [    ] o.a.s.SolrTestCaseJ4 Writing core.properties file to /x1/jenkins/jenkins-slave/workspace/Lucene-Solr-Tests-master/solr/build/contrib/solr-ltr/test/J0/temp/solr.ltr.feature.TestFieldLengthFeature_A5EE8440912DEDD3-001/tempDir-003/cores/core
   [junit4]   2> 5701 INFO  (SUITE-TestFieldLengthFeature-seed#[A5EE8440912DEDD3]-worker) [    ] o.e.j.s.Server jetty-9.3.14.v20161028
   [junit4]   2> 5864 INFO  (SUITE-TestFieldLengthFeature-seed#[A5EE8440912DEDD3]-worker) [    ] o.e.j.s.h.ContextHandler Started o.e.j.s.ServletContextHandler@2bc2cf05{/solr,null,AVAILABLE}
   [junit4]   2> 5947 INFO  (SUITE-TestFieldLengthFeature-seed#[A5EE8440912DEDD3]-worker) [    ] o.e.j.s.AbstractConnector Started ServerConnector@111aef50{SSL,[ssl, http/1.1]}{127.0.0.1:34447}
   [junit4]   2> 5948 INFO  (SUITE-TestFieldLengthFeature-seed#[A5EE8440912DEDD3]-worker) [    ] o.e.j.s.Server Started @8030ms
   [junit4]   2> 5948 INFO  (SUITE-TestFieldLengthFeature-seed#[A5EE8440912DEDD3]-worker) [    ] o.a.s.c.s.e.JettySolrRunner Jetty properties: {hostContext=/solr, hostPort=34447, configSetBaseDir=/x1/jenkins/jenkins-slave/workspace/Lucene-Solr-Tests-master/solr/build/contrib/solr-ltr/test/J0/temp/solr.ltr.feature.TestFieldLengthFeature_A5EE8440912DEDD3-001/tempDir-001, coreRootDirectory=/x1/jenkins/jenkins-slave/workspace/Lucene-Solr-Tests-master/solr/build/contrib/solr-ltr/test/J0/temp/solr.ltr.feature.TestFieldLengthFeature_A5EE8440912DEDD3-001/tempDir-003/cores}
   [junit4]   2> 5971 ERROR (SUITE-TestFieldLengthFeature-seed#[A5EE8440912DEDD3]-worker) [    ] o.a.s.s.StartupLoggingUtils Missing Java Option solr.log.dir. Logging may be missing or incomplete.
   [junit4]   2> 5973 INFO  (SUITE-TestFieldLengthFeature-seed#[A5EE8440912DEDD3]-worker) [    ] o.a.s.s.SolrDispatchFilter  ___      _       Welcome to Apache Solr™ version 7.0.0
   [junit4]   2> 5974 INFO  (SUITE-TestFieldLengthFeature-seed#[A5EE8440912DEDD3]-worker) [    ] o.a.s.s.SolrDispatchFilter / __| ___| |_ _   Starting in standalone mode on port null
   [junit4]   2> 5976 INFO  (SUITE-TestFieldLengthFeature-seed#[A5EE8440912DEDD3]-worker) [    ] o.a.s.s.SolrDispatchFilter \__ \/ _ \ | '_|  Install dir: null
   [junit4]   2> 6001 INFO  (SUITE-TestFieldLengthFeature-seed#[A5EE8440912DEDD3]-worker) [    ] o.a.s.s.SolrDispatchFilter |___/\___/_|_|    Start time: 2017-05-20T15:22:18.903Z
   [junit4]   2> 6009 INFO  (SUITE-TestFieldLengthFeature-seed#[A5EE8440912DEDD3]-worker) [    ] o.a.s.c.SolrXmlConfig Loading container configuration from /x1/jenkins/jenkins-slave/workspace/Lucene-Solr-Tests-master/solr/build/contrib/solr-ltr/test/J0/temp/solr.ltr.feature.TestFieldLengthFeature_A5EE8440912DEDD3-001/tempDir-001/solr.xml
   [junit4]   2> 6177 INFO  (SUITE-TestFieldLengthFeature-seed#[A5EE8440912DEDD3]-worker) [    ] o.a.s.c.CorePropertiesLocator Found 1 core definitions underneath /x1/jenkins/jenkins-slave/workspace/Lucene-Solr-Tests-master/solr/build/contrib/solr-ltr/test/J0/temp/solr.ltr.feature.TestFieldLengthFeature_A5EE8440912DEDD3-001/tempDir-003/cores
   [junit4]   2> 6190 INFO  (SUITE-TestFieldLengthFeature-seed#[A5EE8440912DEDD3]-worker) [    ] o.a.s.c.CorePropertiesLocator Cores are: [collection1]
   [junit4]   2> 6322 INFO  (coreLoadExecutor-17-thread-1) [    x:collection1] o.a.s.c.SolrConfig Using Lucene MatchVersion: 6.0.0
   [junit4]   2> 6422 INFO  (coreLoadExecutor-17-thread-1) [    x:collection1] o.a.s.s.IndexSchema [collection1] Schema name=example
   [junit4]   2> 6496 INFO  (coreLoadExecutor-17-thread-1) [    x:collection1] o.a.s.s.IndexSchema Loaded schema example/1.5 with uniqueid field id
   [junit4]   2> 6510 INFO  (coreLoadExecutor-17-thread-1) [    x:collection1] o.a.s.c.CoreContainer Creating SolrCore 'collection1' using configuration from configset /x1/jenkins/jenkins-slave/workspace/Lucene-Solr-Tests-master/solr/build/contrib/solr-ltr/test/J0/temp/solr.ltr.feature.TestFieldLengthFeature_A5EE8440912DEDD3-001/tempDir-001/collection1, trusted=true
   [junit4]   2> 6512 INFO  (coreLoadExecutor-17-thread-1) [    x:collection1] o.a.s.c.SolrCore solr.RecoveryStrategy.Builder
   [junit4]   2> 6512 INFO  (coreLoadExecutor-17-thread-1) [    x:collection1] o.a.s.c.SolrCore [[collection1] ] Opening new SolrCore at [/x1/jenkins/jenkins-slave/workspace/Lucene-Solr-Tests-master/solr/build/contrib/solr-ltr/test/J0/temp/solr.ltr.feature.TestFieldLengthFeature_A5EE8440912DEDD3-001/tempDir-001/collection1], dataDir=[/x1/jenkins/jenkins-slave/workspace/Lucene-Solr-Tests-master/solr/build/contrib/solr-ltr/test/J0/temp/solr.ltr.feature.TestFieldLengthFeature_A5EE8440912DEDD3-001/tempDir-003/cores/core/data/]
   [junit4]   2> 6655 WARN  (coreLoadExecutor-17-thread-1) [    x:collection1] o.a.s.c.RequestHandlers no default request handler is registered (either '/select' or 'standard')
   [junit4]   2> 6666 INFO  (coreLoadExecutor-17-thread-1) [    x:collection1] o.a.s.u.UpdateHandler Using UpdateLog implementation: org.apache.solr.update.UpdateLog
   [junit4]   2> 6675 INFO  (coreLoadExecutor-17-thread-1) [    x:collection1] o.a.s.u.UpdateLog Initializing UpdateLog: dataDir= defaultSyncLevel=FLUSH numRecordsToKeep=100 maxNumLogsToKeep=10 numVersionBuckets=65536
   [junit4]   2> 6676 INFO  (coreLoadExecutor-17-thread-1) [    x:collection1] o.a.s.u.CommitTracker Hard AutoCommit: if uncommited for 15000ms; 
   [junit4]   2> 6677 INFO  (coreLoadExecutor-17-thread-1) [    x:collection1] o.a.s.u.CommitTracker Soft AutoCommit: if uncommited for 1000ms; 
   [junit4]   2> 6678 INFO  (coreLoadExecutor-17-thread-1) [    x:collection1] o.a.s.s.SolrIndexSearcher Opening [Searcher@7ea53d7d[collection1] main]
   [junit4]   2> 6679 INFO  (coreLoadExecutor-17-thread-1) [    x:collection1] o.a.s.r.ManagedResourceStorage File-based storage initialized to use dir: /x1/jenkins/jenkins-slave/workspace/Lucene-Solr-Tests-master/solr/build/contrib/solr-ltr/test/J0/temp/solr.ltr.feature.TestFieldLengthFeature_A5EE8440912DEDD3-001/tempDir-001/collection1/conf
   [junit4]   2> 6680 INFO  (coreLoadExecutor-17-thread-1) [    x:collection1] o.a.s.r.RestManager Registered ManagedResource impl org.apache.solr.ltr.store.rest.ManagedFeatureStore for path /schema/feature-store
   [junit4]   2> 6680 WARN  (coreLoadExecutor-17-thread-1) [    x:collection1] o.a.s.r.ManagedResource No stored data found for /schema/feature-store
   [junit4]   2> 6680 INFO  (coreLoadExecutor-17-thread-1) [    x:collection1] o.a.s.l.s.r.ManagedFeatureStore ------ managed feature ~ loading ------
   [junit4]   2> 6681 INFO  (coreLoadExecutor-17-thread-1) [    x:collection1] o.a.s.r.ManagedResource Notified 1 observers of /schema/feature-store
   [junit4]   2> 6681 INFO  (coreLoadExecutor-17-thread-1) [    x:collection1] o.a.s.r.RestManager Registered new managed resource /schema/feature-store
   [junit4]   2> 6681 INFO  (coreLoadExecutor-17-thread-1) [    x:collection1] o.a.s.r.RestManager Registered ManagedResource impl org.apache.solr.ltr.store.rest.ManagedModelStore for path /schema/model-store
   [junit4]   2> 6681 WARN  (coreLoadExecutor-17-thread-1) [    x:collection1] o.a.s.r.ManagedResource No stored data found for /schema/model-store
   [junit4]   2> 6681 INFO  (coreLoadExecutor-17-thread-1) [    x:collection1] o.a.s.l.s.r.ManagedModelStore INIT model store
   [junit4]   2> 6681 INFO  (coreLoadExecutor-17-thread-1) [    x:collection1] o.a.s.l.s.r.ManagedModelStore ------ managed models ~ loading ------
   [junit4]   2> 6682 INFO  (coreLoadExecutor-17-thread-1) [    x:collection1] o.a.s.r.ManagedResource Notified 1 observers of /schema/model-store
   [junit4]   2> 6682 INFO  (coreLoadExecutor-17-thread-1) [    x:collection1] o.a.s.r.RestManager Registered new managed resource /schema/model-store
   [junit4]   2> 6682 INFO  (coreLoadExecutor-17-thread-1) [    x:collection1] o.a.s.h.ReplicationHandler Commits will be reserved for  10000
   [junit4]   2> 6683 INFO  (coreLoadExecutor-17-thread-1) [    x:collection1] o.a.s.u.UpdateLog Could not find max version in index or recent updates, using new clock 1567929128303198208
   [junit4]   2> 6689 INFO  (searcherExecutor-18-thread-1-processing-x:collection1) [    x:collection1] o.a.s.c.SolrCore [collection1] Registered new searcher Searcher@7ea53d7d[collection1] main{ExitableDirectoryReader(UninvertingDirectoryReader())}
   [junit4]   2> 6931 INFO  (SUITE-TestFieldLengthFeature-seed#[A5EE8440912DEDD3]-worker) [    ] o.a.s.SolrJettyTestBase Jetty Assigned Port#34447
   [junit4]   2> 7805 INFO  (qtp275154846-25) [    x:collection1] o.a.s.u.p.LogUpdateProcessorFactory [collection1]  webapp=/solr path=/update params={stream.body=<add><doc><field+name%3D"id">1</field><field+name%3D"title">w1</field><field+name%3D"description">w1</field></doc></add>}{add=[1 (1567929129284665344)]} 0 305
   [junit4]   2> 7877 INFO  (qtp275154846-26) [    x:collection1] o.a.s.u.p.LogUpdateProcessorFactory [collection1]  webapp=/solr path=/update params={stream.body=<add><doc><field+name%3D"id">2</field><field+name%3D"title">w2+2asd+asdd+didid</field><field+name%3D"description">w2+2asd+asdd+didid</field></doc></add>}{add=[2 (1567929129541566464)]} 0 14
   [junit4]   2> 7891 INFO  (qtp275154846-27) [    x:collection1] o.a.s.u.p.LogUpdateProcessorFactory [collection1]  webapp=/solr path=/update params={stream.body=<add><doc><field+name%3D"id">3</field><field+name%3D"title">w3</field><field+name%3D"description">w3</field></doc></add>}{add=[3 (1567929129568829440)]} 0 7
   [junit4]   2> 7907 INFO  (qtp275154846-20) [    x:collection1] o.a.s.u.p.LogUpdateProcessorFactory [collection1]  webapp=/solr path=/update params={stream.body=<add><doc><field+name%3D"id">4</field><field+name%3D"title">w4</field><field+name%3D"description">w4</field></doc></add>}{add=[4 (1567929129585606656)]} 0 3
   [junit4]   2> 7915 INFO  (qtp275154846-23) [    x:collection1] o.a.s.u.p.LogUpdateProcessorFactory [collection1]  webapp=/solr path=/update params={stream.body=<add><doc><field+name%3D"id">5</field><field+name%3D"title">w5</field><field+name%3D"description">w5</field></doc></add>}{add=[5 (1567929129593995264)]} 0 3
   [junit4]   2> 7931 INFO  (qtp275154846-24) [    x:collection1] o.a.s.u.p.LogUpdateProcessorFactory [collection1]  webapp=/solr path=/update params={stream.body=<add><doc><field+name%3D"id">6</field><field+name%3D"title">w1+w2</field><field+name%3D"description">w1+w2</field></doc></add>}{add=[6 (1567929129610772480)]} 0 1
   [junit4]   2> 7937 INFO  (qtp275154846-25) [    x:collection1] o.a.s.u.p.LogUpdateProcessorFactory [collection1]  webapp=/solr path=/update params={stream.body=<add><doc><field+name%3D"id">7</field><field+name%3D"title">w1+w2+w3+w4+w5</field><field+name%3D"description">w1+w2+w3+w4+w5+w8</field></doc></add>}{add=[7 (1567929129617063936)]} 0 1
   [junit4]   2> 7947 INFO  (qtp275154846-26) [    x:collection1] o.a.s.u.p.LogUpdateProcessorFactory [collection1]  webapp=/solr path=/update params={stream.body=<add><doc><field+name%3D"id">8</field><field+name%3D"title">w1+w1+w1+w2+w2+w8</field><field+name%3D"description">w1+w1+w1+w2+w2</field></doc></add>}{add=[8 (1567929129627549696)]} 0 1
   [junit4]   2> 7955 INFO  (qtp275154846-26) [    x:collection1] o.a.s.u.DirectUpdateHandler2 start commit{,optimize=false,openSearcher=true,waitSearcher=true,expungeDeletes=false,softCommit=false,prepareCommit=false}
   [junit4]   2> 7955 INFO  (qtp275154846-26) [    x:collection1] o.a.s.u.SolrIndexWriter Calling setCommitData with IW:org.apache.solr.update.SolrIndexWriter@52622f2e commitCommandVersion:0
   [junit4]   2> 8419 INFO  (qtp275154846-26) [    x:collection1] o.a.s.s.SolrIndexSearcher Opening [Searcher@79a1766[collection1] main]
   [junit4]   2> 8421 INFO  (qtp275154846-26) [    x:collection1] o.a.s.u.DirectUpdateHandler2 end_commit_flush
   [junit4]   2> 8423 INFO  (searcherExecutor-18-thread-1-processing-x:collection1) [    x:collection1] o.a.s.c.SolrCore [collection1] Registered new searcher Searcher@79a1766[collection1] main{ExitableDirectoryReader(UninvertingDirectoryReader(Uninverting(_0(7.0.0):C8)))}
   [junit4]   2> 8423 INFO  (qtp275154846-26) [    x:collection1] o.a.s.u.p.LogUpdateProcessorFactory [collection1]  webapp=/solr path=/update params={stream.body=<commit/>}{commit=} 0 468
   [junit4]   2> 8474 INFO  (TEST-TestFieldLengthFeature.testIfFieldIsEmptyLengthIsZero-seed#[A5EE8440912DEDD3]) [    ] o.a.s.SolrTestCaseJ4 ###Starting testIfFieldIsEmptyLengthIsZero
   [junit4]   2> 8479 INFO  (qtp275154846-27) [    x:collection1] o.a.s.u.p.LogUpdateProcessorFactory [collection1]  webapp=/solr path=/update params={stream.body=<add><doc><field+name%3D"id">43</field><field+name%3D"title">w11</field><field+name%3D"description"></field></doc></add>}{add=[43 (1567929130184343552)]} 0 3
   [junit4]   2> 8487 INFO  (qtp275154846-20) [    x:collection1] o.a.s.u.DirectUpdateHandler2 start commit{,optimize=false,openSearcher=true,waitSearcher=true,expungeDeletes=false,softCommit=false,prepareCommit=false}
   [junit4]   2> 8490 INFO  (qtp275154846-20) [    x:collection1] o.a.s.u.SolrIndexWriter Calling setCommitData with IW:org.apache.solr.update.SolrIndexWriter@52622f2e commitCommandVersion:0
   [junit4]   2> 8520 INFO  (qtp275154846-20) [    x:collection1] o.a.s.s.SolrIndexSearcher Opening [Searcher@347a1b09[collection1] main]
   [junit4]   2> 8522 INFO  (searcherExecutor-18-thread-1-processing-x:collection1) [    x:collection1] o.a.s.c.SolrCore [collection1] Registered new searcher Searcher@347a1b09[collection1] main{ExitableDirectoryReader(UninvertingDirectoryReader(Uninverting(_0(7.0.0):C8) Uninverting(_1(7.0.0):C1)))}
   [junit4]   2> 8524 INFO  (qtp275154846-20) [    x:collection1] o.a.s.u.DirectUpdateHandler2 end_commit_flush
   [junit4]   2> 8524 INFO  (qtp275154846-20) [    x:collection1] o.a.s.u.p.LogUpdateProcessorFactory [collection1]  webapp=/solr path=/update params={stream.body=<commit/>}{commit=} 0 38
   [junit4]   2> 8528 INFO  (TEST-TestFieldLengthFeature.testIfFieldIsEmptyLengthIsZero-seed#[A5EE8440912DEDD3]) [    ] o.a.s.l.TestRerankBase loading feauture 
   [junit4]   2> {
   [junit4]   2> "name":"description-length3",
   [junit4]   2> "store":"test",
   [junit4]   2> "class":"org.apache.solr.ltr.feature.FieldLengthFeature",
   [junit4]   2> "params":{"field":"description"}
   [junit4]   2> }
   [junit4]   2>  
   [junit4]   2> 8546 INFO  (qtp275154846-20) [    x:collection1] /solr SolrSchemaRestApi: [Restlet] ServerServlet: component class is null
   [junit4]   2> 8681 INFO  (qtp275154846-20) [    x:collection1] /solr SolrSchemaRestApi: [Restlet] Attaching application: org.apache.solr.rest.SolrSchemaRestApi@72c89cd5 to URI: /solr/schema
   [junit4]   2> maj 20, 2017 7:22:21 AM org.restlet.Application start
   [junit4]   2> INFO: Starting org.apache.solr.rest.SolrSchemaRestApi application
   [junit4]   2> 8738 INFO  (qtp275154846-20) [    x:collection1] o.a.s.r.SolrSchemaRestApi createInboundRoot started for /schema
   [junit4]   2> 8745 INFO  (qtp275154846-20) [    x:collection1] o.a.s.r.RestManager Attached managed resource at path: /feature-store
   [junit4]   2> 8745 INFO  (qtp275154846-20) [    x:collection1] o.a.s.r.RestManager Attached managed resource at path: /managed
   [junit4]   2> 8745 INFO  (qtp275154846-20) [    x:collection1] o.a.s.r.RestManager Attached managed resource at path: /model-store
   [junit4]   2> 8745 INFO  (qtp275154846-20) [    x:collection1] o.a.s.r.RestManager Attached 3 ManagedResource endpoints to Restlet router: /schema
   [junit4]   2> 8746 INFO  (qtp275154846-20) [    x:collection1] o.a.s.r.SolrSchemaRestApi createInboundRoot complete for /schema
   [junit4]   2> 8760 INFO  (qtp275154846-20) [    x:collection1] o.a.s.r.RestManager Found ManagedResource [org.apache.solr.ltr.store.rest.ManagedFeatureStore@60fca210] for /schema/feature-store
   [junit4]   2> 8765 INFO  (qtp275154846-20) [    x:collection1] o.a.s.r.ManagedResource Processing update to /schema/feature-store: {name=description-length3, store=test, class=org.apache.solr.ltr.feature.FieldLengthFeature, params={field=description}} is a java.util.LinkedHashMap
   [junit4]   2> 8767 INFO  (qtp275154846-20) [    x:collection1] o.a.s.l.s.r.ManagedFeatureStore register feature based on {name=description-length3, store=test, class=org.apache.solr.ltr.feature.FieldLengthFeature, params={field=description}}
   [junit4]   2> 8829 INFO  (qtp275154846-20) [    x:collection1] o.a.s.r.ManagedResourceStorage Saved JSON object to path _schema_feature-store.json using file:dir=/x1/jenkins/jenkins-slave/workspace/Lucene-Solr-Tests-master/solr/build/contrib/solr-ltr/test/J0/temp/solr.ltr.feature.TestFieldLengthFeature_A5EE8440912DEDD3-001/tempDir-001/collection1/conf
   [junit4]   2> 8830 INFO  (qtp275154846-20) [    x:collection1] o.a.s.r.RestManager [collection1]  webapp=/solr path=/schema/feature-store params={indent=on&wt=json} status=0 QTime=296
   [junit4]   2> maj 20, 2017 7:22:21 AM org.restlet.engine.log.LogFilter afterHandle
   [junit4]   2> INFO: 2017-05-20	07:22:21	127.0.0.1	-	127.0.0.1	34447	PUT	/solr/schema/feature-store	wt=json&indent=on	200	-	141	125	https://127.0.0.1:34447	Apache-HttpClient/4.4.1 (Java/1.8.0_121)	-
   [junit4]   2> 8883 WARN  (qtp275154846-20) [    x:collection1] o.e.j.s.ServletHandler Error for /solr/collection1/schema/feature-store
   [junit4]   2> java.lang.AssertionError: Attempted close of response output stream.
   [junit4]   2> 	at org.apache.solr.servlet.SolrDispatchFilter$2$1.close(SolrDispatchFilter.java:517)
   [junit4]   2> 	at org.eclipse.jetty.server.Dispatcher.commitResponse(Dispatcher.java:270)
   [junit4]   2> 	at org.eclipse.jetty.server.Dispatcher.forward(Dispatcher.java:202)
   [junit4]   2> 	at org.eclipse.jetty.server.Dispatcher.forward(Dispatcher.java:74)
   [junit4]   2> 	at org.apache.solr.servlet.SolrDispatchFilter.doFilter(SolrDispatchFilter.java:383)
   [junit4]   2> 	at org.apache.solr.servlet.SolrDispatchFilter.doFilter(SolrDispatchFilter.java:318)
   [junit4]   2> 	at org.eclipse.jetty.servlet.ServletHandler$CachedChain.doFilter(ServletHandler.java:1699)
   [junit4]   2> 	at org.apache.solr.client.solrj.embedded.JettySolrRunner$DebugFilter.doFilter(JettySolrRunner.java:139)
   [junit4]   2> 	at org.eclipse.jetty.servlet.ServletHandler$CachedChain.doFilter(ServletHandler.java:1699)
   [junit4]   2> 	at org.eclipse.jetty.servlet.ServletHandler.doHandle(ServletHandler.java:582)
   [junit4]   2> 	at org.eclipse.jetty.server.session.SessionHandler.doHandle(SessionHandler.java:224)
   [junit4]   2> 	at org.eclipse.jetty.server.handler.ContextHandler.doHandle(ContextHandler.java:1180)
   [junit4]   2> 	at org.eclipse.jetty.servlet.ServletHandler.doScope(ServletHandler.java:512)
   [junit4]   2> 	at org.eclipse.jetty.server.session.SessionHandler.doScope(SessionHandler.java:185)
   [junit4]   2> 	at org.eclipse.jetty.server.handler.ContextHandler.doScope(ContextHandler.java:1112)
   [junit4]   2> 	at org.eclipse.jetty.server.handler.ScopedHandler.handle(ScopedHandler.java:141)
   [junit4]   2> 	at org.eclipse.jetty.server.handler.gzip.GzipHandler.handle(GzipHandler.java:395)
   [junit4]   2> 	at org.eclipse.jetty.server.handler.HandlerWrapper.handle(HandlerWrapper.java:134)
   [junit4]   2> 	at org.eclipse.jetty.server.Server.handle(Server.java:534)
   [junit4]   2> 	at org.eclipse.jetty.server.HttpChannel.handle(HttpChannel.java:320)
   [junit4]   2> 	at org.eclipse.jetty.server.HttpConnection.onFillable(HttpConnection.java:251)
   [junit4]   2> 	at org.eclipse.jetty.io.AbstractConnection$ReadCallback.succeeded(AbstractConnection.java:273)
   [junit4]   2> 	at org.eclipse.jetty.io.FillInterest.fillable(FillInterest.java:95)
   [junit4]   2> 	at org.eclipse.jetty.io.ssl.SslConnection.onFillable(SslConnection.java:202)
   [junit4]   2> 	at org.eclipse.jetty.io.AbstractConnection$ReadCallback.succeeded(AbstractConnection.java:273)
   [junit4]   2> 	at org.eclipse.jetty.io.FillInterest.fillable(FillInterest.java:95)
   [junit4]   2> 	at org.eclipse.jetty.io.SelectChannelEndPoint$2.run(SelectChannelEndPoint.java:93)
   [junit4]   2> 	at org.eclipse.jetty.util.thread.strategy.ExecuteProduceConsume.executeProduceConsume(ExecuteProduceConsume.java:303)
   [junit4]   2> 	at org.eclipse.jetty.util.thread.strategy.ExecuteProduceConsume.produceConsume(ExecuteProduceConsume.java:148)
   [junit4]   2> 	at org.eclipse.jetty.util.thread.strategy.ExecuteProduceConsume.run(ExecuteProduceConsume.java:136)
   [junit4]   2> 	at org.eclipse.jetty.util.thread.QueuedThreadPool.runJob(QueuedThreadPool.java:671)
   [junit4]   2> 	at org.eclipse.jetty.util.thread.QueuedThreadPool$2.run(QueuedThreadPool.java:589)
   [junit4]   2> 	at java.lang.Thread.run(Thread.java:745)
   [junit4]   2> 8890 INFO  (TEST-TestFieldLengthFeature.testIfFieldIsEmptyLengthIsZero-seed#[A5EE8440912DEDD3]) [    ] o.a.s.l.TestRerankBase loading model 
   [junit4]   2> {
   [junit4]   2> "name":"description-model3",
   [junit4]   2> "store":"test",
   [junit4]   2> "class":"org.apache.solr.ltr.model.LinearModel",
   [junit4]   2> "features":[
   [junit4]   2> 	{ "name":"description-length3"}
   [junit4]   2> ]
   [junit4]   2> ,
   [junit4]   2> "params":{"weights":{"description-length3":1.0}}
   [junit4]   2> }
   [junit4]   2>  
   [junit4]   2> 8898 INFO  (qtp275154846-20) [    x:collection1] o.a.s.r.RestManager Found ManagedResource [ManagedModelStore [store=ModelStore [availableModels=[]], featureStores=org.apache.solr.ltr.store.rest.ManagedFeatureStore@60fca210]] for /schema/model-store
   [junit4]   2> 8899 INFO  (qtp275154846-20) [    x:collection1] o.a.s.r.ManagedResource Processing update to /schema/model-store: {name=description-model3, store=test, class=org.apache.solr.ltr.model.LinearModel, features=[{name=description-length3}], params={weights={description-length3=1.0}}} is a java.util.LinkedHashMap
   [junit4]   2> 8922 INFO  (qtp275154846-20) [    x:collection1] o.a.s.l.s.r.ManagedModelStore adding model description-model3
   [junit4]   2> 8923 INFO  (qtp275154846-20) [    x:collection1] o.a.s.r.ManagedResourceStorage Saved JSON object to path _schema_model-store.json using file:dir=/x1/jenkins/jenkins-slave/workspace/Lucene-Solr-Tests-master/solr/build/contrib/solr-ltr/test/J0/temp/solr.ltr.feature.TestFieldLengthFeature_A5EE8440912DEDD3-001/tempDir-001/collection1/conf
   [junit4]   2> 8924 INFO  (qtp275154846-20) [    x:collection1] o.a.s.r.RestManager [collection1]  webapp=/solr path=/schema/model-store params={indent=on&wt=json} status=0 QTime=28
   [junit4]   2> maj 20, 2017 7:22:21 AM org.restlet.engine.log.LogFilter afterHandle
   [junit4]   2> INFO: 2017-05-20	07:22:21	127.0.0.1	-	127.0.0.1	34447	PUT	/solr/schema/model-store	wt=json&indent=on	200	-	197	28	https://127.0.0.1:34447	Apache-HttpClient/4.4.1 (Java/1.8.0_121)	-
   [junit4]   2> 8933 WARN  (qtp275154846-20) [    x:collection1] o.e.j.s.ServletHandler Error for /solr/collection1/schema/model-store
   [junit4]   2> java.lang.AssertionError: Attempted close of response output stream.
   [junit4]   2> 	at org.apache.solr.servlet.SolrDispatchFilter$2$1.close(SolrDispatchFilter.java:517)
   [junit4]   2> 	at org.eclipse.jetty.server.Dispatcher.commitResponse(Dispatcher.java:270)
   [junit4]   2> 	at org.eclipse.jetty.server.Dispatcher.forward(Dispatcher.java:202)
   [junit4]   2> 	at org.eclipse.jetty.server.Dispatcher.forward(Dispatcher.java:74)
   [junit4]   2> 	at org.apache.solr.servlet.SolrDispatchFilter.doFilter(SolrDispatchFilter.java:383)
   [junit4]   2> 	at org.apache.solr.servlet.SolrDispatchFilter.doFilter(SolrDispatchFilter.java:318)
   [junit4]   2> 	at org.eclipse.jetty.servlet.ServletHandler$CachedChain.doFilter(ServletHandler.java:1699)
   [junit4]   2> 	at org.apache.solr.client.solrj.embedded.JettySolrRunner$DebugFilter.doFilter(JettySolrRunner.java:139)
   [junit4]   2> 	at org.eclipse.jetty.servlet.ServletHandler$CachedChain.doFilter(ServletHandler.java:1699)
   [junit4]   2> 	at org.eclipse.jetty.servlet.ServletHandler.doHandle(ServletHandler.java:582)
   [junit4]   2> 	at org.eclipse.jetty.server.session.SessionHandler.doHandle(SessionHandler.java:224)
   [junit4]   2> 	at org.eclipse.jetty.server.handler.ContextHandler.doHandle(ContextHandler.java:1180)
   [junit4]   2> 	at org.eclipse.jetty.servlet.ServletHandler.doScope(ServletHandler.java:512)
   [junit4]   2> 	at org.eclipse.jetty.server.session.SessionHandler.doScope(SessionHandler.java:185)
   [junit4]   2> 	at org.eclipse.jetty.server.handler.ContextHandler.doScope(ContextHandler.java:1112)
   [junit4]   2> 	at org.eclipse.jetty.server.handler.ScopedHandler.handle(ScopedHandler.java:141)
   [junit4]   2> 	at org.eclipse.jetty.server.handler.gzip.GzipHandler.handle(GzipHandler.java:395)
   [junit4]   2> 	at org.eclipse.jetty.server.handler.HandlerWrapper.handle(HandlerWrapper.java:134)
   [junit4]   2> 	at org.eclipse.jetty.server.Server.handle(Server.java:534)
   [junit4]   2> 	at org.eclipse.jetty.server.HttpChannel.handle(HttpChannel.java:320)
   [junit4]   2> 	at org.eclipse.jetty.server.HttpConnection.onFillable(HttpConnection.java:251)
   [junit4]   2> 	at org.eclipse.jetty.io.AbstractConnection$ReadCallback.succeeded(AbstractConnection.java:273)
   [junit4]   2> 	at org.eclipse.jetty.io.FillInterest.fillable(FillInterest.java:95)
   [junit4]   2> 	at org.eclipse.jetty.io.ssl.SslConnection.onFillable(SslConnection.java:202)
   [junit4]   2> 	at org.eclipse.jetty.io.AbstractConnection$ReadCallback.succeeded(AbstractConnection.java:273)
   [junit4]   2> 	at org.eclipse.jetty.io.FillInterest.fillable(FillInterest.java:95)
   [junit4]   2> 	at org.eclipse.jetty.io.SelectChannelEndPoint$2.run(SelectChannelEndPoint.java:93)
   [junit4]   2> 	at org.eclipse.jetty.util.thread.strategy.ExecuteProduceConsume.executeProduceConsume(ExecuteProduceConsume.java:303)
   [junit4]   2> 	at org.eclipse.jetty.util.thread.strategy.ExecuteProduceConsume.produceConsume(ExecuteProduceConsume.java:148)
   [junit4]   2> 	at org.eclipse.jetty.util.thread.strategy.ExecuteProduceConsume.run(ExecuteProduceConsume.java:136)
   [junit4]   2> 	at org.eclipse.jetty.util.thread.QueuedThreadPool.runJob(QueuedThreadPool.java:671)
   [junit4]   2> 	at org.eclipse.jetty.util.thread.QueuedThreadPool$2.run(QueuedThreadPool.java:589)
   [junit4]   2> 	at java.lang.Thread.run(Thread.java:745)
   [junit4]   2> 9182 INFO  (qtp275154846-20) [    x:collection1] o.a.s.c.S.Request [collection1]  webapp=/solr path=/query params={q=title:w11&indent=on&fl=*,+score&rows=4&wt=json&rq={!ltr+model%3Ddescription-model3+reRankDocs%3D8}} hits=1 status=0 QTime=230
   [junit4]   2> 9202 INFO  (TEST-TestFieldLengthFeature.testIfFieldIsEmptyLengthIsZero-seed#[A5EE8440912DEDD3]) [    ] o.a.s.SolrTestCaseJ4 ###Ending testIfFieldIsEmptyLengthIsZero
   [junit4]   2> 9213 INFO  (TEST-TestFieldLengthFeature.testIfFieldIsMissingInDocumentLengthIsZero-seed#[A5EE8440912DEDD3]) [    ] o.a.s.SolrTestCaseJ4 ###Starting testIfFieldIsMissingInDocumentLengthIsZero
   [junit4]   2> 9222 INFO  (qtp275154846-23) [    x:collection1] o.a.s.u.p.LogUpdateProcessorFactory [collection1]  webapp=/solr path=/update params={stream.body=<add><doc><field+name%3D"id">42</field><field+name%3D"title">w10</field></doc></add>}{add=[42 (1567929130963435520)]} 0 2
   [junit4]   2> 9229 INFO  (qtp275154846-24) [    x:collection1] o.a.s.u.DirectUpdateHandler2 start commit{,optimize=false,openSearcher=true,waitSearcher=true,expungeDeletes=false,softCommit=false,prepareCommit=false}
   [junit4]   2> 9230 INFO  (qtp275154846-24) [    x:collection1] o.a.s.u.SolrIndexWriter Calling setCommitData with IW:org.apache.solr.update.SolrIndexWriter@52622f2e commitCommandVersion:0
   [junit4]   2> 9243 INFO  (qtp275154846-24) [    x:collection1] o.a.s.s.SolrIndexSearcher Opening [Searcher@30afc60c[collection1] main]
   [junit4]   2> 9244 INFO  (searcherExecutor-18-thread-1-processing-x:collection1) [    x:collection1] o.a.s.c.SolrCore [collection1] Registered new searcher Searcher@30afc60c[collection1] main{ExitableDirectoryReader(UninvertingDirectoryReader(Uninverting(_0(7.0.0):C8) Uninverting(_1(7.0.0):C1) Uninverting(_2(7.0.0):C1)))}
   [junit4]   2> 9245 INFO  (qtp275154846-24) [    x:collection1] o.a.s.u.DirectUpdateHandler2 end_commit_flush
   [junit4]   2> 9245 INFO  (qtp275154846-24) [    x:collection1] o.a.s.u.p.LogUpdateProcessorFactory [collection1]  webapp=/solr path=/update params={stream.body=<commit/>}{commit=} 0 16
   [junit4]   2> 9249 INFO  (TEST-TestFieldLengthFeature.testIfFieldIsMissingInDocumentLengthIsZero-seed#[A5EE8440912DEDD3]) [    ] o.a.s.l.TestRerankBase loading feauture 
   [junit4]   2> {
   [junit4]   2> "name":"description-length2",
   [junit4]   2> "store":"test",
   [junit4]   2> "class":"org.apache.solr.ltr.feature.FieldLengthFeature",
   [junit4]   2> "params":{"field":"description"}
   [junit4]   2> }
   [junit4]   2>  
   [junit4]   2> 9252 INFO  (qtp275154846-25) [    x:collection1] o.a.s.r.RestManager Found ManagedResource [org.apache.solr.ltr.store.rest.ManagedFeatureStore@60fca210] for /schema/feature-store
   [junit4]   2> 9252 INFO  (qtp275154846-25) [    x:collection1] o.a.s.r.ManagedResource Processing update to /schema/feature-store: {name=description-length2, store=test, class=org.apache.solr.ltr.feature.FieldLengthFeature, params={field=description}} is a java.util.LinkedHashMap
   [junit4]   2> 9253 INFO  (qtp275154846-25) [    x:collection1] o.a.s.l.s.r.ManagedFeatureStore register feature based on {name=description-length2, store=test, class=org.apache.solr.ltr.feature.FieldLengthFeature, params={field=description}}
   [junit4]   2> 9264 INFO  (qtp275154846-25) [    x:collection1] o.a.s.r.ManagedResourceStorage Saved JSON object to path _schema_feature-store.json using file:dir=/x1/jenkins/jenkins-slave/workspace/Lucene-Solr-Tests-master/solr/build/contrib/solr-ltr/test/J0/temp/solr.ltr.feature.TestFieldLengthFeature_A5EE8440912DEDD3-001/tempDir-001/collection1/conf
   [junit4]   2> 9264 INFO  (qtp275154846-25) [    x:collection1] o.a.s.r.RestManager [collection1]  webapp=/solr path=/schema/feature-store params={indent=on&wt=json} status=0 QTime=13
   [junit4]   2> maj 20, 2017 7:22:22 AM org.restlet.engine.log.LogFilter afterHandle
   [junit4]   2> INFO: 2017-05-20	07:22:22	127.0.0.1	-	127.0.0.1	34447	PUT	/solr/schema/feature-store	wt=json&indent=on	200	-	141	12	https://127.0.0.1:34447	Apache-HttpClient/4.4.1 (Java/1.8.0_121)	-
   [junit4]   2> 9267 WARN  (qtp275154846-25) [    x:collection1] o.e.j.s.ServletHandler Error for /solr/collection1/schema/feature-store
   [junit4]   2> java.lang.AssertionError: Attempted close of response output stream.
   [junit4]   2> 	at org.apache.solr.servlet.SolrDispatchFilter$2$1.close(SolrDispatchFilter.java:517)
   [junit4]   2> 	at org.eclipse.jetty.server.Dispatcher.commitResponse(Dispatcher.java:270)
   [junit4]   2> 	at org.eclipse.jetty.server.Dispatcher.forward(Dispatcher.java:202)
   [junit4]   2> 	at org.eclipse.jetty.server.Dispatcher.forward(Dispatcher.java:74)
   [junit4]   2> 	at org.apache.solr.servlet.SolrDispatchFilter.doFilter(SolrDispatchFilter.java:383)
   [junit4]   2> 	at org.apache.solr.servlet.SolrDispatchFilter.doFilter(SolrDispatchFilter.java:318)
   [junit4]   2> 	at org.eclipse.jetty.servlet.ServletHandler$CachedChain.doFilter(ServletHandler.java:1699)
   [junit4]   2> 	at org.apache.solr.client.solrj.embedded.JettySolrRunner$DebugFilter.doFilter(JettySolrRunner.java:139)
   [junit4]   2> 	at org.eclipse.jetty.servlet.ServletHandler$CachedChain.doFilter(ServletHandler.java:1699)
   [junit4]   2> 	at org.eclipse.jetty.servlet.ServletHandler.doHandle(ServletHandler.java:582)
   [junit4]   2> 	at org.eclipse.jetty.server.session.SessionHandler.doHandle(SessionHandler.java:224)
   [junit4]   2> 	at org.eclipse.jetty.server.handler.ContextHandler.doHandle(ContextHandler.java:1180)
   [junit4]   2> 	at org.eclipse.jetty.servlet.ServletHandler.doScope(ServletHandler.java:512)
   [junit4]   2> 	at org.eclipse.jetty.server.session.SessionHandler.doScope(SessionHandler.java:185)
   [junit4]   2> 	at org.eclipse.jetty.server.handler.ContextHandler.doScope(ContextHandler.java:1112)
   [junit4]   2> 	at org.eclipse.jetty.server.handler.ScopedHandler.handle(ScopedHandler.java:141)
   [junit4]   2> 	at org.eclipse.jetty.server.handler.gzip.GzipHandler.handle(GzipHandler.java:395)
   [junit4]   2> 	at org.eclipse.jetty.server.handler.HandlerWrapper.handle(HandlerWrapper.java:134)
   [junit4]   2> 	at org.eclipse.jetty.server.Server.handle(Server.java:534)
   [junit4]   2> 	at org.eclipse.jetty.server.HttpChannel.handle(HttpChannel.java:320)
   [junit4]   2> 	at org.eclipse.jetty.server.HttpConnection.onFillable(HttpConnection.java:251)
   [junit4]   2> 	at org.eclipse.jetty.io.AbstractConnection$ReadCallback.succeeded(AbstractConnection.java:273)
   [junit4]   2> 	at org.eclipse.jetty.io.FillInterest.fillable(FillInterest.java:95)
   [junit4]   2> 	at org.eclipse.jetty.io.ssl.SslConnection.onFillable(SslConnection.java:202)
   [junit4]   2> 	at org.eclipse.jetty.io.AbstractConnection$ReadCallback.succeeded(AbstractConnection.java:273)
   [junit4]   2> 	at org.eclipse.jetty.io.FillInterest.fillable(FillInterest.java:95)
   [junit4]   2> 	at org.eclipse.jetty.io.SelectChannelEndPoint$2.run(SelectChannelEndPoint.java:93)
   [junit4]   2> 	at org.eclipse.jetty.util.thread.strategy.ExecuteProduceConsume.executeProduceConsume(ExecuteProduceConsume.java:303)
   [junit4]   2> 	at org.eclipse.jetty.util.thread.strategy.ExecuteProduceConsume.produceConsume(ExecuteProduceConsume.java:148)
   [junit4]   2> 	at org.eclipse.jetty.util.thread.strategy.ExecuteProduceConsume.run(ExecuteProduceConsume.java:136)
   [junit4]   2> 	at org.eclipse.jetty.util.thread.QueuedThreadPool.runJob(QueuedThreadPool.java:671)
   [junit4]   2> 	at org.eclipse.jetty.util.thread.QueuedThreadPool$2.run(QueuedThreadPool.java:589)
   [junit4]   2> 	at java.lang.Thread.run(Thread.java:745)
   [junit4]   2> 9268 INFO  (TEST-TestFieldLengthFeature.testIfFieldIsMissingInDocumentLengthIsZero-seed#[A5EE8440912DEDD3]) [    ] o.a.s.l.TestRerankBase loading model 
   [junit4]   2> {
   [junit4]   2> "name":"description-model2",
   [junit4]   2> "store":"test",
   [junit4]   2> "class":"org.apache.solr.ltr.model.LinearModel",
   [junit4]   2> "features":[
   [junit4]   2> 	{ "name":"description-length2"}
   [junit4]   2> ]
   [junit4]   2> ,
   [junit4]   2> "params":{"weights":{"description-length2":1.0}}
   [junit4]   2> }
   [junit4]   2>  
   [junit4]   2> 9271 INFO  (qtp275154846-26) [    x:collection1] o.a.s.r.RestManager Found ManagedResource [ManagedModelStore [store=ModelStore [availableModels=[description-model3]], featureStores=org.apache.solr.ltr.store.rest.ManagedFeatureStore@60fca210]] for /schema/model-store
   [junit4]   2> 9271 INFO  (qtp275154846-26) [    x:collection1] o.a.s.r.ManagedResource Processing update to /schema/model-store: {name=description-model2, store=test, class=org.apache.solr.ltr.model.LinearModel, features=[{name=description-length2}], params={weights={description-length2=1.0}}} is a java.util.LinkedHashMap
   [junit4]   2> 9282 INFO  (qtp275154846-26) [    x:collection1] o.a.s.l.s.r.ManagedModelStore adding model description-model2
   [junit4]   2> 9283 INFO  (qtp275154846-26) [    x:collection1] o.a.s.r.ManagedResourceStorage Saved JSON object to path _schema_model-store.json using file:dir=/x1/jenkins/jenkins-slave/workspace/Lucene-Solr-Tests-master/solr/build/contrib/solr-ltr/test/J0/temp/solr.ltr.feature.TestFieldLengthFeature_A5EE8440912DEDD3-001/tempDir-001/collection1/conf
   [junit4]   2> 9283 INFO  (qtp275154846-26) [    x:collection1] o.a.s.r.RestManager [collection1]  webapp=/solr path=/schema/model-store params={indent=on&wt=json} status=0 QTime=13
   [junit4]   2> maj 20, 2017 7:22:22 AM org.restlet.engine.log.LogFilter afterHandle
   [junit4]   2> INFO: 2017-05-20	07:22:22	127.0.0.1	-	127.0.0.1	34447	PUT	/solr/schema/model-store	wt=json&indent=on	200	-	197	13	https://127.0.0.1:34447	Apache-HttpClient/4.4.1 (Java/1.8.0_121)	-
   [junit4]   2> 9285 WARN  (qtp275154846-26) [    x:collection1] o.e.j.s.ServletHandler Error for /solr/collection1/schema/model-store
   [junit4]   2> java.lang.AssertionError: Attempted close of response output stream.
   [junit4]   2> 	at org.apache.solr.servlet.SolrDispatchFilter$2$1.close(SolrDispatchFilter.java:517)
   [junit4]   2> 	at org.eclipse.jetty.server.Dispatcher.commitResponse(Dispatcher.java:270)
   [junit4]   2> 	at org.eclipse.jetty.server.Dispatcher.forward(Dispatcher.java:202)
   [junit4]   2> 	at org.eclipse.jetty.server.Dispatcher.forward(Dispatcher.java:74)
   [junit4]   2> 	at org.apache.solr.servlet.SolrDispatchFilter.doFilter(SolrDispatchFilter.java:383)
   [junit4]   2> 	at org.apache.solr.servlet.SolrDispatchFilter.doFilter(SolrDispatchFilter.java:318)
   [junit4]   2> 	at org.eclipse.jetty.servlet.ServletHandler$CachedChain.doFilter(ServletHandler.java:1699)
   [junit4]   2> 	at org.apache.solr.client.solrj.embedded.JettySolrRunner$DebugFilter.doFilter(JettySolrRunner.java:139)
   [junit4]   2> 	at org.eclipse.jetty.servlet.ServletHandler$CachedChain.doFilter(ServletHandler.java:1699)
   [junit4]   2> 	at org.eclipse.jetty.servlet.ServletHandler.doHandle(ServletHandler.java:582)
   [junit4]   2> 	at org.eclipse.jetty.server.session.SessionHandler.doHandle(SessionHandler.java:224)
   [junit4]   2> 	at org.eclipse.jetty.server.handler.ContextHandler.doHandle(ContextHandler.java:1180)
   [junit4]   2> 	at org.eclipse.jetty.servlet.ServletHandler.doScope(ServletHandler.java:512)
   [junit4]   2> 	at org.eclipse.jetty.server.session.SessionHandler.doScope(SessionHandler.java:185)
   [junit4]   2> 	at org.eclipse.jetty.server.handler.ContextHandler.doScope(ContextHandler.java:1112)
   [junit4]   2> 	at org.eclipse.jetty.server.handler.ScopedHandler.handle(ScopedHandler.java:141)
   [junit4]   2> 	at org.eclipse.jetty.server.handler.gzip.GzipHandler.handle(GzipHandler.java:395)
   [junit4]   2> 	at org.eclipse.jetty.server.handler.HandlerWrapper.handle(HandlerWrapper.java:134)
   [junit4]   2> 	at org.eclipse.jetty.server.Server.handle(Server.java:534)
   [junit4]   2> 	at org.eclipse.jetty.server.HttpChannel.handle(HttpChannel.java:320)
   [junit4]   2> 	at org.eclipse.jetty.server.HttpConnection.onFillable(HttpConnection.java:251)
   [junit4]   2> 	at org.eclipse.jetty.io.AbstractConnection$ReadCallback.succeeded(AbstractConnection.java:273)
   [junit4]   2> 	at org.eclipse.jetty.io.FillInterest.fillable(FillInterest.java:95)
   [junit4]   2> 	at org.eclipse.jetty.io.ssl.SslConnection.onFillable(SslConnection.java:202)
   [junit4]   2> 	at org.eclipse.jetty.io.AbstractConnection$ReadCallback.succeeded(AbstractConnection.java:273)
   [junit4]   2> 	at org.eclipse.jetty.io.FillInterest.fillable(FillInterest.java:95)
   [junit4]   2> 	at org.eclipse.jetty.io.SelectChannelEndPoint$2.run(SelectChannelEndPoint.java:93)
   [junit4]   2> 	at org.eclipse.jetty.util.thread.strategy.ExecuteProduceConsume.executeProduceConsume(ExecuteProduceConsume.java:303)
   [junit4]   2> 	at org.eclipse.jetty.util.thread.strategy.ExecuteProduceConsume.produceConsume(ExecuteProduceConsume.java:148)
   [junit4]   2> 	at org.eclipse.jetty.util.thread.strategy.ExecuteProduceConsume.run(ExecuteProduceConsume.java:136)
   [junit4]   2> 	at org.eclipse.jetty.util.thread.QueuedThreadPool.runJob(QueuedThreadPool.java:671)
   [junit4]   2> 	at org.eclipse.jetty.util.thread.QueuedThreadPool$2.run(QueuedThreadPool.java:589)
   [junit4]   2> 	at java.lang.Thread.run(Thread.java:745)
   [junit4]   2> 9291 INFO  (qtp275154846-27) [    x:collection1] o.a.s.c.S.Request [collection1]  webapp=/solr path=/query params={q=title:w10&indent=on&fl=*,+score&rows=4&wt=json&rq={!ltr+model%3Ddescription-model2+reRankDocs%3D8}} hits=1 status=0 QTime=2
   [junit4]   2> 9294 INFO  (TEST-TestFieldLengthFeature.testIfFieldIsMissingInDocumentLengthIsZero-seed#[A5EE8440912DEDD3]) [    ] o.a.s.SolrTestCaseJ4 ###Ending testIfFieldIsMissingInDocumentLengthIsZero
   [junit4]   2> 9302 INFO  (TEST-TestFieldLengthFeature.testRanking-seed#[A5EE8440912DEDD3]) [    ] o.a.s.SolrTestCaseJ4 ###Starting testRanking
   [junit4]   2> 9302 INFO  (TEST-TestFieldLengthFeature.testRanking-seed#[A5EE8440912DEDD3]) [    ] o.a.s.l.TestRerankBase loading feauture 
   [junit4]   2> {
   [junit4]   2> "name":"title-length",
   [junit4]   2> "store":"test",
   [junit4]   2> "class":"org.apache.solr.ltr.feature.FieldLengthFeature",
   [junit4]   2> "params":{"field":"title"}
   [junit4]   2> }
   [junit4]   2>  
   [junit4]   2> 9305 INFO  (qtp275154846-20) [    x:collection1] o.a.s.r.RestManager Found ManagedResource [org.apache.solr.ltr.store.rest.ManagedFeatureStore@60fca210] for /schema/feature-store
   [junit4]   2> 9305 INFO  (qtp275154846-20) [    x:collection1] o.a.s.r.ManagedResource Processing update to /schema/feature-store: {name=title-length, store=test, class=org.apache.solr.ltr.feature.FieldLengthFeature, params={field=title}} is a java.util.LinkedHashMap
   [junit4]   2> 9305 INFO  (qtp275154846-20) [    x:collection1] o.a.s.l.s.r.ManagedFeatureStore register feature based on {name=title-length, store=test, class=org.apache.solr.ltr.feature.FieldLengthFeature, params={field=title}}
   [junit4]   2> 9306 INFO  (qtp275154846-20) [    x:collection1] o.a.s.r.ManagedResourceStorage Saved JSON object to path _schema_feature-store.json using file:dir=/x1/jenkins/jenkins-slave/workspace/Lucene-Solr-Tests-master/solr/build/contrib/solr-ltr/test/J0/temp/solr.ltr.feature.TestFieldLengthFeature_A5EE8440912DEDD3-001/tempDir-001/collection1/conf
   [junit4]   2> 9306 INFO  (qtp275154846-20) [    x:collection1] o.a.s.r.RestManager [collection1]  webapp=/solr path=/schema/feature-store params={indent=on&wt=json} status=0 QTime=2
   [junit4]   2> maj 20, 2017 7:22:22 AM org.restlet.engine.log.LogFilter afterHandle
   [junit4]   2> INFO: 2017-05-20	07:22:22	127.0.0.1	-	127.0.0.1	34447	PUT	/solr/schema/feature-store	wt=json&indent=on	200	-	128	2	https://127.0.0.1:34447	Apache-HttpClient/4.4.1 (Java/1.8.0_121)	-
   [junit4]   2> 9308 WARN  (qtp275154846-20) [    x:collection1] o.e.j.s.ServletHandler Error for /solr/collection1/schema/feature-store
   [junit4]   2> java.lang.AssertionError: Attempted close of response output stream.
   [junit4]   2> 	at org.apache.solr.servlet.SolrDispatchFilter$2$1.close(SolrDispatchFilter.java:517)
   [junit4]   2> 	at org.eclipse.jetty.server.Dispatcher.commitResponse(Dispatcher.java:270)
   [junit4]   2> 	at org.eclipse.jetty.server.Dispatcher.forward(Dispatcher.java:202)
   [junit4]   2> 	at org.eclipse.jetty.server.Dispatcher.forward(Dispatcher.java:74)
   [junit4]   2> 	at org.apache.solr.servlet.SolrDispatchFilter.doFilter(SolrDispatchFilter.java:383)
   [junit4]   2> 	at org.apache.solr.servlet.SolrDispatchFilter.doFilter(SolrDispatchFilter.java:318)
   [junit4]   2> 	at org.eclipse.jetty.servlet.ServletHandler$CachedChain.doFilter(ServletHandler.java:1699)
   [junit4]   2> 	at org.apache.solr.client.solrj.embedded.JettySolrRunner$DebugFilter.doFilter(JettySolrRunner.java:139)
   [junit4]   2> 	at org.eclipse.jetty.servlet.ServletHandler$CachedChain.doFilter(ServletHandler.java:1699)
   [junit4]   2> 	at org.eclipse.jetty.servlet.ServletHandler.doHandle(ServletHandler.java:582)
   [junit4]   2> 	at org.eclipse.jetty.server.session.SessionHandler.doHandle(SessionHandler.java:224)
   [junit4]   2> 	at org.eclipse.jetty.server.handler.ContextHandler.doHandle(ContextHandler.java:1180)
   [junit4]   2> 	at org.eclipse.jetty.servlet.ServletHandler.doScope(ServletHandler.java:512)
   [junit4]   2> 	at org.eclipse.jetty.server.session.SessionHandler.doScope(SessionHandler.java:185)
   [junit4]   2> 	at org.eclipse.jetty.server.handler.ContextHandler.doScope(ContextHandler.java:1112)
   [junit4]   2> 	at org.eclipse.jetty.server.handler.ScopedHandler.handle(ScopedHandler.java:141)
   [junit4]   2> 	at org.eclipse.jetty.server.handler.gzip.GzipHandler.handle(GzipHandler.java:395)
   [junit4]   2> 	at org.eclipse.jetty.server.handler.HandlerWrapper.handle(HandlerWrapper.java:134)
   [junit4]   2> 	at org.eclipse.jetty.server.Server.handle(Server.java:534)
   [junit4]   2> 	at org.eclipse.jetty.server.HttpChannel.handle(HttpChannel.java:320)
   [junit4]   2> 	at org.eclipse.jetty.server.HttpConnection.onFillable(HttpConnection.java:251)
   [junit4]   2> 	at org.eclipse.jetty.io.AbstractConnection$ReadCallback.succeeded(AbstractConnection.java:273)
   [junit4]   2> 	at org.eclipse.jetty.io.FillInterest.fillable(FillInterest.java:95)
   [junit4]   2> 	at org.eclipse.jetty.io.ssl.SslConnection.onFillable(SslConnection.java:202)
   [junit4]   2> 	at org.eclipse.jetty.io.AbstractConnection$ReadCallback.succeeded(AbstractConnection.java:273)
   [junit4]   2> 	at org.eclipse.jetty.io.FillInterest.fillable(FillInterest.java:95)
   [junit4]   2> 	at org.eclipse.jetty.io.SelectChannelEndPoint$2.run(SelectChannelEndPoint.java:93)
   [junit4]   2> 	at org.eclipse.jetty.util.thread.strategy.ExecuteProduceConsume.executeProduceConsume(ExecuteProduceConsume.java:303)
   [junit4]   2> 	at org.eclipse.jetty.util.thread.strategy.ExecuteProduceConsume.produceConsume(ExecuteProduceConsume.java:148)
   [junit4]   2> 	at org.eclipse.jetty.util.thread.strategy.ExecuteProduceConsume.run(ExecuteProduceConsume.java:136)
   [junit4]   2> 	at org.eclipse.jetty.util.thread.QueuedThreadPool.runJob(QueuedThreadPool.java:671)
   [junit4]   2> 	at org.eclipse.jetty.util.thread.QueuedThreadPool$2.run(QueuedThreadPool.java:589)
   [junit4]   2> 	at java.lang.Thread.run(Thread.java:745)
   [junit4]   2> 9312 INFO  (TEST-TestFieldLengthFeature.testRanking-seed#[A5EE8440912DEDD3]) [    ] o.a.s.l.TestRerankBase loading model 
   [junit4]   2> {
   [junit4]   2> "name":"title-model",
   [junit4]   2> "store":"test",
   [junit4]   2> "class":"org.apache.solr.ltr.model.LinearModel",
   [junit4]   2> "features":[
   [junit4]   2> 	{ "name":"title-length"}
   [junit4]   2> ]
   [junit4]   2> ,
   [junit4]   2> "params":{"weights":{"title-length":1.0}}
   [junit4]   2> }
   [junit4]   2>  
   [junit4]   2> 9315 INFO  (qtp275154846-20) [    x:collection1] o.a.s.r.RestManager Found ManagedResource [ManagedModelStore [store=ModelStore [availableModels=[description-model3, description-model2]], featureStores=org.apache.solr.ltr.store.rest.ManagedFeatureStore@60fca210]] for /schema/model-store
   [junit4]   2> 9315 INFO  (qtp275154846-20) [    x:collection1] o.a.s.r.ManagedResource Processing update to /schema/model-store: {name=title-model, store=test, class=org.apache.solr.ltr.model.LinearModel, features=[{name=title-length}], params={weights={title-length=1.0}}} is a java.util.LinkedHashMap
   [junit4]   2> 9318 INFO  (qtp275154846-20) [    x:collection1] o.a.s.l.s.r.ManagedModelStore adding model title-model
   [junit4]   2> 9319 INFO  (qtp275154846-20) [    x:collection1] o.a.s.r.ManagedResourceStorage Saved JSON object to path _schema_model-store.json using file:dir=/x1/jenkins/jenkins-slave/workspace/Lucene-Solr-Tests-master/solr/build/contrib/solr-ltr/test/J0/temp/solr.ltr.feature.TestFieldLengthFeature_A5EE8440912DEDD3-001/tempDir-001/collection1/conf
   [junit4]   2> 9319 INFO  (qtp275154846-20) [    x:collection1] o.a.s.r.RestManager [collection1]  webapp=/solr path=/schema/model-store params={indent=on&wt=json} status=0 QTime=5
   [junit4]   2> maj 20, 2017 7:22:22 AM org.restlet.engine.log.LogFilter afterHandle
   [junit4]   2> INFO: 2017-05-20	07:22:22	127.0.0.1	-	127.0.0.1	34447	PUT	/solr/schema/model-store	wt=json&indent=on	200	-	176	4	https://127.0.0.1:34447	Apache-HttpClient/4.4.1 (Java/1.8.0_121)	-
   [junit4]   2> 9332 WARN  (qtp275154846-20) [    x:collection1] o.e.j.s.ServletHandler Error for /solr/collection1/schema/model-store
   [junit4]   2> java.lang.AssertionError: Attempted close of response output stream.
   [junit4]   2> 	at org.apache.solr.servlet.SolrDispatchFilter$2$1.close(SolrDispatchFilter.java:517)
   [junit4]   2> 	at org.eclipse.jetty.server.Dispatcher.commitResponse(Dispatcher.java:270)
   [junit4]   2> 	at org.eclipse.jetty.server.Dispatcher.forward(Dispatcher.java:202)
   [junit4]   2> 	at org.eclipse.jetty.server.Dispatcher.forward(Dispatcher.java:74)
   [junit4]   2> 	at org.apache.solr.servlet.SolrDispatchFilter.doFilter(SolrDispatchFilter.java:383)
   [junit4]   2> 	at org.apache.solr.servlet.SolrDispatchFilter.doFilter(SolrDispatchFilter.java:318)
   [junit4]   2> 	at org.eclipse.jetty.servlet.ServletHandler$CachedChain.doFilter(ServletHandler.java:1699)
   [junit4]   2> 	at org.apache.solr.client.solrj.embedded.JettySolrRunner$DebugFilter.doFilter(JettySolrRunner.java:139)
   [junit4]   2> 	at org.eclipse.jetty.servlet.ServletHandler$CachedChain.doFilter(ServletHandler.java:1699)
   [junit4]   2> 	at org.eclipse.jetty.servlet.ServletHandler.doHandle(ServletHandler.java:582)
   [junit4]   2> 	at org.eclipse.jetty.server.session.SessionHandler.doHandle(SessionHandler.java:224)
   [junit4]   2> 	at org.eclipse.jetty.server.handler.ContextHandler.doHandle(ContextHandler.java:1180)
   [junit4]   2> 	at org.eclipse.jetty.servlet.ServletHandler.doScope(ServletHandler.java:512)
   [junit4]   2> 	at org.eclipse.jetty.server.session.SessionHandler.doScope(SessionHandler.java:185)
   [junit4]   2> 	at org.eclipse.jetty.server.handler.ContextHandler.doScope(ContextHandler.java:1112)
   [junit4]   2> 	at org.eclipse.jetty.server.handler.ScopedHandler.handle(ScopedHandler.java:141)
   [junit4]   2> 	at org.eclipse.jetty.server.handler.gzip.GzipHandler.handle(GzipHandler.java:395)
   [junit4]   2> 	at org.eclipse.jetty.server.handler.HandlerWrapper.handle(HandlerWrapper.java:134)
   [junit4]   2> 	at org.eclipse.jetty.server.Server.handle(Server.java:534)
   [junit4]   2> 	at org.eclipse.jetty.server.HttpChannel.handle(HttpChannel.java:320)
   [junit4]   2> 	at org.eclipse.jetty.server.HttpConnection.onFillable(HttpConnection.java:251)
   [junit4]   2> 	at org.eclipse.jetty.io.AbstractConnection$ReadCallback.succeeded(AbstractConnection.java:273)
   [junit4]   2> 	at org.eclipse.jetty.io.FillInterest.fillable(FillInterest.java:95)
   [junit4]   2> 	at org.eclipse.jetty.io.ssl.SslConnection.onFillable(SslConnection.java:202)
   [junit4]   2> 	at org.eclipse.jetty.io.AbstractConnection$ReadCallback.succeeded(AbstractConnection.java:273)
   [junit4]   2> 	at org.eclipse.jetty.io.FillInterest.fillable(FillInterest.java:95)
   [junit4]   2> 	at org.eclipse.jetty.io.SelectChannelEndPoint$2.run(SelectChannelEndPoint.java:93)
   [junit4]   2> 	at org.eclipse.jetty.util.thread.strategy.ExecuteProduceConsume.executeProduceConsume(ExecuteProduceConsume.java:303)
   [junit4]   2> 	at org.eclipse.jetty.util.thread.strategy.ExecuteProduceConsume.produceConsume(ExecuteProduceConsume.java:148)
   [junit4]   2> 	at org.eclipse.jetty.util.thread.strategy.ExecuteProduceConsume.run(ExecuteProduceConsume.java:136)
   [junit4]   2> 	at org.eclipse.jetty.util.thread.QueuedThreadPool.runJob(QueuedThreadPool.java:671)
   [junit4]   2> 	at org.eclipse.jetty.util.thread.QueuedThreadPool$2.run(QueuedThreadPool.java:589)
   [junit4]   2> 	at java.lang.Thread.run(Thread.java:745)
   [junit4]   2> 9341 INFO  (qtp275154846-20) [    x:collection1] o.a.s.c.S.Request [collection1]  webapp=/solr path=/query params={q=title:w1&indent=on&fl=*,+score&rows=4&wt=json} hits=4 status=0 QTime=3
   [junit4]   2> 9353 INFO  (qtp275154846-20) [    x:collection1] o.a.s.c.S.Request [collection1]  webapp=/solr path=/query params={q=title:w1&indent=on&fl=*,+score&rows=4&wt=json} hits=4 status=0 QTime=2
   [junit4]   2> 9375 INFO  (qtp275154846-20) [    x:collection1] o.a.s.c.S.Request [collection1]  webapp=/solr path=/query params={q=title:w1&indent=on&fl=*,+score&rows=4&wt=json} hits=4 status=0 QTime=2
   [junit4]   2> 9381 INFO  (qtp275154846-20) [    x:collection1] o.a.s.c.S.Request [collection1]  webapp=/solr path=/query params={q=title:w1&indent=on&fl=*,+score&rows=4&wt=json} hits=4 status=0 QTime=1
   [junit4]   2> 9394 INFO  (qtp275154846-20) [    x:collection1] o.a.s.c.S.Request [collection1]  webapp=/solr path=/query params={q=title:w1&indent=on&fl=*,+score&rows=4&wt=json} hits=4 status=0 QTime=1
   [junit4]   2> 9402 INFO  (qtp275154846-20) [    x:collection1] o.a.s.c.S.Request [collection1]  webapp=/solr path=/query params={q=title:w1&indent=on&fl=*,+score&rows=4&wt=json&rq={!ltr+model%3Dtitle-model+reRankDocs%3D4}} hits=4 status=0 QTime=1
   [junit4]   2> 9417 INFO  (qtp275154846-20) [    x:collection1] o.a.s.c.S.Request [collection1]  webapp=/solr path=/query params={q=title:w1&indent=on&fl=*,+score&rows=4&wt=json&rq={!ltr+model%3Dtitle-model+reRankDocs%3D4}} hits=4 status=0 QTime=2
   [junit4]   2> 9420 ERROR (TEST-TestFieldLengthFeature.testRanking-seed#[A5EE8440912DEDD3]) [    ] o.a.s.u.RestTestBase query failed JSON validation. error=mismatch: '8'!='1' @ response/docs/[0]/id
   [junit4]   2>  expected =/response/docs/[0]/id=='8'
   [junit4]   2>  response = {
   [junit4]   2>   "responseHeader":{
   [junit4]   2>     "status":0,
   [junit4]   2>     "QTime":2,
   [junit4]   2>     "params":{
   [junit4]   2>       "q":"title:w1",
   [junit4]   2>       "indent":"on",
   [junit4]   2>       "fl":"*, score",
   [junit4]   2>       "rows":"4",
   [junit4]   2>       "wt":"json",
   [junit4]   2>       "rq":"{!ltr model=title-model reRankDocs=4}"}},
   [junit4]   2>   "response":{"numFound":4,"start":0,"maxScore":2.95147899E18,"docs":[
   [junit4]   2>       {
   [junit4]   2>         "id":"1",
   [junit4]   2>         "title":"w1",
   [junit4]   2>         "description":"w1",
   [junit4]   2>         "_version_":1567929129284665344,
   [junit4]   2>         "score":2.95147899E18},
   [junit4]   2>       {
   [junit4]   2>         "id":"6",
   [junit4]   2>         "title":"w1 w2",
   [junit4]   2>         "description":"w1 w2",
   [junit4]   2>         "_version_":1567929129610772480,
   [junit4]   2>         "score":2.04963825E18},
   [junit4]   2>       {
   [junit4]   2>         "id":"7",
   [junit4]   2>         "title":"w1 w2 w3 w4 w5",
   [junit4]   2>         "description":"w1 w2 w3 w4 w5 w8",
   [junit4]   2>         "_version_":1567929129617063936,
   [junit4]   2>         "score":7.3786975E17},
   [junit4]   2>       {
   [junit4]   2>         "id":"8",
   [junit4]   2>         "title":"w1 w1 w1 w2 w2 w8",
   [junit4]   2>         "description":"w1 w1 w1 w2 w2",
   [junit4]   2>         "_version_":1567929129627549696,
   [junit4]   2>         "score":5.12409561E17}]
   [junit4]   2>   }}
   [junit4]   2> 
   [junit4]   2>  request = /query?q=title%3Aw1&fl=*%2C+score&rows=4&rq=%7B%21ltr+model%3Dtitle-model+reRankDocs%3D4%7D&wt=json&indent=on
   [junit4]   2> 
   [junit4]   2> 9420 INFO  (TEST-TestFieldLengthFeature.testRanking-seed#[A5EE8440912DEDD3]) [    ] o.a.s.SolrTestCaseJ4 ###Ending testRanking
   [junit4]   2> NOTE: reproduce with: ant test  -Dtestcase=TestFieldLengthFeature -Dtests.method=testRanking -Dtests.seed=A5EE8440912DEDD3 -Dtests.multiplier=2 -Dtests.slow=true -Dtests.locale=pl -Dtests.timezone=America/Anchorage -Dtests.asserts=true -Dtests.file.encoding=UTF-8
   [junit4] ERROR   0.13s J0 | TestFieldLengthFeature.testRanking <<<
   [junit4]    > Throwable #1: java.lang.RuntimeException: mismatch: '8'!='1' @ response/docs/[0]/id
   [junit4]    > 	at __randomizedtesting.SeedInfo.seed([A5EE8440912DEDD3:3AD82DDE0957F21C]:0)
   [junit4]    > 	at org.apache.solr.util.RestTestBase.assertJQ(RestTestBase.java:248)
   [junit4]    > 	at org.apache.solr.util.RestTestBase.assertJQ(RestTestBase.java:192)
   [junit4]    > 	at org.apache.solr.ltr.feature.TestFieldLengthFeature.testRanking(TestFieldLengthFeature.java:117)
   [junit4]    > 	at java.lang.Thread.run(Thread.java:745)
   [junit4]   2> 9443 INFO  (SUITE-TestFieldLengthFeature-seed#[A5EE8440912DEDD3]-worker) [    ] o.e.j.s.AbstractConnector Stopped ServerConnector@111aef50{SSL,[ssl, http/1.1]}{127.0.0.1:0}
   [junit4]   2> 9453 INFO  (SUITE-TestFieldLengthFeature-seed#[A5EE8440912DEDD3]-worker) [    ] o.a.s.c.CoreContainer Shutting down CoreContainer instance=331320006
   [junit4]   2> 9458 INFO  (SUITE-TestFieldLengthFeature-seed#[A5EE8440912DEDD3]-worker) [    ] o.a.s.m.SolrMetricManager Closing metric reporters for registry=solr.node, tag=null
   [junit4]   2> 9458 INFO  (SUITE-TestFieldLengthFeature-seed#[A5EE8440912DEDD3]-worker) [    ] o.a.s.m.SolrMetricManager Closing metric reporters for registry=solr.jvm, tag=null
   [junit4]   2> 9458 INFO  (SUITE-TestFieldLengthFeature-seed#[A5EE8440912DEDD3]-worker) [    ] o.a.s.m.SolrMetricManager Closing metric reporters for registry=solr.jetty, tag=null
   [junit4]   2> 9464 INFO  (SUITE-TestFieldLengthFeature-seed#[A5EE8440912DEDD3]-worker) [    ] o.a.s.c.TransientSolrCoreCacheDefault Allocating transient cache for 2147483647 transient cores
   [junit4]   2> 9568 INFO  (coreCloseExecutor-23-thread-1) [    x:collection1] o.a.s.c.SolrCore [collection1]  CLOSING SolrCore org.apache.solr.core.SolrCore@141e956e
   [junit4]   2> 9586 INFO  (coreCloseExecutor-23-thread-1) [    x:collection1] o.a.s.m.SolrMetricManager Closing metric reporters for registry=solr.core.collection1, tag=337548654
   [junit4]   2> 9597 INFO  (SUITE-TestFieldLengthFeature-seed#[A5EE8440912DEDD3]-worker) [    ] o.e.j.s.h.ContextHandler Stopped o.e.j.s.ServletContextHandler@2bc2cf05{/solr,null,UNAVAILABLE}
   [junit4]   2> 9605 INFO  (SUITE-TestFieldLengthFeature-seed#[A5EE8440912DEDD3]-worker) [    ] o.a.s.SolrTestCaseJ4 ###deleteCore
   [junit4]   2> 9606 INFO  (SUITE-TestFieldLengthFeature-seed#[A5EE8440912DEDD3]-worker) [    ] o.a.s.c.CoreContainer Shutting down CoreContainer instance=76712542
   [junit4]   2> 9606 INFO  (SUITE-TestFieldLengthFeature-seed#[A5EE8440912DEDD3]-worker) [    ] o.a.s.m.SolrMetricManager Closing metric reporters for registry=solr.node, tag=null
   [junit4]   2> 9614 INFO  (SUITE-TestFieldLengthFeature-seed#[A5EE8440912DEDD3]-worker) [    ] o.a.s.m.SolrMetricManager Closing metric reporters for registry=solr.jvm, tag=null
   [junit4]   2> 9614 INFO  (SUITE-TestFieldLengthFeature-seed#[A5EE8440912DEDD3]-worker) [    ] o.a.s.m.SolrMetricManager Closing metric reporters for registry=solr.jetty, tag=null
   [junit4]   2> 9614 INFO  (SUITE-TestFieldLengthFeature-seed#[A5EE8440912DEDD3]-worker) [    ] o.a.s.c.TransientSolrCoreCacheDefault Allocating transient cache for 2147483647 transient cores
   [junit4]   2> 9630 INFO  (coreCloseExecutor-25-thread-1) [    x:collection1] o.a.s.c.SolrCore [collection1]  CLOSING SolrCore org.apache.solr.core.SolrCore@4433df02
   [junit4]   2> 9642 INFO  (coreCloseExecutor-25-thread-1) [    x:collection1] o.a.s.m.SolrMetricManager Closing metric reporters for registry=solr.core.collection1, tag=1144250114
   [junit4]   2> NOTE: leaving temporary files on disk at: /x1/jenkins/jenkins-slave/workspace/Lucene-Solr-Tests-master/solr/build/contrib/solr-ltr/test/J0/temp/solr.ltr.feature.TestFieldLengthFeature_A5EE8440912DEDD3-001
   [junit4]   2> NOTE: test params are: codec=CheapBastard, sim=RandomSimilarity(queryNorm=false): {}, locale=pl, timezone=America/Anchorage
   [junit4]   2> NOTE: Linux 3.13.0-88-generic amd64/Oracle Corporation 1.8.0_121 (64-bit)/cpus=4,threads=1,free=250751720,total=346554368
   [junit4]   2> NOTE: All tests run in this JVM: [TestFieldLengthFeature]
   [junit4] Completed [2/33 (1!)] on J0 in 10.50s, 3 tests, 1 error <<< FAILURES!

[...truncated 43 lines...]
   [junit4] Suite: org.apache.solr.ltr.TestSelectiveWeightCreation
   [junit4]   2> Creating dataDir: /x1/jenkins/jenkins-slave/workspace/Lucene-Solr-Tests-master/solr/build/contrib/solr-ltr/test/J0/temp/solr.ltr.TestSelectiveWeightCreation_A5EE8440912DEDD3-001/init-core-data-001
   [junit4]   2> 18688 WARN  (SUITE-TestSelectiveWeightCreation-seed#[A5EE8440912DEDD3]-worker) [    ] o.a.s.SolrTestCaseJ4 startTrackingSearchers: numOpens=3 numCloses=3
   [junit4]   2> 18688 INFO  (SUITE-TestSelectiveWeightCreation-seed#[A5EE8440912DEDD3]-worker) [    ] o.a.s.SolrTestCaseJ4 Using PointFields
   [junit4]   2> 18690 INFO  (SUITE-TestSelectiveWeightCreation-seed#[A5EE8440912DEDD3]-worker) [    ] o.a.s.SolrTestCaseJ4 Randomized ssl (true) and clientAuth (false) via: @org.apache.solr.util.RandomizeSSL(reason=, ssl=NaN, value=NaN, clientAuth=NaN)
   [junit4]   2> 18691 INFO  (SUITE-TestSelectiveWeightCreation-seed#[A5EE8440912DEDD3]-worker) [    ] o.a.s.SolrTestCaseJ4 ####initCore
   [junit4]   2> 18727 INFO  (SUITE-TestSelectiveWeightCreation-seed#[A5EE8440912DEDD3]-worker) [    ] o.a.s.c.SolrConfig Using Lucene MatchVersion: 6.0.0
   [junit4]   2> 18762 INFO  (SUITE-TestSelectiveWeightCreation-seed#[A5EE8440912DEDD3]-worker) [    ] o.a.s.s.IndexSchema [null] Schema name=example
   [junit4]   2> 18794 INFO  (SUITE-TestSelectiveWeightCreation-seed#[A5EE8440912DEDD3]-worker) [    ] o.a.s.s.IndexSchema Loaded schema example/1.5 with uniqueid field id
   [junit4]   2> 18863 WARN  (SUITE-TestSelectiveWeightCreation-seed#[A5EE8440912DEDD3]-worker) [    ] o.a.s.m.r.SolrJmxReporter No JMX server found. Not exposing Solr metrics via JMX.
   [junit4]   2> 18863 WARN  (SUITE-TestSelectiveWeightCreation-seed#[A5EE8440912DEDD3]-worker) [    ] o.a.s.m.r.SolrJmxReporter No JMX server found. Not exposing Solr metrics via JMX.
   [junit4]   2> 18863 WARN  (SUITE-TestSelectiveWeightCreation-seed#[A5EE8440912DEDD3]-worker) [    ] o.a.s.m.r.SolrJmxReporter No JMX server found. Not exposing Solr metrics via JMX.
   [junit4]   2> 18885 INFO  (coreLoadExecutor-136-thread-1) [    x:collection1] o.a.s.c.SolrConfig Using Lucene MatchVersion: 6.0.0
   [junit4]   2> 18949 INFO  (coreLoadExecutor-136-thread-1) [    x:collection1] o.a.s.s.IndexSchema [collection1] Schema name=example
   [junit4]   2> 18962 INFO  (coreLoadExecutor-136-thread-1) [    x:collection1] o.a.s.s.IndexSchema Loaded schema example/1.5 with uniqueid field id
   [junit4]   2> 18964 INFO  (coreLoadExecutor-136-thread-1) [    x:collection1] o.a.s.c.CoreContainer Creating SolrCore 'collection1' using configuration from instancedir /x1/jenkins/jenkins-slave/workspace/Lucene-Solr-Tests-master/solr/contrib/ltr/src/test-files/solr/collection1, trusted=true
   [junit4]   2> 18964 WARN  (coreLoadExecutor-136-thread-1) [    x:collection1] o.a.s.m.r.SolrJmxReporter No JMX server found. Not exposing Solr metrics via JMX.
   [junit4]   2> 18968 INFO  (coreLoadExecutor-136-thread-1) [    x:collection1] o.a.s.c.SolrCore solr.RecoveryStrategy.Builder
   [junit4]   2> 18968 INFO  (coreLoadExecutor-136-thread-1) [    x:collection1] o.a.s.c.SolrCore [[collection1] ] Opening new SolrCore at [/x1/jenkins/jenkins-slave/workspace/Lucene-Solr-Tests-master/solr/contrib/ltr/src/test-files/solr/collection1], dataDir=[/x1/jenkins/jenkins-slave/workspace/Lucene-Solr-Tests-master/solr/build/contrib/solr-ltr/test/J0/temp/solr.ltr.TestSelectiveWeightCreation_A5EE8440912DEDD3-001/init-core-data-001/]
   [junit4]   2> 19038 WARN  (coreLoadExecutor-136-thread-1) [    x:collection1] o.a.s.c.RequestHandlers no default request handler is registered (either '/select' or 'standard')
   [junit4]   2> 19039 INFO  (coreLoadExecutor-136-thread-1) [    x:collection1] o.a.s.u.UpdateHandler Using UpdateLog implementation: org.apache.solr.update.UpdateLog
   [junit4]   2> 19039 INFO  (coreLoadExecutor-136-thread-1) [    x:collection1] o.a.s.u.UpdateLog Initializing UpdateLog: dataDir= defaultSyncLevel=FLUSH numRecordsToKeep=100 maxNumLogsToKeep=10 numVersionBuckets=65536
   [junit4]   2> 19039 INFO  (coreLoadExecutor-136-thread-1) [    x:collection1] o.a.s.u.CommitTracker Hard AutoCommit: if uncommited for 15000ms; 
   [junit4]   2> 19039 INFO  (coreLoadExecutor-136-thread-1) [    x:collection1] o.a.s.u.CommitTracker Soft AutoCommit: if uncommited for 1000ms; 
   [junit4]   2> 19041 INFO  (coreLoadExecutor-136-thread-1) [    x:collection1] o.a.s.s.SolrIndexSearcher Opening [Searcher@51fbf29d[collection1] main]
   [junit4]   2> 19041 WARN  (coreLoadExecutor-136-thread-1) [    x:collection1] o.a.s.r.ManagedResourceStorage Cannot write to config directory /x1/jenkins/jenkins-slave/workspace/Lucene-Solr-Tests-master/solr/contrib/ltr/src/test-files/solr/collection1/conf; switching to use InMemory storage instead.
   [junit4]   2> 19041 INFO  (coreLoadExecutor-136-thread-1) [    x:collection1] o.a.s.r.RestManager Registered ManagedResource impl org.apache.solr.ltr.store.rest.ManagedFeatureStore for 

[...truncated too long message...]

ava:251)
   [junit4]   2> 	at org.eclipse.jetty.io.AbstractConnection$ReadCallback.succeeded(AbstractConnection.java:273)
   [junit4]   2> 	at org.eclipse.jetty.io.FillInterest.fillable(FillInterest.java:95)
   [junit4]   2> 	at org.eclipse.jetty.io.SelectChannelEndPoint$2.run(SelectChannelEndPoint.java:93)
   [junit4]   2> 	at org.eclipse.jetty.util.thread.strategy.ExecuteProduceConsume.executeProduceConsume(ExecuteProduceConsume.java:303)
   [junit4]   2> 	at org.eclipse.jetty.util.thread.strategy.ExecuteProduceConsume.produceConsume(ExecuteProduceConsume.java:148)
   [junit4]   2> 	at org.eclipse.jetty.util.thread.strategy.ExecuteProduceConsume.run(ExecuteProduceConsume.java:136)
   [junit4]   2> 	at org.eclipse.jetty.util.thread.QueuedThreadPool.runJob(QueuedThreadPool.java:671)
   [junit4]   2> 	at org.eclipse.jetty.util.thread.QueuedThreadPool$2.run(QueuedThreadPool.java:589)
   [junit4]   2> 	at java.lang.Thread.run(Thread.java:745)
   [junit4]   2> 26180 INFO  (qtp2117618439-253) [    x:collection1] o.a.s.c.S.Request [collection1]  webapp=/solr path=/query params={q=*:*&indent=on&fl=*,score&rows=4&wt=json&rq={!ltr+reRankDocs%3D10+model%3Dexternalmodel+efi.user_query%3Dw3}} hits=5 status=0 QTime=13
   [junit4]   2> 26182 ERROR (TEST-TestParallelWeightCreation.testLTRScoringQueryParallelWeightCreationResultOrder-seed#[A5EE8440912DEDD3]) [    ] o.a.s.u.RestTestBase query failed JSON validation. error=mismatch: '3'!='4' @ response/docs/[0]/id
   [junit4]   2>  expected =/response/docs/[0]/id=='3'
   [junit4]   2>  response = {
   [junit4]   2>   "responseHeader":{
   [junit4]   2>     "status":0,
   [junit4]   2>     "QTime":13,
   [junit4]   2>     "params":{
   [junit4]   2>       "q":"*:*",
   [junit4]   2>       "indent":"on",
   [junit4]   2>       "fl":"*,score",
   [junit4]   2>       "rows":"4",
   [junit4]   2>       "wt":"json",
   [junit4]   2>       "rq":"{!ltr reRankDocs=10 model=externalmodel efi.user_query=w3}"}},
   [junit4]   2>   "response":{"numFound":5,"start":0,"maxScore":0.36707595,"docs":[
   [junit4]   2>       {
   [junit4]   2>         "id":"4",
   [junit4]   2>         "title":"w3 w3",
   [junit4]   2>         "description":"w4",
   [junit4]   2>         "popularity":4,
   [junit4]   2>         "_version_":1567929148163227648,
   [junit4]   2>         "score":0.36707595},
   [junit4]   2>       {
   [junit4]   2>         "id":"3",
   [junit4]   2>         "title":"w3",
   [junit4]   2>         "description":"w3",
   [junit4]   2>         "popularity":3,
   [junit4]   2>         "_version_":1567929148159033344,
   [junit4]   2>         "score":0.33873552},
   [junit4]   2>       {
   [junit4]   2>         "id":"1",
   [junit4]   2>         "title":"w1 w3",
   [junit4]   2>         "description":"w1",
   [junit4]   2>         "popularity":1,
   [junit4]   2>         "_version_":1567929148120236032,
   [junit4]   2>         "score":0.2545195},
   [junit4]   2>       {
   [junit4]   2>         "id":"2",
   [junit4]   2>         "title":"w2",
   [junit4]   2>         "description":"w2",
   [junit4]   2>         "popularity":2,
   [junit4]   2>         "_version_":1567929148154839040,
   [junit4]   2>         "score":0.0}]
   [junit4]   2>   }}
   [junit4]   2> 
   [junit4]   2>  request = /query?q=*%3A*&fl=*%2Cscore&rows=4&rq=%7B%21ltr+reRankDocs%3D10+model%3Dexternalmodel+efi.user_query%3Dw3%7D&wt=json&indent=on
   [junit4]   2> 
   [junit4]   2> 26182 INFO  (TEST-TestParallelWeightCreation.testLTRScoringQueryParallelWeightCreationResultOrder-seed#[A5EE8440912DEDD3]) [    ] o.a.s.SolrTestCaseJ4 ###Ending testLTRScoringQueryParallelWeightCreationResultOrder
   [junit4]   2> NOTE: reproduce with: ant test  -Dtestcase=TestParallelWeightCreation -Dtests.method=testLTRScoringQueryParallelWeightCreationResultOrder -Dtests.seed=A5EE8440912DEDD3 -Dtests.multiplier=2 -Dtests.slow=true -Dtests.locale=ja-JP-u-ca-japanese-x-lvariant-JP -Dtests.timezone=Europe/Oslo -Dtests.asserts=true -Dtests.file.encoding=UTF-8
   [junit4] ERROR   1.43s J1 | TestParallelWeightCreation.testLTRScoringQueryParallelWeightCreationResultOrder <<<
   [junit4]    > Throwable #1: java.lang.RuntimeException: mismatch: '3'!='4' @ response/docs/[0]/id
   [junit4]    > 	at __randomizedtesting.SeedInfo.seed([A5EE8440912DEDD3:C0A2A4205B4F8A3B]:0)
   [junit4]    > 	at org.apache.solr.util.RestTestBase.assertJQ(RestTestBase.java:248)
   [junit4]    > 	at org.apache.solr.util.RestTestBase.assertJQ(RestTestBase.java:192)
   [junit4]    > 	at org.apache.solr.ltr.TestParallelWeightCreation.testLTRScoringQueryParallelWeightCreationResultOrder(TestParallelWeightCreation.java:45)
   [junit4]    > 	at java.lang.Thread.run(Thread.java:745)
   [junit4]   2> 26197 INFO  (SUITE-TestParallelWeightCreation-seed#[A5EE8440912DEDD3]-worker) [    ] o.e.j.s.AbstractConnector Stopped ServerConnector@95aa78a{HTTP/1.1,[http/1.1]}{127.0.0.1:0}
   [junit4]   2> 26197 INFO  (SUITE-TestParallelWeightCreation-seed#[A5EE8440912DEDD3]-worker) [    ] o.a.s.c.CoreContainer Shutting down CoreContainer instance=1431816358
   [junit4]   2> 26197 INFO  (SUITE-TestParallelWeightCreation-seed#[A5EE8440912DEDD3]-worker) [    ] o.a.s.m.SolrMetricManager Closing metric reporters for registry=solr.node, tag=null
   [junit4]   2> 26198 INFO  (SUITE-TestParallelWeightCreation-seed#[A5EE8440912DEDD3]-worker) [    ] o.a.s.m.SolrMetricManager Closing metric reporters for registry=solr.jvm, tag=null
   [junit4]   2> 26198 INFO  (SUITE-TestParallelWeightCreation-seed#[A5EE8440912DEDD3]-worker) [    ] o.a.s.m.SolrMetricManager Closing metric reporters for registry=solr.jetty, tag=null
   [junit4]   2> 26198 INFO  (SUITE-TestParallelWeightCreation-seed#[A5EE8440912DEDD3]-worker) [    ] o.a.s.c.TransientSolrCoreCacheDefault Allocating transient cache for 2147483647 transient cores
   [junit4]   2> 26211 INFO  (coreCloseExecutor-208-thread-1) [    x:collection1] o.a.s.c.SolrCore [collection1]  CLOSING SolrCore org.apache.solr.core.SolrCore@62187fea
   [junit4]   2> 26231 INFO  (coreCloseExecutor-208-thread-1) [    x:collection1] o.a.s.m.SolrMetricManager Closing metric reporters for registry=solr.core.collection1, tag=1645772778
   [junit4]   2> 26233 INFO  (SUITE-TestParallelWeightCreation-seed#[A5EE8440912DEDD3]-worker) [    ] o.e.j.s.h.ContextHandler Stopped o.e.j.s.ServletContextHandler@59f6a62a{/solr,null,UNAVAILABLE}
   [junit4]   2> 26234 INFO  (SUITE-TestParallelWeightCreation-seed#[A5EE8440912DEDD3]-worker) [    ] o.a.s.SolrTestCaseJ4 ###deleteCore
   [junit4]   2> 26234 INFO  (SUITE-TestParallelWeightCreation-seed#[A5EE8440912DEDD3]-worker) [    ] o.a.s.c.CoreContainer Shutting down CoreContainer instance=1805636835
   [junit4]   2> 26234 INFO  (SUITE-TestParallelWeightCreation-seed#[A5EE8440912DEDD3]-worker) [    ] o.a.s.m.SolrMetricManager Closing metric reporters for registry=solr.node, tag=null
   [junit4]   2> 26234 INFO  (SUITE-TestParallelWeightCreation-seed#[A5EE8440912DEDD3]-worker) [    ] o.a.s.m.SolrMetricManager Closing metric reporters for registry=solr.jvm, tag=null
   [junit4]   2> 26234 INFO  (SUITE-TestParallelWeightCreation-seed#[A5EE8440912DEDD3]-worker) [    ] o.a.s.m.SolrMetricManager Closing metric reporters for registry=solr.jetty, tag=null
   [junit4]   2> 26234 INFO  (SUITE-TestParallelWeightCreation-seed#[A5EE8440912DEDD3]-worker) [    ] o.a.s.c.TransientSolrCoreCacheDefault Allocating transient cache for 2147483647 transient cores
   [junit4]   2> 26243 INFO  (coreCloseExecutor-210-thread-1) [    x:collection1] o.a.s.c.SolrCore [collection1]  CLOSING SolrCore org.apache.solr.core.SolrCore@658023ef
   [junit4]   2> 26263 INFO  (coreCloseExecutor-210-thread-1) [    x:collection1] o.a.s.m.SolrMetricManager Closing metric reporters for registry=solr.core.collection1, tag=1702896623
   [junit4]   2> NOTE: leaving temporary files on disk at: /x1/jenkins/jenkins-slave/workspace/Lucene-Solr-Tests-master/solr/build/contrib/solr-ltr/test/J1/temp/solr.ltr.TestParallelWeightCreation_A5EE8440912DEDD3-001
   [junit4]   2> May 20, 2017 3:22:38 PM com.carrotsearch.randomizedtesting.ThreadLeakControl checkThreadLeaks
   [junit4]   2> WARNING: Will linger awaiting termination of 3 leaked thread(s).
   [junit4]   2> NOTE: test params are: codec=Asserting(Lucene70): {_version_=BlockTreeOrds(blocksize=128), popularity=PostingsFormat(name=Asserting), description=TestBloomFilteredLucenePostings(BloomFilteringPostingsFormat(Lucene50(blocksize=128))), id=PostingsFormat(name=Asserting), text=PostingsFormat(name=LuceneVarGapDocFreqInterval), title=TestBloomFilteredLucenePostings(BloomFilteringPostingsFormat(Lucene50(blocksize=128)))}, docValues:{}, maxPointsInLeafNode=1972, maxMBSortInHeap=6.241264820272125, sim=RandomSimilarity(queryNorm=true): {}, locale=ja-JP-u-ca-japanese-x-lvariant-JP, timezone=Europe/Oslo
   [junit4]   2> NOTE: Linux 3.13.0-88-generic amd64/Oracle Corporation 1.8.0_121 (64-bit)/cpus=4,threads=1,free=292347856,total=332922880
   [junit4]   2> NOTE: All tests run in this JVM: [TestFieldValueFeature, TestValueFeature, TestFeatureExtractionFromMultipleSegments, TestUserTermScoreWithQ, TestEdisMaxSolrFeature, TestLTRQParserPlugin, TestLTRWithFacet, TestParallelWeightCreation]
   [junit4] Completed [33/33 (4!)] on J1 in 11.63s, 2 tests, 1 error <<< FAILURES!

[...truncated 1071 lines...]
-validate-source-patterns:
[source-patterns] tabs instead spaces: solr/solr-ref-guide/src/css/ref-guide.css
[source-patterns] tabs instead spaces: solr/solr-ref-guide/src/js/ref-guide-toc.js

BUILD FAILED
/x1/jenkins/jenkins-slave/workspace/Lucene-Solr-Tests-master/build.xml:775: The following error occurred while executing this line:
/x1/jenkins/jenkins-slave/workspace/Lucene-Solr-Tests-master/build.xml:130: Found 2 violations in source files (tabs instead spaces).

Total time: 76 minutes 41 seconds
Build step 'Invoke Ant' marked build as failure
Archiving artifacts
Recording test results
Email was triggered for: Failure - Any
Sending email for trigger: Failure - Any

Mime
View raw message