lucene-dev mailing list archives

Site index · List index
Message view « Date » · « Thread »
Top « Date » · « Thread »
From Policeman Jenkins Server <jenk...@thetaphi.de>
Subject [JENKINS-EA] Lucene-Solr-master-Linux (64bit/jdk-9-ea+168) - Build # 19688 - Still Unstable!
Date Tue, 23 May 2017 14:36:59 GMT
Build: https://jenkins.thetaphi.de/job/Lucene-Solr-master-Linux/19688/
Java: 64bit/jdk-9-ea+168 -XX:+UseCompressedOops -XX:+UseSerialGC

4 tests failed.
FAILED:  org.apache.solr.ltr.TestLTRQParserPlugin.ltrMoreResultsThanReRankedTest

Error Message:
mismatch: '0.09271725'!='0.105360515' @ response/docs/[3]/score

Stack Trace:
java.lang.RuntimeException: mismatch: '0.09271725'!='0.105360515' @ response/docs/[3]/score
	at __randomizedtesting.SeedInfo.seed([DC3017ADBDFFF73B:1548A6CA6230A0FA]:0)
	at org.apache.solr.util.RestTestBase.assertJQ(RestTestBase.java:248)
	at org.apache.solr.util.RestTestBase.assertJQ(RestTestBase.java:192)
	at org.apache.solr.ltr.TestLTRQParserPlugin.ltrMoreResultsThanReRankedTest(TestLTRQParserPlugin.java:94)
	at java.base/jdk.internal.reflect.NativeMethodAccessorImpl.invoke0(Native Method)
	at java.base/jdk.internal.reflect.NativeMethodAccessorImpl.invoke(NativeMethodAccessorImpl.java:62)
	at java.base/jdk.internal.reflect.DelegatingMethodAccessorImpl.invoke(DelegatingMethodAccessorImpl.java:43)
	at java.base/java.lang.reflect.Method.invoke(Method.java:563)
	at com.carrotsearch.randomizedtesting.RandomizedRunner.invoke(RandomizedRunner.java:1713)
	at com.carrotsearch.randomizedtesting.RandomizedRunner$8.evaluate(RandomizedRunner.java:907)
	at com.carrotsearch.randomizedtesting.RandomizedRunner$9.evaluate(RandomizedRunner.java:943)
	at com.carrotsearch.randomizedtesting.RandomizedRunner$10.evaluate(RandomizedRunner.java:957)
	at com.carrotsearch.randomizedtesting.rules.SystemPropertiesRestoreRule$1.evaluate(SystemPropertiesRestoreRule.java:57)
	at org.apache.lucene.util.TestRuleSetupTeardownChained$1.evaluate(TestRuleSetupTeardownChained.java:49)
	at org.apache.lucene.util.AbstractBeforeAfterRule$1.evaluate(AbstractBeforeAfterRule.java:45)
	at org.apache.lucene.util.TestRuleThreadAndTestName$1.evaluate(TestRuleThreadAndTestName.java:48)
	at org.apache.lucene.util.TestRuleIgnoreAfterMaxFailures$1.evaluate(TestRuleIgnoreAfterMaxFailures.java:64)
	at org.apache.lucene.util.TestRuleMarkFailure$1.evaluate(TestRuleMarkFailure.java:47)
	at com.carrotsearch.randomizedtesting.rules.StatementAdapter.evaluate(StatementAdapter.java:36)
	at com.carrotsearch.randomizedtesting.ThreadLeakControl$StatementRunner.run(ThreadLeakControl.java:368)
	at com.carrotsearch.randomizedtesting.ThreadLeakControl.forkTimeoutingTask(ThreadLeakControl.java:817)
	at com.carrotsearch.randomizedtesting.ThreadLeakControl$3.evaluate(ThreadLeakControl.java:468)
	at com.carrotsearch.randomizedtesting.RandomizedRunner.runSingleTest(RandomizedRunner.java:916)
	at com.carrotsearch.randomizedtesting.RandomizedRunner$5.evaluate(RandomizedRunner.java:802)
	at com.carrotsearch.randomizedtesting.RandomizedRunner$6.evaluate(RandomizedRunner.java:852)
	at com.carrotsearch.randomizedtesting.RandomizedRunner$7.evaluate(RandomizedRunner.java:863)
	at com.carrotsearch.randomizedtesting.rules.StatementAdapter.evaluate(StatementAdapter.java:36)
	at com.carrotsearch.randomizedtesting.rules.SystemPropertiesRestoreRule$1.evaluate(SystemPropertiesRestoreRule.java:57)
	at org.apache.lucene.util.AbstractBeforeAfterRule$1.evaluate(AbstractBeforeAfterRule.java:45)
	at com.carrotsearch.randomizedtesting.rules.StatementAdapter.evaluate(StatementAdapter.java:36)
	at org.apache.lucene.util.TestRuleStoreClassName$1.evaluate(TestRuleStoreClassName.java:41)
	at com.carrotsearch.randomizedtesting.rules.NoShadowingOrOverridesOnMethodsRule$1.evaluate(NoShadowingOrOverridesOnMethodsRule.java:40)
	at com.carrotsearch.randomizedtesting.rules.NoShadowingOrOverridesOnMethodsRule$1.evaluate(NoShadowingOrOverridesOnMethodsRule.java:40)
	at com.carrotsearch.randomizedtesting.rules.StatementAdapter.evaluate(StatementAdapter.java:36)
	at com.carrotsearch.randomizedtesting.rules.StatementAdapter.evaluate(StatementAdapter.java:36)
	at org.apache.lucene.util.TestRuleAssertionsRequired$1.evaluate(TestRuleAssertionsRequired.java:53)
	at org.apache.lucene.util.TestRuleMarkFailure$1.evaluate(TestRuleMarkFailure.java:47)
	at org.apache.lucene.util.TestRuleIgnoreAfterMaxFailures$1.evaluate(TestRuleIgnoreAfterMaxFailures.java:64)
	at org.apache.lucene.util.TestRuleIgnoreTestSuites$1.evaluate(TestRuleIgnoreTestSuites.java:54)
	at com.carrotsearch.randomizedtesting.rules.StatementAdapter.evaluate(StatementAdapter.java:36)
	at com.carrotsearch.randomizedtesting.ThreadLeakControl$StatementRunner.run(ThreadLeakControl.java:368)
	at java.base/java.lang.Thread.run(Thread.java:844)


FAILED:  org.apache.solr.ltr.TestParallelWeightCreation.testLTRScoringQueryParallelWeightCreationResultOrder

Error Message:
mismatch: '3'!='4' @ response/docs/[0]/id

Stack Trace:
java.lang.RuntimeException: mismatch: '3'!='4' @ response/docs/[0]/id
	at __randomizedtesting.SeedInfo.seed([DC3017ADBDFFF73B:B97C37CD779D90D3]:0)
	at org.apache.solr.util.RestTestBase.assertJQ(RestTestBase.java:248)
	at org.apache.solr.util.RestTestBase.assertJQ(RestTestBase.java:192)
	at org.apache.solr.ltr.TestParallelWeightCreation.testLTRScoringQueryParallelWeightCreationResultOrder(TestParallelWeightCreation.java:45)
	at java.base/jdk.internal.reflect.NativeMethodAccessorImpl.invoke0(Native Method)
	at java.base/jdk.internal.reflect.NativeMethodAccessorImpl.invoke(NativeMethodAccessorImpl.java:62)
	at java.base/jdk.internal.reflect.DelegatingMethodAccessorImpl.invoke(DelegatingMethodAccessorImpl.java:43)
	at java.base/java.lang.reflect.Method.invoke(Method.java:563)
	at com.carrotsearch.randomizedtesting.RandomizedRunner.invoke(RandomizedRunner.java:1713)
	at com.carrotsearch.randomizedtesting.RandomizedRunner$8.evaluate(RandomizedRunner.java:907)
	at com.carrotsearch.randomizedtesting.RandomizedRunner$9.evaluate(RandomizedRunner.java:943)
	at com.carrotsearch.randomizedtesting.RandomizedRunner$10.evaluate(RandomizedRunner.java:957)
	at com.carrotsearch.randomizedtesting.rules.SystemPropertiesRestoreRule$1.evaluate(SystemPropertiesRestoreRule.java:57)
	at org.apache.lucene.util.TestRuleSetupTeardownChained$1.evaluate(TestRuleSetupTeardownChained.java:49)
	at org.apache.lucene.util.AbstractBeforeAfterRule$1.evaluate(AbstractBeforeAfterRule.java:45)
	at org.apache.lucene.util.TestRuleThreadAndTestName$1.evaluate(TestRuleThreadAndTestName.java:48)
	at org.apache.lucene.util.TestRuleIgnoreAfterMaxFailures$1.evaluate(TestRuleIgnoreAfterMaxFailures.java:64)
	at org.apache.lucene.util.TestRuleMarkFailure$1.evaluate(TestRuleMarkFailure.java:47)
	at com.carrotsearch.randomizedtesting.rules.StatementAdapter.evaluate(StatementAdapter.java:36)
	at com.carrotsearch.randomizedtesting.ThreadLeakControl$StatementRunner.run(ThreadLeakControl.java:368)
	at com.carrotsearch.randomizedtesting.ThreadLeakControl.forkTimeoutingTask(ThreadLeakControl.java:817)
	at com.carrotsearch.randomizedtesting.ThreadLeakControl$3.evaluate(ThreadLeakControl.java:468)
	at com.carrotsearch.randomizedtesting.RandomizedRunner.runSingleTest(RandomizedRunner.java:916)
	at com.carrotsearch.randomizedtesting.RandomizedRunner$5.evaluate(RandomizedRunner.java:802)
	at com.carrotsearch.randomizedtesting.RandomizedRunner$6.evaluate(RandomizedRunner.java:852)
	at com.carrotsearch.randomizedtesting.RandomizedRunner$7.evaluate(RandomizedRunner.java:863)
	at com.carrotsearch.randomizedtesting.rules.StatementAdapter.evaluate(StatementAdapter.java:36)
	at com.carrotsearch.randomizedtesting.rules.SystemPropertiesRestoreRule$1.evaluate(SystemPropertiesRestoreRule.java:57)
	at org.apache.lucene.util.AbstractBeforeAfterRule$1.evaluate(AbstractBeforeAfterRule.java:45)
	at com.carrotsearch.randomizedtesting.rules.StatementAdapter.evaluate(StatementAdapter.java:36)
	at org.apache.lucene.util.TestRuleStoreClassName$1.evaluate(TestRuleStoreClassName.java:41)
	at com.carrotsearch.randomizedtesting.rules.NoShadowingOrOverridesOnMethodsRule$1.evaluate(NoShadowingOrOverridesOnMethodsRule.java:40)
	at com.carrotsearch.randomizedtesting.rules.NoShadowingOrOverridesOnMethodsRule$1.evaluate(NoShadowingOrOverridesOnMethodsRule.java:40)
	at com.carrotsearch.randomizedtesting.rules.StatementAdapter.evaluate(StatementAdapter.java:36)
	at com.carrotsearch.randomizedtesting.rules.StatementAdapter.evaluate(StatementAdapter.java:36)
	at org.apache.lucene.util.TestRuleAssertionsRequired$1.evaluate(TestRuleAssertionsRequired.java:53)
	at org.apache.lucene.util.TestRuleMarkFailure$1.evaluate(TestRuleMarkFailure.java:47)
	at org.apache.lucene.util.TestRuleIgnoreAfterMaxFailures$1.evaluate(TestRuleIgnoreAfterMaxFailures.java:64)
	at org.apache.lucene.util.TestRuleIgnoreTestSuites$1.evaluate(TestRuleIgnoreTestSuites.java:54)
	at com.carrotsearch.randomizedtesting.rules.StatementAdapter.evaluate(StatementAdapter.java:36)
	at com.carrotsearch.randomizedtesting.ThreadLeakControl$StatementRunner.run(ThreadLeakControl.java:368)
	at java.base/java.lang.Thread.run(Thread.java:844)


FAILED:  org.apache.solr.ltr.TestSelectiveWeightCreation.testSelectiveWeightsRequestFeaturesFromDifferentStore

Error Message:
mismatch: '3'!='4' @ response/docs/[0]/id

Stack Trace:
java.lang.RuntimeException: mismatch: '3'!='4' @ response/docs/[0]/id
	at __randomizedtesting.SeedInfo.seed([DC3017ADBDFFF73B:8101006830C38050]:0)
	at org.apache.solr.util.RestTestBase.assertJQ(RestTestBase.java:248)
	at org.apache.solr.util.RestTestBase.assertJQ(RestTestBase.java:192)
	at org.apache.solr.ltr.TestSelectiveWeightCreation.testSelectiveWeightsRequestFeaturesFromDifferentStore(TestSelectiveWeightCreation.java:230)
	at java.base/jdk.internal.reflect.NativeMethodAccessorImpl.invoke0(Native Method)
	at java.base/jdk.internal.reflect.NativeMethodAccessorImpl.invoke(NativeMethodAccessorImpl.java:62)
	at java.base/jdk.internal.reflect.DelegatingMethodAccessorImpl.invoke(DelegatingMethodAccessorImpl.java:43)
	at java.base/java.lang.reflect.Method.invoke(Method.java:563)
	at com.carrotsearch.randomizedtesting.RandomizedRunner.invoke(RandomizedRunner.java:1713)
	at com.carrotsearch.randomizedtesting.RandomizedRunner$8.evaluate(RandomizedRunner.java:907)
	at com.carrotsearch.randomizedtesting.RandomizedRunner$9.evaluate(RandomizedRunner.java:943)
	at com.carrotsearch.randomizedtesting.RandomizedRunner$10.evaluate(RandomizedRunner.java:957)
	at com.carrotsearch.randomizedtesting.rules.SystemPropertiesRestoreRule$1.evaluate(SystemPropertiesRestoreRule.java:57)
	at org.apache.lucene.util.TestRuleSetupTeardownChained$1.evaluate(TestRuleSetupTeardownChained.java:49)
	at org.apache.lucene.util.AbstractBeforeAfterRule$1.evaluate(AbstractBeforeAfterRule.java:45)
	at org.apache.lucene.util.TestRuleThreadAndTestName$1.evaluate(TestRuleThreadAndTestName.java:48)
	at org.apache.lucene.util.TestRuleIgnoreAfterMaxFailures$1.evaluate(TestRuleIgnoreAfterMaxFailures.java:64)
	at org.apache.lucene.util.TestRuleMarkFailure$1.evaluate(TestRuleMarkFailure.java:47)
	at com.carrotsearch.randomizedtesting.rules.StatementAdapter.evaluate(StatementAdapter.java:36)
	at com.carrotsearch.randomizedtesting.ThreadLeakControl$StatementRunner.run(ThreadLeakControl.java:368)
	at com.carrotsearch.randomizedtesting.ThreadLeakControl.forkTimeoutingTask(ThreadLeakControl.java:817)
	at com.carrotsearch.randomizedtesting.ThreadLeakControl$3.evaluate(ThreadLeakControl.java:468)
	at com.carrotsearch.randomizedtesting.RandomizedRunner.runSingleTest(RandomizedRunner.java:916)
	at com.carrotsearch.randomizedtesting.RandomizedRunner$5.evaluate(RandomizedRunner.java:802)
	at com.carrotsearch.randomizedtesting.RandomizedRunner$6.evaluate(RandomizedRunner.java:852)
	at com.carrotsearch.randomizedtesting.RandomizedRunner$7.evaluate(RandomizedRunner.java:863)
	at com.carrotsearch.randomizedtesting.rules.StatementAdapter.evaluate(StatementAdapter.java:36)
	at com.carrotsearch.randomizedtesting.rules.SystemPropertiesRestoreRule$1.evaluate(SystemPropertiesRestoreRule.java:57)
	at org.apache.lucene.util.AbstractBeforeAfterRule$1.evaluate(AbstractBeforeAfterRule.java:45)
	at com.carrotsearch.randomizedtesting.rules.StatementAdapter.evaluate(StatementAdapter.java:36)
	at org.apache.lucene.util.TestRuleStoreClassName$1.evaluate(TestRuleStoreClassName.java:41)
	at com.carrotsearch.randomizedtesting.rules.NoShadowingOrOverridesOnMethodsRule$1.evaluate(NoShadowingOrOverridesOnMethodsRule.java:40)
	at com.carrotsearch.randomizedtesting.rules.NoShadowingOrOverridesOnMethodsRule$1.evaluate(NoShadowingOrOverridesOnMethodsRule.java:40)
	at com.carrotsearch.randomizedtesting.rules.StatementAdapter.evaluate(StatementAdapter.java:36)
	at com.carrotsearch.randomizedtesting.rules.StatementAdapter.evaluate(StatementAdapter.java:36)
	at org.apache.lucene.util.TestRuleAssertionsRequired$1.evaluate(TestRuleAssertionsRequired.java:53)
	at org.apache.lucene.util.TestRuleMarkFailure$1.evaluate(TestRuleMarkFailure.java:47)
	at org.apache.lucene.util.TestRuleIgnoreAfterMaxFailures$1.evaluate(TestRuleIgnoreAfterMaxFailures.java:64)
	at org.apache.lucene.util.TestRuleIgnoreTestSuites$1.evaluate(TestRuleIgnoreTestSuites.java:54)
	at com.carrotsearch.randomizedtesting.rules.StatementAdapter.evaluate(StatementAdapter.java:36)
	at com.carrotsearch.randomizedtesting.ThreadLeakControl$StatementRunner.run(ThreadLeakControl.java:368)
	at java.base/java.lang.Thread.run(Thread.java:844)


FAILED:  org.apache.solr.ltr.feature.TestFieldLengthFeature.testRanking

Error Message:
mismatch: '8'!='1' @ response/docs/[0]/id

Stack Trace:
java.lang.RuntimeException: mismatch: '8'!='1' @ response/docs/[0]/id
	at __randomizedtesting.SeedInfo.seed([DC3017ADBDFFF73B:4306BE332585E8F4]:0)
	at org.apache.solr.util.RestTestBase.assertJQ(RestTestBase.java:248)
	at org.apache.solr.util.RestTestBase.assertJQ(RestTestBase.java:192)
	at org.apache.solr.ltr.feature.TestFieldLengthFeature.testRanking(TestFieldLengthFeature.java:117)
	at java.base/jdk.internal.reflect.NativeMethodAccessorImpl.invoke0(Native Method)
	at java.base/jdk.internal.reflect.NativeMethodAccessorImpl.invoke(NativeMethodAccessorImpl.java:62)
	at java.base/jdk.internal.reflect.DelegatingMethodAccessorImpl.invoke(DelegatingMethodAccessorImpl.java:43)
	at java.base/java.lang.reflect.Method.invoke(Method.java:563)
	at com.carrotsearch.randomizedtesting.RandomizedRunner.invoke(RandomizedRunner.java:1713)
	at com.carrotsearch.randomizedtesting.RandomizedRunner$8.evaluate(RandomizedRunner.java:907)
	at com.carrotsearch.randomizedtesting.RandomizedRunner$9.evaluate(RandomizedRunner.java:943)
	at com.carrotsearch.randomizedtesting.RandomizedRunner$10.evaluate(RandomizedRunner.java:957)
	at com.carrotsearch.randomizedtesting.rules.SystemPropertiesRestoreRule$1.evaluate(SystemPropertiesRestoreRule.java:57)
	at org.apache.lucene.util.TestRuleSetupTeardownChained$1.evaluate(TestRuleSetupTeardownChained.java:49)
	at org.apache.lucene.util.AbstractBeforeAfterRule$1.evaluate(AbstractBeforeAfterRule.java:45)
	at org.apache.lucene.util.TestRuleThreadAndTestName$1.evaluate(TestRuleThreadAndTestName.java:48)
	at org.apache.lucene.util.TestRuleIgnoreAfterMaxFailures$1.evaluate(TestRuleIgnoreAfterMaxFailures.java:64)
	at org.apache.lucene.util.TestRuleMarkFailure$1.evaluate(TestRuleMarkFailure.java:47)
	at com.carrotsearch.randomizedtesting.rules.StatementAdapter.evaluate(StatementAdapter.java:36)
	at com.carrotsearch.randomizedtesting.ThreadLeakControl$StatementRunner.run(ThreadLeakControl.java:368)
	at com.carrotsearch.randomizedtesting.ThreadLeakControl.forkTimeoutingTask(ThreadLeakControl.java:817)
	at com.carrotsearch.randomizedtesting.ThreadLeakControl$3.evaluate(ThreadLeakControl.java:468)
	at com.carrotsearch.randomizedtesting.RandomizedRunner.runSingleTest(RandomizedRunner.java:916)
	at com.carrotsearch.randomizedtesting.RandomizedRunner$5.evaluate(RandomizedRunner.java:802)
	at com.carrotsearch.randomizedtesting.RandomizedRunner$6.evaluate(RandomizedRunner.java:852)
	at com.carrotsearch.randomizedtesting.RandomizedRunner$7.evaluate(RandomizedRunner.java:863)
	at com.carrotsearch.randomizedtesting.rules.StatementAdapter.evaluate(StatementAdapter.java:36)
	at com.carrotsearch.randomizedtesting.rules.SystemPropertiesRestoreRule$1.evaluate(SystemPropertiesRestoreRule.java:57)
	at org.apache.lucene.util.AbstractBeforeAfterRule$1.evaluate(AbstractBeforeAfterRule.java:45)
	at com.carrotsearch.randomizedtesting.rules.StatementAdapter.evaluate(StatementAdapter.java:36)
	at org.apache.lucene.util.TestRuleStoreClassName$1.evaluate(TestRuleStoreClassName.java:41)
	at com.carrotsearch.randomizedtesting.rules.NoShadowingOrOverridesOnMethodsRule$1.evaluate(NoShadowingOrOverridesOnMethodsRule.java:40)
	at com.carrotsearch.randomizedtesting.rules.NoShadowingOrOverridesOnMethodsRule$1.evaluate(NoShadowingOrOverridesOnMethodsRule.java:40)
	at com.carrotsearch.randomizedtesting.rules.StatementAdapter.evaluate(StatementAdapter.java:36)
	at com.carrotsearch.randomizedtesting.rules.StatementAdapter.evaluate(StatementAdapter.java:36)
	at org.apache.lucene.util.TestRuleAssertionsRequired$1.evaluate(TestRuleAssertionsRequired.java:53)
	at org.apache.lucene.util.TestRuleMarkFailure$1.evaluate(TestRuleMarkFailure.java:47)
	at org.apache.lucene.util.TestRuleIgnoreAfterMaxFailures$1.evaluate(TestRuleIgnoreAfterMaxFailures.java:64)
	at org.apache.lucene.util.TestRuleIgnoreTestSuites$1.evaluate(TestRuleIgnoreTestSuites.java:54)
	at com.carrotsearch.randomizedtesting.rules.StatementAdapter.evaluate(StatementAdapter.java:36)
	at com.carrotsearch.randomizedtesting.ThreadLeakControl$StatementRunner.run(ThreadLeakControl.java:368)
	at java.base/java.lang.Thread.run(Thread.java:844)




Build Log:
[...truncated 19592 lines...]
   [junit4] Suite: org.apache.solr.ltr.feature.TestFieldLengthFeature
   [junit4]   2> 2110 INFO  (SUITE-TestFieldLengthFeature-seed#[DC3017ADBDFFF73B]) [    ] o.a.s.c.SolrResourceLoader solr home defaulted to 'solr/' (could not find system property or JNDI)
   [junit4]   2> Creating dataDir: /home/jenkins/workspace/Lucene-Solr-master-Linux/solr/build/contrib/solr-ltr/test/J0/temp/solr.ltr.feature.TestFieldLengthFeature_DC3017ADBDFFF73B-001/init-core-data-001
   [junit4]   2> 2144 WARN  (SUITE-TestFieldLengthFeature-seed#[DC3017ADBDFFF73B]-worker) [    ] o.a.s.SolrTestCaseJ4 startTrackingSearchers: numOpens=1 numCloses=1
   [junit4]   2> 2144 INFO  (SUITE-TestFieldLengthFeature-seed#[DC3017ADBDFFF73B]-worker) [    ] o.a.s.SolrTestCaseJ4 Using PointFields
   [junit4]   2> 2145 INFO  (SUITE-TestFieldLengthFeature-seed#[DC3017ADBDFFF73B]-worker) [    ] o.a.s.SolrTestCaseJ4 Randomized ssl (false) and clientAuth (false) via: @org.apache.solr.util.RandomizeSSL(reason="", ssl=0.0/0.0, value=0.0/0.0, clientAuth=0.0/0.0)
   [junit4]   2> 2146 INFO  (SUITE-TestFieldLengthFeature-seed#[DC3017ADBDFFF73B]-worker) [    ] o.a.s.SolrTestCaseJ4 ####initCore
   [junit4]   2> 2188 INFO  (SUITE-TestFieldLengthFeature-seed#[DC3017ADBDFFF73B]-worker) [    ] o.a.s.c.SolrConfig Using Lucene MatchVersion: 6.0.0
   [junit4]   2> 2213 INFO  (SUITE-TestFieldLengthFeature-seed#[DC3017ADBDFFF73B]-worker) [    ] o.a.s.s.IndexSchema [null] Schema name=example
   [junit4]   2> 2232 INFO  (SUITE-TestFieldLengthFeature-seed#[DC3017ADBDFFF73B]-worker) [    ] o.a.s.s.IndexSchema Loaded schema example/1.5 with uniqueid field id
   [junit4]   2> 2284 WARN  (SUITE-TestFieldLengthFeature-seed#[DC3017ADBDFFF73B]-worker) [    ] o.a.s.m.r.SolrJmxReporter No JMX server found. Not exposing Solr metrics via JMX.
   [junit4]   2> 2284 WARN  (SUITE-TestFieldLengthFeature-seed#[DC3017ADBDFFF73B]-worker) [    ] o.a.s.m.r.SolrJmxReporter No JMX server found. Not exposing Solr metrics via JMX.
   [junit4]   2> 2285 WARN  (SUITE-TestFieldLengthFeature-seed#[DC3017ADBDFFF73B]-worker) [    ] o.a.s.m.r.SolrJmxReporter No JMX server found. Not exposing Solr metrics via JMX.
   [junit4]   2> 2307 INFO  (coreLoadExecutor-19-thread-1) [    ] o.a.s.c.SolrConfig Using Lucene MatchVersion: 6.0.0
   [junit4]   2> 2336 INFO  (coreLoadExecutor-19-thread-1) [    ] o.a.s.s.IndexSchema [collection1] Schema name=example
   [junit4]   2> 2348 INFO  (coreLoadExecutor-19-thread-1) [    ] o.a.s.s.IndexSchema Loaded schema example/1.5 with uniqueid field id
   [junit4]   2> 2359 INFO  (coreLoadExecutor-19-thread-1) [    ] o.a.s.c.CoreContainer Creating SolrCore 'collection1' using configuration from instancedir /home/jenkins/workspace/Lucene-Solr-master-Linux/solr/contrib/ltr/src/test-files/solr/collection1, trusted=true
   [junit4]   2> 2360 WARN  (coreLoadExecutor-19-thread-1) [    ] o.a.s.m.r.SolrJmxReporter No JMX server found. Not exposing Solr metrics via JMX.
   [junit4]   2> 2360 INFO  (coreLoadExecutor-19-thread-1) [    ] o.a.s.c.SolrCore solr.RecoveryStrategy.Builder
   [junit4]   2> 2360 INFO  (coreLoadExecutor-19-thread-1) [    ] o.a.s.c.SolrCore [[collection1] ] Opening new SolrCore at [/home/jenkins/workspace/Lucene-Solr-master-Linux/solr/contrib/ltr/src/test-files/solr/collection1], dataDir=[/home/jenkins/workspace/Lucene-Solr-master-Linux/solr/build/contrib/solr-ltr/test/J0/temp/solr.ltr.feature.TestFieldLengthFeature_DC3017ADBDFFF73B-001/init-core-data-001/]
   [junit4]   2> 2563 WARN  (coreLoadExecutor-19-thread-1) [    ] o.a.s.c.RequestHandlers no default request handler is registered (either '/select' or 'standard')
   [junit4]   2> 2565 INFO  (coreLoadExecutor-19-thread-1) [    ] o.a.s.u.UpdateHandler Using UpdateLog implementation: org.apache.solr.update.UpdateLog
   [junit4]   2> 2565 INFO  (coreLoadExecutor-19-thread-1) [    ] o.a.s.u.UpdateLog Initializing UpdateLog: dataDir= defaultSyncLevel=FLUSH numRecordsToKeep=100 maxNumLogsToKeep=10 numVersionBuckets=65536
   [junit4]   2> 2569 INFO  (coreLoadExecutor-19-thread-1) [    ] o.a.s.u.CommitTracker Hard AutoCommit: if uncommited for 15000ms; 
   [junit4]   2> 2569 INFO  (coreLoadExecutor-19-thread-1) [    ] o.a.s.u.CommitTracker Soft AutoCommit: if uncommited for 1000ms; 
   [junit4]   2> 2570 INFO  (coreLoadExecutor-19-thread-1) [    ] o.a.s.s.SolrIndexSearcher Opening [Searcher@69ad444b[collection1] main]
   [junit4]   2> 2571 WARN  (coreLoadExecutor-19-thread-1) [    ] o.a.s.r.ManagedResourceStorage Cannot write to config directory /home/jenkins/workspace/Lucene-Solr-master-Linux/solr/contrib/ltr/src/test-files/solr/collection1/conf; switching to use InMemory storage instead.
   [junit4]   2> 2571 INFO  (coreLoadExecutor-19-thread-1) [    ] o.a.s.r.RestManager Registered ManagedResource impl org.apache.solr.ltr.store.rest.ManagedFeatureStore for path /schema/feature-store
   [junit4]   2> 2571 WARN  (coreLoadExecutor-19-thread-1) [    ] o.a.s.r.ManagedResource No stored data found for /schema/feature-store
   [junit4]   2> 2571 INFO  (coreLoadExecutor-19-thread-1) [    ] o.a.s.l.s.r.ManagedFeatureStore ------ managed feature ~ loading ------
   [junit4]   2> 2571 INFO  (coreLoadExecutor-19-thread-1) [    ] o.a.s.r.ManagedResource Notified 1 observers of /schema/feature-store
   [junit4]   2> 2571 INFO  (coreLoadExecutor-19-thread-1) [    ] o.a.s.r.RestManager Registered new managed resource /schema/feature-store
   [junit4]   2> 2571 INFO  (coreLoadExecutor-19-thread-1) [    ] o.a.s.r.RestManager Registered ManagedResource impl org.apache.solr.ltr.store.rest.ManagedModelStore for path /schema/model-store
   [junit4]   2> 2571 WARN  (coreLoadExecutor-19-thread-1) [    ] o.a.s.r.ManagedResource No stored data found for /schema/model-store
   [junit4]   2> 2572 INFO  (coreLoadExecutor-19-thread-1) [    ] o.a.s.l.s.r.ManagedModelStore INIT model store
   [junit4]   2> 2572 INFO  (coreLoadExecutor-19-thread-1) [    ] o.a.s.l.s.r.ManagedModelStore ------ managed models ~ loading ------
   [junit4]   2> 2572 INFO  (coreLoadExecutor-19-thread-1) [    ] o.a.s.r.ManagedResource Notified 1 observers of /schema/model-store
   [junit4]   2> 2572 INFO  (coreLoadExecutor-19-thread-1) [    ] o.a.s.r.RestManager Registered new managed resource /schema/model-store
   [junit4]   2> 2572 INFO  (coreLoadExecutor-19-thread-1) [    ] o.a.s.h.ReplicationHandler Commits will be reserved for  10000
   [junit4]   2> 2573 INFO  (coreLoadExecutor-19-thread-1) [    ] o.a.s.u.UpdateLog Could not find max version in index or recent updates, using new clock 1568197954180743168
   [junit4]   2> 2575 INFO  (SUITE-TestFieldLengthFeature-seed#[DC3017ADBDFFF73B]-worker) [    ] o.a.s.SolrTestCaseJ4 ####initCore end
   [junit4]   2> 2579 INFO  (searcherExecutor-20-thread-1) [    ] o.a.s.c.SolrCore [collection1] Registered new searcher Searcher@69ad444b[collection1] main{ExitableDirectoryReader(UninvertingDirectoryReader())}
   [junit4]   2> 2595 INFO  (SUITE-TestFieldLengthFeature-seed#[DC3017ADBDFFF73B]-worker) [    ] o.a.s.SolrTestCaseJ4 ####initCore
   [junit4]   2> 2596 INFO  (SUITE-TestFieldLengthFeature-seed#[DC3017ADBDFFF73B]-worker) [    ] o.a.s.SolrTestCaseJ4 ####initCore end
   [junit4]   2> 2597 INFO  (SUITE-TestFieldLengthFeature-seed#[DC3017ADBDFFF73B]-worker) [    ] o.a.s.SolrTestCaseJ4 Writing core.properties file to /home/jenkins/workspace/Lucene-Solr-master-Linux/solr/build/contrib/solr-ltr/test/J0/temp/solr.ltr.feature.TestFieldLengthFeature_DC3017ADBDFFF73B-001/tempDir-003/cores/core
   [junit4]   2> 2817 INFO  (SUITE-TestFieldLengthFeature-seed#[DC3017ADBDFFF73B]-worker) [    ] o.e.j.s.Server jetty-9.3.14.v20161028
   [junit4]   2> 2880 INFO  (SUITE-TestFieldLengthFeature-seed#[DC3017ADBDFFF73B]-worker) [    ] o.e.j.s.h.ContextHandler Started o.e.j.s.ServletContextHandler@78f1a3d2{/solr,null,AVAILABLE}
   [junit4]   2> 2890 INFO  (SUITE-TestFieldLengthFeature-seed#[DC3017ADBDFFF73B]-worker) [    ] o.e.j.s.AbstractConnector Started ServerConnector@234f551b{HTTP/1.1,[http/1.1]}{127.0.0.1:41427}
   [junit4]   2> 2892 INFO  (SUITE-TestFieldLengthFeature-seed#[DC3017ADBDFFF73B]-worker) [    ] o.e.j.s.Server Started @4492ms
   [junit4]   2> 2892 INFO  (SUITE-TestFieldLengthFeature-seed#[DC3017ADBDFFF73B]-worker) [    ] o.a.s.c.s.e.JettySolrRunner Jetty properties: {hostContext=/solr, configSetBaseDir=/home/jenkins/workspace/Lucene-Solr-master-Linux/solr/build/contrib/solr-ltr/test/J0/temp/solr.ltr.feature.TestFieldLengthFeature_DC3017ADBDFFF73B-001/tempDir-001, hostPort=41427, coreRootDirectory=/home/jenkins/workspace/Lucene-Solr-master-Linux/solr/build/contrib/solr-ltr/test/J0/temp/solr.ltr.feature.TestFieldLengthFeature_DC3017ADBDFFF73B-001/tempDir-003/cores}
   [junit4]   2> 2900 ERROR (SUITE-TestFieldLengthFeature-seed#[DC3017ADBDFFF73B]-worker) [    ] o.a.s.s.StartupLoggingUtils Missing Java Option solr.log.dir. Logging may be missing or incomplete.
   [junit4]   2> 2901 INFO  (SUITE-TestFieldLengthFeature-seed#[DC3017ADBDFFF73B]-worker) [    ] o.a.s.s.SolrDispatchFilter  ___      _       Welcome to Apache Solr™ version 7.0.0
   [junit4]   2> 2901 INFO  (SUITE-TestFieldLengthFeature-seed#[DC3017ADBDFFF73B]-worker) [    ] o.a.s.s.SolrDispatchFilter / __| ___| |_ _   Starting in standalone mode on port null
   [junit4]   2> 2901 INFO  (SUITE-TestFieldLengthFeature-seed#[DC3017ADBDFFF73B]-worker) [    ] o.a.s.s.SolrDispatchFilter \__ \/ _ \ | '_|  Install dir: null
   [junit4]   2> 2911 INFO  (SUITE-TestFieldLengthFeature-seed#[DC3017ADBDFFF73B]-worker) [    ] o.a.s.s.SolrDispatchFilter |___/\___/_|_|    Start time: 2017-05-23T14:35:12.273621Z
   [junit4]   2> 2913 INFO  (SUITE-TestFieldLengthFeature-seed#[DC3017ADBDFFF73B]-worker) [    ] o.a.s.c.SolrXmlConfig Loading container configuration from /home/jenkins/workspace/Lucene-Solr-master-Linux/solr/build/contrib/solr-ltr/test/J0/temp/solr.ltr.feature.TestFieldLengthFeature_DC3017ADBDFFF73B-001/tempDir-001/solr.xml
   [junit4]   2> 2962 INFO  (SUITE-TestFieldLengthFeature-seed#[DC3017ADBDFFF73B]-worker) [    ] o.a.s.c.CorePropertiesLocator Found 1 core definitions underneath /home/jenkins/workspace/Lucene-Solr-master-Linux/solr/build/contrib/solr-ltr/test/J0/temp/solr.ltr.feature.TestFieldLengthFeature_DC3017ADBDFFF73B-001/tempDir-003/cores
   [junit4]   2> 2963 INFO  (SUITE-TestFieldLengthFeature-seed#[DC3017ADBDFFF73B]-worker) [    ] o.a.s.c.CorePropertiesLocator Cores are: [collection1]
   [junit4]   2> 2986 INFO  (coreLoadExecutor-30-thread-1) [    ] o.a.s.c.SolrConfig Using Lucene MatchVersion: 6.0.0
   [junit4]   2> 3002 INFO  (coreLoadExecutor-30-thread-1) [    ] o.a.s.s.IndexSchema [collection1] Schema name=example
   [junit4]   2> 3039 INFO  (coreLoadExecutor-30-thread-1) [    ] o.a.s.s.IndexSchema Loaded schema example/1.5 with uniqueid field id
   [junit4]   2> 3043 INFO  (coreLoadExecutor-30-thread-1) [    ] o.a.s.c.CoreContainer Creating SolrCore 'collection1' using configuration from configset /home/jenkins/workspace/Lucene-Solr-master-Linux/solr/build/contrib/solr-ltr/test/J0/temp/solr.ltr.feature.TestFieldLengthFeature_DC3017ADBDFFF73B-001/tempDir-001/collection1, trusted=true
   [junit4]   2> 3043 INFO  (coreLoadExecutor-30-thread-1) [    ] o.a.s.c.SolrCore solr.RecoveryStrategy.Builder
   [junit4]   2> 3043 INFO  (coreLoadExecutor-30-thread-1) [    ] o.a.s.c.SolrCore [[collection1] ] Opening new SolrCore at [/home/jenkins/workspace/Lucene-Solr-master-Linux/solr/build/contrib/solr-ltr/test/J0/temp/solr.ltr.feature.TestFieldLengthFeature_DC3017ADBDFFF73B-001/tempDir-001/collection1], dataDir=[/home/jenkins/workspace/Lucene-Solr-master-Linux/solr/build/contrib/solr-ltr/test/J0/temp/solr.ltr.feature.TestFieldLengthFeature_DC3017ADBDFFF73B-001/tempDir-003/cores/core/data/]
   [junit4]   2> 3093 WARN  (coreLoadExecutor-30-thread-1) [    ] o.a.s.c.RequestHandlers no default request handler is registered (either '/select' or 'standard')
   [junit4]   2> 3105 INFO  (coreLoadExecutor-30-thread-1) [    ] o.a.s.u.UpdateHandler Using UpdateLog implementation: org.apache.solr.update.UpdateLog
   [junit4]   2> 3105 INFO  (coreLoadExecutor-30-thread-1) [    ] o.a.s.u.UpdateLog Initializing UpdateLog: dataDir= defaultSyncLevel=FLUSH numRecordsToKeep=100 maxNumLogsToKeep=10 numVersionBuckets=65536
   [junit4]   2> 3106 INFO  (coreLoadExecutor-30-thread-1) [    ] o.a.s.u.CommitTracker Hard AutoCommit: if uncommited for 15000ms; 
   [junit4]   2> 3106 INFO  (coreLoadExecutor-30-thread-1) [    ] o.a.s.u.CommitTracker Soft AutoCommit: if uncommited for 1000ms; 
   [junit4]   2> 3118 INFO  (coreLoadExecutor-30-thread-1) [    ] o.a.s.s.SolrIndexSearcher Opening [Searcher@e41c367[collection1] main]
   [junit4]   2> 3119 INFO  (coreLoadExecutor-30-thread-1) [    ] o.a.s.r.ManagedResourceStorage File-based storage initialized to use dir: /home/jenkins/workspace/Lucene-Solr-master-Linux/solr/build/contrib/solr-ltr/test/J0/temp/solr.ltr.feature.TestFieldLengthFeature_DC3017ADBDFFF73B-001/tempDir-001/collection1/conf
   [junit4]   2> 3119 INFO  (coreLoadExecutor-30-thread-1) [    ] o.a.s.r.RestManager Registered ManagedResource impl org.apache.solr.ltr.store.rest.ManagedFeatureStore for path /schema/feature-store
   [junit4]   2> 3119 WARN  (coreLoadExecutor-30-thread-1) [    ] o.a.s.r.ManagedResource No stored data found for /schema/feature-store
   [junit4]   2> 3120 INFO  (coreLoadExecutor-30-thread-1) [    ] o.a.s.l.s.r.ManagedFeatureStore ------ managed feature ~ loading ------
   [junit4]   2> 3120 INFO  (coreLoadExecutor-30-thread-1) [    ] o.a.s.r.ManagedResource Notified 1 observers of /schema/feature-store
   [junit4]   2> 3120 INFO  (coreLoadExecutor-30-thread-1) [    ] o.a.s.r.RestManager Registered new managed resource /schema/feature-store
   [junit4]   2> 3120 INFO  (coreLoadExecutor-30-thread-1) [    ] o.a.s.r.RestManager Registered ManagedResource impl org.apache.solr.ltr.store.rest.ManagedModelStore for path /schema/model-store
   [junit4]   2> 3121 WARN  (coreLoadExecutor-30-thread-1) [    ] o.a.s.r.ManagedResource No stored data found for /schema/model-store
   [junit4]   2> 3121 INFO  (coreLoadExecutor-30-thread-1) [    ] o.a.s.l.s.r.ManagedModelStore INIT model store
   [junit4]   2> 3122 INFO  (coreLoadExecutor-30-thread-1) [    ] o.a.s.l.s.r.ManagedModelStore ------ managed models ~ loading ------
   [junit4]   2> 3122 INFO  (coreLoadExecutor-30-thread-1) [    ] o.a.s.r.ManagedResource Notified 1 observers of /schema/model-store
   [junit4]   2> 3122 INFO  (coreLoadExecutor-30-thread-1) [    ] o.a.s.r.RestManager Registered new managed resource /schema/model-store
   [junit4]   2> 3122 INFO  (coreLoadExecutor-30-thread-1) [    ] o.a.s.h.ReplicationHandler Commits will be reserved for  10000
   [junit4]   2> 3123 INFO  (searcherExecutor-31-thread-1) [    ] o.a.s.c.SolrCore [collection1] Registered new searcher Searcher@e41c367[collection1] main{ExitableDirectoryReader(UninvertingDirectoryReader())}
   [junit4]   2> 3124 INFO  (coreLoadExecutor-30-thread-1) [    ] o.a.s.u.UpdateLog Could not find max version in index or recent updates, using new clock 1568197954759557120
   [junit4]   2> 3525 INFO  (SUITE-TestFieldLengthFeature-seed#[DC3017ADBDFFF73B]-worker) [    ] o.a.s.SolrJettyTestBase Jetty Assigned Port#41427
   [junit4]   2> 3803 INFO  (qtp1711373646-38) [    ] o.a.s.u.p.LogUpdateProcessorFactory [collection1]  webapp=/solr path=/update params={stream.body=<add><doc><field+name%3D"id">1</field><field+name%3D"title">w1</field><field+name%3D"description">w1</field></doc></add>}{add=[1 (1568197955398139904)]} 0 129
   [junit4]   2> 3826 INFO  (qtp1711373646-39) [    ] o.a.s.u.p.LogUpdateProcessorFactory [collection1]  webapp=/solr path=/update params={stream.body=<add><doc><field+name%3D"id">2</field><field+name%3D"title">w2+2asd+asdd+didid</field><field+name%3D"description">w2+2asd+asdd+didid</field></doc></add>}{add=[2 (1568197955493560320)]} 0 3
   [junit4]   2> 3831 INFO  (qtp1711373646-40) [    ] o.a.s.u.p.LogUpdateProcessorFactory [collection1]  webapp=/solr path=/update params={stream.body=<add><doc><field+name%3D"id">3</field><field+name%3D"title">w3</field><field+name%3D"description">w3</field></doc></add>}{add=[3 (1568197955500900352)]} 0 1
   [junit4]   2> 3839 INFO  (qtp1711373646-33) [    ] o.a.s.u.p.LogUpdateProcessorFactory [collection1]  webapp=/solr path=/update params={stream.body=<add><doc><field+name%3D"id">4</field><field+name%3D"title">w4</field><field+name%3D"description">w4</field></doc></add>}{add=[4 (1568197955508240384)]} 0 1
   [junit4]   2> 3844 INFO  (qtp1711373646-38) [    ] o.a.s.u.p.LogUpdateProcessorFactory [collection1]  webapp=/solr path=/update params={stream.body=<add><doc><field+name%3D"id">5</field><field+name%3D"title">w5</field><field+name%3D"description">w5</field></doc></add>}{add=[5 (1568197955513483264)]} 0 1
   [junit4]   2> 3850 INFO  (qtp1711373646-39) [    ] o.a.s.u.p.LogUpdateProcessorFactory [collection1]  webapp=/solr path=/update params={stream.body=<add><doc><field+name%3D"id">6</field><field+name%3D"title">w1+w2</field><field+name%3D"description">w1+w2</field></doc></add>}{add=[6 (1568197955520823296)]} 0 1
   [junit4]   2> 3854 INFO  (qtp1711373646-40) [    ] o.a.s.u.p.LogUpdateProcessorFactory [collection1]  webapp=/solr path=/update params={stream.body=<add><doc><field+name%3D"id">7</field><field+name%3D"title">w1+w2+w3+w4+w5</field><field+name%3D"description">w1+w2+w3+w4+w5+w8</field></doc></add>}{add=[7 (1568197955523969024)]} 0 1
   [junit4]   2> 3859 INFO  (qtp1711373646-33) [    ] o.a.s.u.p.LogUpdateProcessorFactory [collection1]  webapp=/solr path=/update params={stream.body=<add><doc><field+name%3D"id">8</field><field+name%3D"title">w1+w1+w1+w2+w2+w8</field><field+name%3D"description">w1+w1+w1+w2+w2</field></doc></add>}{add=[8 (1568197955529211904)]} 0 1
   [junit4]   2> 3864 INFO  (qtp1711373646-38) [    ] o.a.s.u.DirectUpdateHandler2 start commit{_version_=1568197955534454784,optimize=false,openSearcher=true,waitSearcher=true,expungeDeletes=false,softCommit=false,prepareCommit=false}
   [junit4]   2> 3864 INFO  (qtp1711373646-38) [    ] o.a.s.u.SolrIndexWriter Calling setCommitData with IW:org.apache.solr.update.SolrIndexWriter@74a20964 commitCommandVersion:1568197955534454784
   [junit4]   2> 3928 INFO  (qtp1711373646-38) [    ] o.a.s.s.SolrIndexSearcher Opening [Searcher@245b8e54[collection1] main]
   [junit4]   2> 3931 INFO  (searcherExecutor-31-thread-1) [    ] o.a.s.c.SolrCore [collection1] Registered new searcher Searcher@245b8e54[collection1] main{ExitableDirectoryReader(UninvertingDirectoryReader(Uninverting(_0(7.0.0):C8)))}
   [junit4]   2> 3931 INFO  (qtp1711373646-38) [    ] o.a.s.u.DirectUpdateHandler2 end_commit_flush
   [junit4]   2> 3931 INFO  (qtp1711373646-38) [    ] o.a.s.u.p.LogUpdateProcessorFactory [collection1]  webapp=/solr path=/update params={stream.body=<commit/>}{commit=} 0 68
   [junit4]   2> 3947 INFO  (TEST-TestFieldLengthFeature.testRanking-seed#[DC3017ADBDFFF73B]) [    ] o.a.s.SolrTestCaseJ4 ###Starting testRanking
   [junit4]   2> 3948 INFO  (TEST-TestFieldLengthFeature.testRanking-seed#[DC3017ADBDFFF73B]) [    ] o.a.s.l.TestRerankBase loading feauture 
   [junit4]   2> {
   [junit4]   2> "name":"title-length",
   [junit4]   2> "store":"test",
   [junit4]   2> "class":"org.apache.solr.ltr.feature.FieldLengthFeature",
   [junit4]   2> "params":{"field":"title"}
   [junit4]   2> }
   [junit4]   2>  
   [junit4]   2> 3985 INFO  (qtp1711373646-38) [    ] /solr SolrSchemaRestApi: [Restlet] ServerServlet: component class is null
   [junit4]   2> 4062 INFO  (qtp1711373646-38) [    ] /solr SolrSchemaRestApi: [Restlet] Attaching application: org.apache.solr.rest.SolrSchemaRestApi@3cb8f141 to URI: /solr/schema
   [junit4]   2> Lép 23, 2017 10:35:13 ƐNKAKƐNYÁ org.restlet.Application start
   [junit4]   2> INFO: Starting org.apache.solr.rest.SolrSchemaRestApi application
   [junit4]   2> 4136 INFO  (qtp1711373646-38) [    ] o.a.s.r.SolrSchemaRestApi createInboundRoot started for /schema
   [junit4]   2> 4145 INFO  (qtp1711373646-38) [    ] o.a.s.r.RestManager Attached managed resource at path: /feature-store
   [junit4]   2> 4145 INFO  (qtp1711373646-38) [    ] o.a.s.r.RestManager Attached managed resource at path: /managed
   [junit4]   2> 4145 INFO  (qtp1711373646-38) [    ] o.a.s.r.RestManager Attached managed resource at path: /model-store
   [junit4]   2> 4145 INFO  (qtp1711373646-38) [    ] o.a.s.r.RestManager Attached 3 ManagedResource endpoints to Restlet router: /schema
   [junit4]   2> 4145 INFO  (qtp1711373646-38) [    ] o.a.s.r.SolrSchemaRestApi createInboundRoot complete for /schema
   [junit4]   2> 4170 INFO  (qtp1711373646-38) [    ] o.a.s.r.RestManager Found ManagedResource [org.apache.solr.ltr.store.rest.ManagedFeatureStore@5c1c8d0a] for /schema/feature-store
   [junit4]   2> 4172 INFO  (qtp1711373646-38) [    ] o.a.s.r.ManagedResource Processing update to /schema/feature-store: {name=title-length, store=test, class=org.apache.solr.ltr.feature.FieldLengthFeature, params={field=title}} is a java.util.LinkedHashMap
   [junit4]   2> 4172 INFO  (qtp1711373646-38) [    ] o.a.s.l.s.r.ManagedFeatureStore register feature based on {name=title-length, store=test, class=org.apache.solr.ltr.feature.FieldLengthFeature, params={field=title}}
   [junit4]   2> 4177 INFO  (qtp1711373646-38) [    ] o.a.s.r.ManagedResourceStorage Saved JSON object to path _schema_feature-store.json using file:dir=/home/jenkins/workspace/Lucene-Solr-master-Linux/solr/build/contrib/solr-ltr/test/J0/temp/solr.ltr.feature.TestFieldLengthFeature_DC3017ADBDFFF73B-001/tempDir-001/collection1/conf
   [junit4]   2> 4177 INFO  (qtp1711373646-38) [    ] o.a.s.r.RestManager [collection1]  webapp=/solr path=/schema/feature-store params={indent=on&wt=json} status=0 QTime=215
   [junit4]   2> Lép 23, 2017 10:35:13 ƐNKAKƐNYÁ org.restlet.engine.log.LogFilter afterHandle
   [junit4]   2> INFO: 2017-05-23	10:35:13	127.0.0.1	-	127.0.0.1	41427	PUT	/solr/schema/feature-store	wt=json&indent=on	200	-	128	106	http://127.0.0.1:41427	Apache-HttpClient/4.4.1 (Java/9-ea)	-
   [junit4]   2> 4201 WARN  (qtp1711373646-38) [    ] o.e.j.s.ServletHandler Error for /solr/collection1/schema/feature-store
   [junit4]   2> java.lang.AssertionError: Attempted close of response output stream.
   [junit4]   2> 	at org.apache.solr.servlet.SolrDispatchFilter$2$1.close(SolrDispatchFilter.java:517)
   [junit4]   2> 	at org.eclipse.jetty.server.Dispatcher.commitResponse(Dispatcher.java:270)
   [junit4]   2> 	at org.eclipse.jetty.server.Dispatcher.forward(Dispatcher.java:202)
   [junit4]   2> 	at org.eclipse.jetty.server.Dispatcher.forward(Dispatcher.java:74)
   [junit4]   2> 	at org.apache.solr.servlet.SolrDispatchFilter.doFilter(SolrDispatchFilter.java:383)
   [junit4]   2> 	at org.apache.solr.servlet.SolrDispatchFilter.doFilter(SolrDispatchFilter.java:318)
   [junit4]   2> 	at org.eclipse.jetty.servlet.ServletHandler$CachedChain.doFilter(ServletHandler.java:1699)
   [junit4]   2> 	at org.apache.solr.client.solrj.embedded.JettySolrRunner$DebugFilter.doFilter(JettySolrRunner.java:139)
   [junit4]   2> 	at org.eclipse.jetty.servlet.ServletHandler$CachedChain.doFilter(ServletHandler.java:1699)
   [junit4]   2> 	at org.eclipse.jetty.servlet.ServletHandler.doHandle(ServletHandler.java:582)
   [junit4]   2> 	at org.eclipse.jetty.server.session.SessionHandler.doHandle(SessionHandler.java:224)
   [junit4]   2> 	at org.eclipse.jetty.server.handler.ContextHandler.doHandle(ContextHandler.java:1180)
   [junit4]   2> 	at org.eclipse.jetty.servlet.ServletHandler.doScope(ServletHandler.java:512)
   [junit4]   2> 	at org.eclipse.jetty.server.session.SessionHandler.doScope(SessionHandler.java:185)
   [junit4]   2> 	at org.eclipse.jetty.server.handler.ContextHandler.doScope(ContextHandler.java:1112)
   [junit4]   2> 	at org.eclipse.jetty.server.handler.ScopedHandler.handle(ScopedHandler.java:141)
   [junit4]   2> 	at org.eclipse.jetty.server.handler.gzip.GzipHandler.handle(GzipHandler.java:395)
   [junit4]   2> 	at org.eclipse.jetty.server.handler.HandlerWrapper.handle(HandlerWrapper.java:134)
   [junit4]   2> 	at org.eclipse.jetty.server.Server.handle(Server.java:534)
   [junit4]   2> 	at org.eclipse.jetty.server.HttpChannel.handle(HttpChannel.java:320)
   [junit4]   2> 	at org.eclipse.jetty.server.HttpConnection.onFillable(HttpConnection.java:251)
   [junit4]   2> 	at org.eclipse.jetty.io.AbstractConnection$ReadCallback.succeeded(AbstractConnection.java:273)
   [junit4]   2> 	at org.eclipse.jetty.io.FillInterest.fillable(FillInterest.java:95)
   [junit4]   2> 	at org.eclipse.jetty.io.SelectChannelEndPoint$2.run(SelectChannelEndPoint.java:93)
   [junit4]   2> 	at org.eclipse.jetty.util.thread.strategy.ExecuteProduceConsume.executeProduceConsume(ExecuteProduceConsume.java:303)
   [junit4]   2> 	at org.eclipse.jetty.util.thread.strategy.ExecuteProduceConsume.produceConsume(ExecuteProduceConsume.java:148)
   [junit4]   2> 	at org.eclipse.jetty.util.thread.strategy.ExecuteProduceConsume.run(ExecuteProduceConsume.java:136)
   [junit4]   2> 	at org.eclipse.jetty.util.thread.QueuedThreadPool.runJob(QueuedThreadPool.java:671)
   [junit4]   2> 	at org.eclipse.jetty.util.thread.QueuedThreadPool$2.run(QueuedThreadPool.java:589)
   [junit4]   2> 	at java.base/java.lang.Thread.run(Thread.java:844)
   [junit4]   2> 4214 INFO  (TEST-TestFieldLengthFeature.testRanking-seed#[DC3017ADBDFFF73B]) [    ] o.a.s.l.TestRerankBase loading model 
   [junit4]   2> {
   [junit4]   2> "name":"title-model",
   [junit4]   2> "store":"test",
   [junit4]   2> "class":"org.apache.solr.ltr.model.LinearModel",
   [junit4]   2> "features":[
   [junit4]   2> 	{ "name":"title-length"}
   [junit4]   2> ]
   [junit4]   2> ,
   [junit4]   2> "params":{"weights":{"title-length":1.0}}
   [junit4]   2> }
   [junit4]   2>  
   [junit4]   2> 4216 INFO  (qtp1711373646-38) [    ] o.a.s.r.RestManager Found ManagedResource [ManagedModelStore [store=ModelStore [availableModels=[]], featureStores=org.apache.solr.ltr.store.rest.ManagedFeatureStore@5c1c8d0a]] for /schema/model-store
   [junit4]   2> 4227 INFO  (qtp1711373646-38) [    ] o.a.s.r.ManagedResource Processing update to /schema/model-store: {name=title-model, store=test, class=org.apache.solr.ltr.model.LinearModel, features=[{name=title-length}], params={weights={title-length=1.0}}} is a java.util.LinkedHashMap
   [junit4]   2> 4235 INFO  (qtp1711373646-38) [    ] o.a.s.l.s.r.ManagedModelStore adding model title-model
   [junit4]   2> 4236 INFO  (qtp1711373646-38) [    ] o.a.s.r.ManagedResourceStorage Saved JSON object to path _schema_model-store.json using file:dir=/home/jenkins/workspace/Lucene-Solr-master-Linux/solr/build/contrib/solr-ltr/test/J0/temp/solr.ltr.feature.TestFieldLengthFeature_DC3017ADBDFFF73B-001/tempDir-001/collection1/conf
   [junit4]   2> 4236 INFO  (qtp1711373646-38) [    ] o.a.s.r.RestManager [collection1]  webapp=/solr path=/schema/model-store params={indent=on&wt=json} status=0 QTime=20
   [junit4]   2> Lép 23, 2017 10:35:13 ƐNKAKƐNYÁ org.restlet.engine.log.LogFilter afterHandle
   [junit4]   2> INFO: 2017-05-23	10:35:13	127.0.0.1	-	127.0.0.1	41427	PUT	/solr/schema/model-store	wt=json&indent=on	200	-	176	20	http://127.0.0.1:41427	Apache-HttpClient/4.4.1 (Java/9-ea)	-
   [junit4]   2> 4241 WARN  (qtp1711373646-38) [    ] o.e.j.s.ServletHandler Error for /solr/collection1/schema/model-store
   [junit4]   2> java.lang.AssertionError: Attempted close of response output stream.
   [junit4]   2> 	at org.apache.solr.servlet.SolrDispatchFilter$2$1.close(SolrDispatchFilter.java:517)
   [junit4]   2> 	at org.eclipse.jetty.server.Dispatcher.commitResponse(Dispatcher.java:270)
   [junit4]   2> 	at org.eclipse.jetty.server.Dispatcher.forward(Dispatcher.java:202)
   [junit4]   2> 	at org.eclipse.jetty.server.Dispatcher.forward(Dispatcher.java:74)
   [junit4]   2> 	at org.apache.solr.servlet.SolrDispatchFilter.doFilter(SolrDispatchFilter.java:383)
   [junit4]   2> 	at org.apache.solr.servlet.SolrDispatchFilter.doFilter(SolrDispatchFilter.java:318)
   [junit4]   2> 	at org.eclipse.jetty.servlet.ServletHandler$CachedChain.doFilter(ServletHandler.java:1699)
   [junit4]   2> 	at org.apache.solr.client.solrj.embedded.JettySolrRunner$DebugFilter.doFilter(JettySolrRunner.java:139)
   [junit4]   2> 	at org.eclipse.jetty.servlet.ServletHandler$CachedChain.doFilter(ServletHandler.java:1699)
   [junit4]   2> 	at org.eclipse.jetty.servlet.ServletHandler.doHandle(ServletHandler.java:582)
   [junit4]   2> 	at org.eclipse.jetty.server.session.SessionHandler.doHandle(SessionHandler.java:224)
   [junit4]   2> 	at org.eclipse.jetty.server.handler.ContextHandler.doHandle(ContextHandler.java:1180)
   [junit4]   2> 	at org.eclipse.jetty.servlet.ServletHandler.doScope(ServletHandler.java:512)
   [junit4]   2> 	at org.eclipse.jetty.server.session.SessionHandler.doScope(SessionHandler.java:185)
   [junit4]   2> 	at org.eclipse.jetty.server.handler.ContextHandler.doScope(ContextHandler.java:1112)
   [junit4]   2> 	at org.eclipse.jetty.server.handler.ScopedHandler.handle(ScopedHandler.java:141)
   [junit4]   2> 	at org.eclipse.jetty.server.handler.gzip.GzipHandler.handle(GzipHandler.java:395)
   [junit4]   2> 	at org.eclipse.jetty.server.handler.HandlerWrapper.handle(HandlerWrapper.java:134)
   [junit4]   2> 	at org.eclipse.jetty.server.Server.handle(Server.java:534)
   [junit4]   2> 	at org.eclipse.jetty.server.HttpChannel.handle(HttpChannel.java:320)
   [junit4]   2> 	at org.eclipse.jetty.server.HttpConnection.onFillable(HttpConnection.java:251)
   [junit4]   2> 	at org.eclipse.jetty.io.AbstractConnection$ReadCallback.succeeded(AbstractConnection.java:273)
   [junit4]   2> 	at org.eclipse.jetty.io.FillInterest.fillable(FillInterest.java:95)
   [junit4]   2> 	at org.eclipse.jetty.io.SelectChannelEndPoint$2.run(SelectChannelEndPoint.java:93)
   [junit4]   2> 	at org.eclipse.jetty.util.thread.strategy.ExecuteProduceConsume.executeProduceConsume(ExecuteProduceConsume.java:303)
   [junit4]   2> 	at org.eclipse.jetty.util.thread.strategy.ExecuteProduceConsume.produceConsume(ExecuteProduceConsume.java:148)
   [junit4]   2> 	at org.eclipse.jetty.util.thread.strategy.ExecuteProduceConsume.run(ExecuteProduceConsume.java:136)
   [junit4]   2> 	at org.eclipse.jetty.util.thread.QueuedThreadPool.runJob(QueuedThreadPool.java:671)
   [junit4]   2> 	at org.eclipse.jetty.util.thread.QueuedThreadPool$2.run(QueuedThreadPool.java:589)
   [junit4]   2> 	at java.base/java.lang.Thread.run(Thread.java:844)
   [junit4]   2> 4299 INFO  (qtp1711373646-38) [    ] o.a.s.c.S.Request [collection1]  webapp=/solr path=/query params={q=title:w1&indent=on&fl=*,+score&rows=4&wt=json} hits=4 status=0 QTime=55
   [junit4]   2> 4317 INFO  (qtp1711373646-39) [    ] o.a.s.c.S.Request [collection1]  webapp=/solr path=/query params={q=title:w1&indent=on&fl=*,+score&rows=4&wt=json} hits=4 status=0 QTime=1
   [junit4]   2> 4320 INFO  (qtp1711373646-40) [    ] o.a.s.c.S.Request [collection1]  webapp=/solr path=/query params={q=title:w1&indent=on&fl=*,+score&rows=4&wt=json} hits=4 status=0 QTime=0
   [junit4]   2> 4323 INFO  (qtp1711373646-33) [    ] o.a.s.c.S.Request [collection1]  webapp=/solr path=/query params={q=title:w1&indent=on&fl=*,+score&rows=4&wt=json} hits=4 status=0 QTime=0
   [junit4]   2> 4327 INFO  (qtp1711373646-38) [    ] o.a.s.c.S.Request [collection1]  webapp=/solr path=/query params={q=title:w1&indent=on&fl=*,+score&rows=4&wt=json} hits=4 status=0 QTime=0
   [junit4]   2> 4340 INFO  (qtp1711373646-38) [    ] o.a.s.c.S.Request [collection1]  webapp=/solr path=/query params={q=title:w1&indent=on&fl=*,+score&rows=4&wt=json&rq={!ltr+model%3Dtitle-model+reRankDocs%3D4}} hits=4 status=0 QTime=10
   [junit4]   2> 4347 INFO  (qtp1711373646-39) [    ] o.a.s.c.S.Request [collection1]  webapp=/solr path=/query params={q=title:w1&indent=on&fl=*,+score&rows=4&wt=json&rq={!ltr+model%3Dtitle-model+reRankDocs%3D4}} hits=4 status=0 QTime=5
   [junit4]   2> 4349 ERROR (TEST-TestFieldLengthFeature.testRanking-seed#[DC3017ADBDFFF73B]) [    ] o.a.s.u.RestTestBase query failed JSON validation. error=mismatch: '8'!='1' @ response/docs/[0]/id
   [junit4]   2>  expected =/response/docs/[0]/id=='8'
   [junit4]   2>  response = {
   [junit4]   2>   "responseHeader":{
   [junit4]   2>     "status":0,
   [junit4]   2>     "QTime":5,
   [junit4]   2>     "params":{
   [junit4]   2>       "q":"title:w1",
   [junit4]   2>       "indent":"on",
   [junit4]   2>       "fl":"*, score",
   [junit4]   2>       "rows":"4",
   [junit4]   2>       "wt":"json",
   [junit4]   2>       "rq":"{!ltr model=title-model reRankDocs=4}"}},
   [junit4]   2>   "response":{"numFound":4,"start":0,"maxScore":2.95147899E18,"docs":[
   [junit4]   2>       {
   [junit4]   2>         "id":"1",
   [junit4]   2>         "title":"w1",
   [junit4]   2>         "description":"w1",
   [junit4]   2>         "_version_":1568197955398139904,
   [junit4]   2>         "score":2.95147899E18},
   [junit4]   2>       {
   [junit4]   2>         "id":"6",
   [junit4]   2>         "title":"w1 w2",
   [junit4]   2>         "description":"w1 w2",
   [junit4]   2>         "_version_":1568197955520823296,
   [junit4]   2>         "score":2.04963825E18},
   [junit4]   2>       {
   [junit4]   2>         "id":"7",
   [junit4]   2>         "title":"w1 w2 w3 w4 w5",
   [junit4]   2>         "description":"w1 w2 w3 w4 w5 w8",
   [junit4]   2>         "_version_":1568197955523969024,
   [junit4]   2>         "score":7.3786975E17},
   [junit4]   2>       {
   [junit4]   2>         "id":"8",
   [junit4]   2>         "title":"w1 w1 w1 w2 w2 w8",
   [junit4]   2>         "description":"w1 w1 w1 w2 w2",
   [junit4]   2>         "_version_":1568197955529211904,
   [junit4]   2>         "score":5.12409561E17}]
   [junit4]   2>   }}
   [junit4]   2> 
   [junit4]   2>  request = /query?q=title%3Aw1&fl=*%2C+score&rows=4&rq=%7B%21ltr+model%3Dtitle-model+reRankDocs%3D4%7D&wt=json&indent=on
   [junit4]   2> 
   [junit4]   2> 4349 INFO  (TEST-TestFieldLengthFeature.testRanking-seed#[DC3017ADBDFFF73B]) [    ] o.a.s.SolrTestCaseJ4 ###Ending testRanking
   [junit4]   2> NOTE: reproduce with: ant test  -Dtestcase=TestFieldLengthFeature -Dtests.method=testRanking -Dtests.seed=DC3017ADBDFFF73B -Dtests.multiplier=3 -Dtests.slow=true -Dtests.locale=mas-KE -Dtests.timezone=Brazil/West -Dtests.asserts=true -Dtests.file.encoding=UTF-8
   [junit4] ERROR   0.42s J0 | TestFieldLengthFeature.testRanking <<<
   [junit4]    > Throwable #1: java.lang.RuntimeException: mismatch: '8'!='1' @ response/docs/[0]/id
   [junit4]    > 	at __randomizedtesting.SeedInfo.seed([DC3017ADBDFFF73B:4306BE332585E8F4]:0)
   [junit4]    > 	at org.apache.solr.util.RestTestBase.assertJQ(RestTestBase.java:248)
   [junit4]    > 	at org.apache.solr.util.RestTestBase.assertJQ(RestTestBase.java:192)
   [junit4]    > 	at org.apache.solr.ltr.feature.TestFieldLengthFeature.testRanking(TestFieldLengthFeature.java:117)
   [junit4]    > 	at java.base/jdk.internal.reflect.NativeMethodAccessorImpl.invoke0(Native Method)
   [junit4]    > 	at java.base/jdk.internal.reflect.NativeMethodAccessorImpl.invoke(NativeMethodAccessorImpl.java:62)
   [junit4]    > 	at java.base/jdk.internal.reflect.DelegatingMethodAccessorImpl.invoke(DelegatingMethodAccessorImpl.java:43)
   [junit4]    > 	at java.base/java.lang.reflect.Method.invoke(Method.java:563)
   [junit4]    > 	at java.base/java.lang.Thread.run(Thread.java:844)
   [junit4]   2> 4359 INFO  (TEST-TestFieldLengthFeature.testIfFieldIsMissingInDocumentLengthIsZero-seed#[DC3017ADBDFFF73B]) [    ] o.a.s.SolrTestCaseJ4 ###Starting testIfFieldIsMissingInDocumentLengthIsZero
   [junit4]   2> 4362 INFO  (qtp1711373646-40) [    ] o.a.s.u.p.LogUpdateProcessorFactory [collection1]  webapp=/solr path=/update params={stream.body=<add><doc><field+name%3D"id">42</field><field+name%3D"title">w10</field></doc></add>}{add=[42 (1568197956055597056)]} 0 2
   [junit4]   2> 4365 INFO  (qtp1711373646-33) [    ] o.a.s.u.DirectUpdateHandler2 start commit{_version_=1568197956060839936,optimize=false,openSearcher=true,waitSearcher=true,expungeDeletes=false,softCommit=false,prepareCommit=false}
   [junit4]   2> 4369 INFO  (qtp1711373646-33) [    ] o.a.s.u.SolrIndexWriter Calling setCommitData with IW:org.apache.solr.update.SolrIndexWriter@74a20964 commitCommandVersion:1568197956060839936
   [junit4]   2> 4405 INFO  (qtp1711373646-33) [    ] o.a.s.s.SolrIndexSearcher Opening [Searcher@7ab38430[collection1] main]
   [junit4]   2> 4407 INFO  (searcherExecutor-31-thread-1) [    ] o.a.s.c.SolrCore [collection1] Registered new searcher Searcher@7ab38430[collection1] main{ExitableDirectoryReader(UninvertingDirectoryReader(Uninverting(_0(7.0.0):C8) Uninverting(_1(7.0.0):C1)))}
   [junit4]   2> 4412 INFO  (qtp1711373646-33) [    ] o.a.s.u.DirectUpdateHandler2 end_commit_flush
   [junit4]   2> 4412 INFO  (qtp1711373646-33) [    ] o.a.s.u.p.LogUpdateProcessorFactory [collection1]  webapp=/solr path=/update params={stream.body=<commit/>}{commit=} 0 46
   [junit4]   2> 4413 INFO  (TEST-TestFieldLengthFeature.testIfFieldIsMissingInDocumentLengthIsZero-seed#[DC3017ADBDFFF73B]) [    ] o.a.s.l.TestRerankBase loading feauture 
   [junit4]   2> {
   [junit4]   2> "name":"description-length2",
   [junit4]   2> "store":"test",
   [junit4]   2> "class":"org.apache.solr.ltr.feature.FieldLengthFeature",
   [junit4]   2> "params":{"field":"description"}
   [junit4]   2> }
   [junit4]   2>  
   [junit4]   2> 4416 INFO  (qtp1711373646-33) [    ] o.a.s.r.RestManager Found ManagedResource [org.apache.solr.ltr.store.rest.ManagedFeatureStore@5c1c8d0a] for /schema/feature-store
   [junit4]   2> 4417 INFO  (qtp1711373646-33) [    ] o.a.s.r.ManagedResource Processing update to /schema/feature-store: {name=description-length2, store=test, class=org.apache.solr.ltr.feature.FieldLengthFeature, params={field=description}} is a java.util.LinkedHashMap
   [junit4]   2> 4417 INFO  (qtp1711373646-33) [    ] o.a.s.l.s.r.ManagedFeatureStore register feature based on {name=description-length2, store=test, class=org.apache.solr.ltr.feature.FieldLengthFeature, params={field=description}}
   [junit4]   2> 4418 INFO  (qtp1711373646-33) [    ] o.a.s.r.ManagedResourceStorage Saved JSON object to path _schema_feature-store.json using file:dir=/home/jenkins/workspace/Lucene-Solr-master-Linux/solr/build/contrib/solr-ltr/test/J0/temp/solr.ltr.feature.TestFieldLengthFeature_DC3017ADBDFFF73B-001/tempDir-001/collection1/conf
   [junit4]   2> 4418 INFO  (qtp1711373646-33) [    ] o.a.s.r.RestManager [collection1]  webapp=/solr path=/schema/feature-store params={indent=on&wt=json} status=0 QTime=3
   [junit4]   2> Lép 23, 2017 10:35:13 ƐNKAKƐNYÁ org.restlet.engine.log.LogFilter afterHandle
   [junit4]   2> INFO: 2017-05-23	10:35:13	127.0.0.1	-	127.0.0.1	41427	PUT	/solr/schema/feature-store	wt=json&indent=on	200	-	141	3	http://127.0.0.1:41427	Apache-HttpClient/4.4.1 (Java/9-ea)	-
   [junit4]   2> 4423 WARN  (qtp1711373646-33) [    ] o.e.j.s.ServletHandler Error for /solr/collection1/schema/feature-store
   [junit4]   2> java.lang.AssertionError: Attempted close of response output stream.
   [junit4]   2> 	at org.apache.solr.servlet.SolrDispatchFilter$2$1.close(SolrDispatchFilter.java:517)
   [junit4]   2> 	at org.eclipse.jetty.server.Dispatcher.commitResponse(Dispatcher.java:270)
   [junit4]   2> 	at org.eclipse.jetty.server.Dispatcher.forward(Dispatcher.java:202)
   [junit4]   2> 	at org.eclipse.jetty.server.Dispatcher.forward(Dispatcher.java:74)
   [junit4]   2> 	at org.apache.solr.servlet.SolrDispatchFilter.doFilter(SolrDispatchFilter.java:383)
   [junit4]   2> 	at org.apache.solr.servlet.SolrDispatchFilter.doFilter(SolrDispatchFilter.java:318)
   [junit4]   2> 	at org.eclipse.jetty.servlet.ServletHandler$CachedChain.doFilter(ServletHandler.java:1699)
   [junit4]   2> 	at org.apache.solr.client.solrj.embedded.JettySolrRunner$DebugFilter.doFilter(JettySolrRunner.java:139)
   [junit4]   2> 	at org.eclipse.jetty.servlet.ServletHandler$CachedChain.doFilter(ServletHandler.java:1699)
   [junit4]   2> 	at org.eclipse.jetty.servlet.ServletHandler.doHandle(ServletHandler.java:582)
   [junit4]   2> 	at org.eclipse.jetty.server.session.SessionHandler.doHandle(SessionHandler.java:224)
   [junit4]   2> 	at org.eclipse.jetty.server.handler.ContextHandler.doHandle(ContextHandler.java:1180)
   [junit4]   2> 	at org.eclipse.jetty.servlet.ServletHandler.doScope(ServletHandler.java:512)
   [junit4]   2> 	at org.eclipse.jetty.server.session.SessionHandler.doScope(SessionHandler.java:185)
   [junit4]   2> 	at org.eclipse.jetty.server.handler.ContextHandler.doScope(ContextHandler.java:1112)
   [junit4]   2> 	at org.eclipse.jetty.server.handler.ScopedHandler.handle(ScopedHandler.java:141)
   [junit4]   2> 	at org.eclipse.jetty.server.handler.gzip.GzipHandler.handle(GzipHandler.java:395)
   [junit4]   2> 	at org.eclipse.jetty.server.handler.HandlerWrapper.handle(HandlerWrapper.java:134)
   [junit4]   2> 	at org.eclipse.jetty.server.Server.handle(Server.java:534)
   [junit4]   2> 	at org.eclipse.jetty.server.HttpChannel.handle(HttpChannel.java:320)
   [junit4]   2> 	at org.eclipse.jetty.server.HttpConnection.onFillable(HttpConnection.java:251)
   [junit4]   2> 	at org.eclipse.jetty.io.AbstractConnection$ReadCallback.succeeded(AbstractConnection.java:273)
   [junit4]   2> 	at org.eclipse.jetty.io.FillInterest.fillable(FillInterest.java:95)
   [junit4]   2> 	at org.eclipse.jetty.io.SelectChannelEndPoint$2.run(SelectChannelEndPoint.java:93)
   [junit4]   2> 	at org.eclipse.jetty.util.thread.strategy.ExecuteProduceConsume.executeProduceConsume(ExecuteProduceConsume.java:303)
   [junit4]   2> 	at org.eclipse.jetty.util.thread.strategy.ExecuteProduceConsume.produceConsume(ExecuteProduceConsume.java:148)
   [junit4]   2> 	at org.eclipse.jetty.util.thread.strategy.ExecuteProduceConsume.run(ExecuteProduceConsume.java:136)
   [junit4]   2> 	at org.eclipse.jetty.util.thread.QueuedThreadPool.runJob(QueuedThreadPool.java:671)
   [junit4]   2> 	at org.eclipse.jetty.util.thread.QueuedThreadPool$2.run(QueuedThreadPool.java:589)
   [junit4]   2> 	at java.base/java.lang.Thread.run(Thread.java:844)
   [junit4]   2> 4424 INFO  (TEST-TestFieldLengthFeature.testIfFieldIsMissingInDocumentLengthIsZero-seed#[DC3017ADBDFFF73B]) [    ] o.a.s.l.TestRerankBase loading model 
   [junit4]   2> {
   [junit4]   2> "name":"description-model2",
   [junit4]   2> "store":"test",
   [junit4]   2> "class":"org.apache.solr.ltr.model.LinearModel",
   [junit4]   2> "features":[
   [junit4]   2> 	{ "name":"description-length2"}
   [junit4]   2> ]
   [junit4]   2> ,
   [junit4]   2> "params":{"weights":{"description-length2":1.0}}
   [junit4]   2> }
   [junit4]   2>  
   [junit4]   2> 4426 INFO  (qtp1711373646-33) [    ] o.a.s.r.RestManager Found ManagedResource [ManagedModelStore [store=ModelStore [availableModels=[title-model]], featureStores=org.apache.solr.ltr.store.rest.ManagedFeatureStore@5c1c8d0a]] for /schema/model-store
   [junit4]   2> 4426 INFO  (qtp1711373646-33) [    ] o.a.s.r.ManagedResource Processing update to /schema/model-store: {name=description-model2, store=test, class=org.apache.solr.ltr.model.LinearModel, features=[{name=description-length2}], params={weights={description-length2=1.0}}} is a java.util.LinkedHashMap
   [junit4]   2> 4428 INFO  (qtp1711373646-33) [    ] o.a.s.l.s.r.ManagedModelStore adding model description-model2
   [junit4]   2> 4428 INFO  (qtp1711373646-33) [    ] o.a.s.r.ManagedResourceStorage Saved JSON object to path _schema_model-store.json using file:dir=/home/jenkins/workspace/Lucene-Solr-master-Linux/solr/build/contrib/solr-ltr/test/J0/temp/solr.ltr.feature.TestFieldLengthFeature_DC3017ADBDFFF73B-001/tempDir-001/collection1/conf
   [junit4]   2> 4428 INFO  (qtp1711373646-33) [    ] o.a.s.r.RestManager [collection1]  webapp=/solr path=/schema/model-store params={indent=on&wt=json} status=0 QTime=3
   [junit4]   2> Lép 23, 2017 10:35:13 ƐNKAKƐNYÁ org.restlet.engine.log.LogFilter afterHandle
   [junit4]   2> INFO: 2017-05-23	10:35:13	127.0.0.1	-	127.0.0.1	41427	PUT	/solr/schema/model-store	wt=json&indent=on	200	-	197	4	http://127.0.0.1:41427	Apache-HttpClient/4.4.1 (Java/9-ea)	-
   [junit4]   2> 4430 WARN  (qtp1711373646-33) [    ] o.e.j.s.ServletHandler Error for /solr/collection1/schema/model-store
   [junit4]   2> java.lang.AssertionError: Attempted close of response output stream.
   [junit4]   2> 	at org.apache.solr.servlet.SolrDispatchFilter$2$1.close(SolrDispatchFilter.java:517)
   [junit4]   2> 	at org.eclipse.jetty.server.Dispatcher.commitResponse(Dispatcher.java:270)
   [junit4]   2> 	at org.eclipse.jetty.server.Dispatcher.forward(Dispatcher.java:202)
   [junit4]   2> 	at org.eclipse.jetty.server.Dispatcher.forward(Dispatcher.java:74)
   [junit4]   2> 	at org.apache.solr.servlet.SolrDispatchFilter.doFilter(SolrDispatchFilter.java:383)
   [junit4]   2> 	at org.apache.solr.servlet.SolrDispatchFilter.doFilter(SolrDispatchFilter.java:318)
   [junit4]   2> 	at org.eclipse.jetty.servlet.ServletHandler$CachedChain.doFilter(ServletHandler.java:1699)
   [junit4]   2> 	at org.apache.solr.client.solrj.embedded.JettySolrRunner$DebugFilter.doFilter(JettySolrRunner.java:139)
   [junit4]   2> 	at org.eclipse.jetty.servlet.ServletHandler$CachedChain.doFilter(ServletHandler.java:1699)
   [junit4]   2> 	at org.eclipse.jetty.servlet.ServletHandler.doHandle(ServletHandler.java:582)
   [junit4]   2> 	at org.eclipse.jetty.server.session.SessionHandler.doHandle(SessionHandler.java:224)
   [junit4]   2> 	at org.eclipse.jetty.server.handler.ContextHandler.doHandle(ContextHandler.java:1180)
   [junit4]   2> 	at org.eclipse.jetty.servlet.ServletHandler.doScope(ServletHandler.java:512)
   [junit4]   2> 	at org.eclipse.jetty.server.session.SessionHandler.doScope(SessionHandler.java:185)
   [junit4]   2> 	at org.eclipse.jetty.server.handler.ContextHandler.doScope(ContextHandler.java:1112)
   [junit4]   2> 	at org.eclipse.jetty.server.handler.ScopedHandler.handle(ScopedHandler.java:141)
   [junit4]   2> 	at org.eclipse.jetty.server.handler.gzip.GzipHandler.handle(GzipHandler.java:395)
   [junit4]   2> 	at org.eclipse.jetty.server.handler.HandlerWrapper.handle(HandlerWrapper.java:134)
   [junit4]   2> 	at org.eclipse.jetty.server.Server.handle(Server.java:534)
   [junit4]   2> 	at org.eclipse.jetty.server.HttpChannel.handle(HttpChannel.java:320)
   [junit4]   2> 	at org.eclipse.jetty.server.HttpConnection.onFillable(HttpConnection.java:251)
   [junit4]   2> 	at org.eclipse.jetty.io.AbstractConnection$ReadCallback.succeeded(AbstractConnection.java:273)
   [junit4]   2> 	at org.eclipse.jetty.io.FillInterest.fillable(FillInterest.java:95)
   [junit4]   2> 	at org.eclipse.jetty.io.SelectChannelEndPoint$2.run(SelectChannelEndPoint.java:93)
   [junit4]   2> 	at org.eclipse.jetty.util.thread.strategy.ExecuteProduceConsume.executeProduceConsume(ExecuteProduceConsume.java:303)
   [junit4]   2> 	at org.eclipse.jetty.util.thread.strategy.ExecuteProduceConsume.produceConsume(ExecuteProduceConsume.java:148)
   [junit4]   2> 	at org.eclipse.jetty.util.thread.strategy.ExecuteProduceConsume.run(ExecuteProduceConsume.java:136)
   [junit4]   2> 	at org.eclipse.jetty.util.thread.QueuedThreadPool.runJob(QueuedThreadPool.java:671)
   [junit4]   2> 	at org.eclipse.jetty.util.thread.QueuedThreadPool$2.run(QueuedThreadPool.java:589)
   [junit4]   2> 	at java.base/java.lang.Thread.run(Thread.java:844)
   [junit4]   2> 4442 INFO  (qtp1711373646-33) [    ] o.a.s.c.S.Request [collection1]  webapp=/solr path=/query params={q=title:w10&indent=on&fl=*,+score&rows=4&wt=json&rq={!ltr+model%3Ddescription-model2+reRankDocs%3D8}} hits=1 status=0 QTime=8
   [junit4]   2> 4445 INFO  (TEST-TestFieldLengthFeature.testIfFieldIsMissingInDocumentLengthIsZero-seed#[DC3017ADBDFFF73B]) [    ] o.a.s.SolrTestCaseJ4 ###Ending testIfFieldIsMissingInDocumentLengthIsZero
   [junit4]   2> 4447 INFO  (TEST-TestFieldLengthFeature.testIfFieldIsEmptyLengthIsZero-seed#[DC3017ADBDFFF73B]) [    ] o.a.s.SolrTestCaseJ4 ###Starting testIfFieldIsEmptyLengthIsZero
   [junit4]   2> 4451 INFO  (qtp1711373646-38) [    ] o.a.s.u.p.LogUpdateProcessorFactory [collection1]  webapp=/solr path=/update params={stream.body=<add><doc><field+name%3D"id">43</field><field+name%3D"title">w11</field><field+name%3D"description"></field></doc></add>}{add=[43 (1568197956148920320)]} 0 2
   [junit4]   2> 4454 INFO  (qtp1711373646-39) [    ] o.a.s.u.DirectUpdateHandler2 start commit{_version_=1568197956154163200,optimize=false,openSearcher=true,waitSearcher=true,expungeDeletes=false,softCommit=false,prepareCommit=false}
   [junit4]   2> 4454 INFO  (qtp1711373646-39) [    ] o.a.s.u.SolrIndexWriter Calling setCommitData with IW:org.apache.solr.update.SolrIndexWriter@74a20964 commitCommandVersion:1568197956154163200
   [junit4]   2> 4460 INFO  (qtp1711373646-39) [    ] o.a.s.s.SolrIndexSearcher Opening [Searcher@1a6c8cb[collection1] main]
   [junit4]   2> 4461 INFO  (searcherExecutor-31-thread-1) [    ] o.a.s.c.SolrCore [collection1] Registered new searcher Searcher@1a6c8cb[collection1] main{ExitableDirectoryReader(UninvertingDirectoryReader(Uninverting(_0(7.0.0):C8) Uninverting(_1(7.0.0):C1) Uninverting(_2(7.0.0):C1)))}
   [junit4]   2> 4464 INFO  (qtp1711373646-39) [    ] o.a.s.u.DirectUpdateHandler2 end_commit_flush
   [junit4]   2> 4465 INFO  (qtp1711373646-39) [    ] o.a.s.u.p.LogUpdateProcessorFactory [collection1]  webapp=/solr path=/update params={stream.body=<commit/>}{commit=} 0 11
   [junit4]   2> 4466 INFO  (TEST-TestFieldLengthFeature.testIfFieldIsEmptyLengthIsZero-seed#[DC3017ADBDFFF73B]) [    ] o.a.s.l.TestRerankBase loading feauture 
   [junit4]   2> {
   [junit4]   2> "name":"description-length3",
   [junit4]   2> "store":"test",
   [junit4]   2> "class":"org.apache.solr.ltr.feature.FieldLengthFeature",
   [junit4]   2> "params":{"field":"description"}
   [junit4]   2> }
   [junit4]   2>  
   [junit4]   2> 4468 INFO  (qtp1711373646-39) [    ] o.a.s.r.RestManager Found ManagedResource [org.apache.solr.ltr.store.rest.ManagedFeatureStore@5c1c8d0a] for /schema/feature-store
   [junit4]   2> 4468 INFO  (qtp1711373646-39) [    ] o.a.s.r.ManagedResource Processing update to /schema/feature-store: {name=description-length3, store=test, class=org.apache.solr.ltr.feature.FieldLengthFeature, params={field=description}} is a java.util.LinkedHashMap
   [junit4]   2> 4468 INFO  (qtp1711373646-39) [    ] o.a.s.l.s.r.ManagedFeatureStore register feature based on {name=description-length3, store=test, class=org.apache.solr.ltr.feature.FieldLengthFeature, params={field=description}}
   [junit4]   2> 4469 INFO  (qtp1711373646-39) [    ] o.a.s.r.ManagedResourceStorage Saved JSON object to path _schema_feature-store.json using file:dir=/home/jenkins/workspace/Lucene-Solr-master-Linux/solr/build/contrib/solr-ltr/test/J0/temp/solr.ltr.feature.TestFieldLengthFeature_DC3017ADBDFFF73B-001/tempDir-001/collection1/conf
   [junit4]   2> 4469 INFO  (qtp1711373646-39) [    ] o.a.s.r.RestManager [collection1]  webapp=/solr path=/schema/feature-store params={indent=on&wt=json} status=0 QTime=1
   [junit4]   2> Lép 23, 2017 10:35:13 ƐNKAKƐNYÁ org.restlet.engine.log.LogFilter afterHandle
   [junit4]   2> INFO: 2017-05-23	10:35:13	127.0.0.1	-	127.0.0.1	41427	PUT	/solr/schema/feature-store	wt=json&indent=on	200	-	141	1	http://127.0.0.1:41427	Apache-HttpClient/4.4.1 (Java/9-ea)	-
   [junit4]   2> 4471 WARN  (qtp1711373646-39) [    ] o.e.j.s.ServletHandler Error for /solr/collection1/schema/feature-store
   [junit4]   2> java.lang.AssertionError: Attempted close of response output stream.
   [junit4]   2> 	at org.apache.solr.servlet.SolrDispatchFilter$2$1.close(SolrDispatchFilter.java:517)
   [junit4]   2> 	at org.eclipse.jetty.server.Dispatcher.commitResponse(Dispatcher.java:270)
   [junit4]   2> 	at org.eclipse.jetty.server.Dispatcher.forward(Dispatcher.java:202)
   [junit4]   2> 	at org.eclipse.jetty.server.Dispatcher.forward(Dispatcher.java:74)
   [junit4]   2> 	at org.apache.solr.servlet.SolrDispatchFilter.doFilter(SolrDispatchFilter.java:383)
   [junit4]   2> 	at org.apache.solr.servlet.SolrDispatchFilter.doFilter(SolrDispatchFilter.java:318)
   [junit4]   2> 	at org.eclipse.jetty.servlet.ServletHandler$CachedChain.doFilter(ServletHandler.java:1699)
   [junit4]   2> 	at org.apache.solr.client.solrj.embedded.JettySolrRunner$DebugFilter.doFilter(JettySolrRunner.java:139)
   [junit4]   2> 	at org.eclipse.jetty.servlet.ServletHandler$CachedChain.doFilter(ServletHandler.java:1699)
   [junit4]   2> 	at org.eclipse.jetty.servlet.ServletHandler.doHandle(ServletHandler.java:582)
   [junit4]   2> 	at org.eclipse.jetty.server.session.SessionHandler.doHandle(SessionHandler.java:224)
   [junit4]   2> 	at org.eclipse.jetty.server.handler.ContextHandler.doHandle(ContextHandler.java:1180)
   [junit4]   2> 	at org.eclipse.jetty.servlet.ServletHandler.doScope(ServletHandler.java:512)
   [junit4]   2> 	at org.eclipse.jetty.server.session.SessionHandler.doScope(SessionHandler.java:185)
   [junit4]   2> 	at org.eclipse.jetty.server.handler.ContextHandler.doScope(ContextHandler.java:1112)
   [junit4]   2> 	at org.eclipse.jetty.server.handler.ScopedHandler.handle(ScopedHandler.java:141)
   [junit4]   2> 	at org.eclipse.jetty.server.handler.gzip.GzipHandler.handle(GzipHandler.java:395)
   [junit4]   2> 	at org.eclipse.jetty.server.handler.HandlerWrapper.handle(HandlerWrapper.java:134)
   [junit4]   2> 	at org.eclipse.jetty.server.Server.handle(Server.java:534)
   [junit4]   2> 	at org.eclipse.jetty.server.HttpChannel.handle(HttpChannel.java:320)
   [junit4]   2> 	at org.eclipse.jetty.server.HttpConnection.onFillable(HttpConnection.java:251)
   [junit4]   2> 	at org.eclipse.jetty.io.AbstractConnection$ReadCallback.succeeded(AbstractConnection.java:273)
   [junit4]   2> 	at org.eclipse.jetty.io.FillInterest.fillable(FillInterest.java:95)
   [junit4]   2> 	at org.eclipse.jetty.io.SelectChannelEndPoint$2.run(SelectChannelEndPoint.java:93)
   [junit4]   2> 	at org.eclipse.jetty.util.thread.strategy.ExecuteProduceConsume.executeProduceConsume(ExecuteProduceConsume.java:303)
   [junit4]   2> 	at org.eclipse.jetty.util.thread.strategy.ExecuteProduceConsume.produceConsume(ExecuteProduceConsume.java:148)
   [junit4]   2> 	at org.eclipse.jetty.util.thread.strategy.ExecuteProduceConsume.run(ExecuteProduceConsume.java:136)
   [junit4]   2> 	at org.eclipse.jetty.util.thread.QueuedThreadPool.runJob(QueuedThreadPool.java:671)
   [junit4]   2> 	at org.eclipse.jetty.util.thread.QueuedThreadPool$2.run(QueuedThreadPool.java:589)
   [junit4]   2> 	at java.base/java.lang.Thread.run(Thread.java:844)
   [junit4]   2> 4472 INFO  (TEST-TestFieldLengthFeature.testIfFieldIsEmptyLengthIsZero-seed#[DC3017ADBDFFF73B]) [    ] o.a.s.l.TestRerankBase loading model 
   [junit4]   2> {
   [junit4]   2> "name":"description-model3",
   [junit4]   2> "store":"test",
   [junit4]   2> "class":"org.apache.solr.ltr.model.LinearModel",
   [junit4]   2> "features":[
   [junit4]   2> 	{ "name":"description-length3"}
   [junit4]   2> ]
   [junit4]   2> ,
   [junit4]   2> "params":{"weights":{"description-length3":1.0}}
   [junit4]   2> }
   [junit4]   2>  
   [junit4]   2> 4474 INFO  (qtp1711373646-39) [    ] o.a.s.r.RestManager Found ManagedResource [ManagedModelStore [store=ModelStore [availableModels=[title-model, description-model2]], featureStores=org.apache.solr.ltr.store.rest.ManagedFeatureStore@5c1c8d0a]] for /schema/model-store
   [junit4]   2> 4474 INFO  (qtp1711373646-39) [    ] o.a.s.r.ManagedResource Processing update to /schema/model-store: {name=description-model3, store=test, class=org.apache.solr.ltr.model.LinearModel, features=[{name=description-length3}], params={weights={description-length3=1.0}}} is a java.util.LinkedHashMap
   [junit4]   2> 4477 INFO  (qtp1711373646-39) [    ] o.a.s.l.s.r.ManagedModelStore adding model description-model3
   [junit4]   2> 4478 INFO  (qtp1711373646-39) [    ] o.a.s.r.ManagedResourceStorage Saved JSON object to path _schema_model-store.json using file:dir=/home/jenkins/workspace/Lucene-Solr-master-Linux/solr/build/contrib/solr-ltr/test/J0/temp/solr.ltr.feature.TestFieldLengthFeature_DC3017ADBDFFF73B-001/tempDir-001/collection1/conf
   [junit4]   2> 4478 INFO  (qtp1711373646-39) [    ] o.a.s.r.RestManager [collection1]  webapp=/solr path=/schema/model-store params={indent=on&wt=json} status=0 QTime=5
   [junit4]   2> Lép 23, 2017 10:35:13 ƐNKAKƐNYÁ org.restlet.engine.log.LogFilter afterHandle
   [junit4]   2> INFO: 2017-05-23	10:35:13	127.0.0.1	-	127.0.0.1	41427	PUT	/solr/schema/model-store	wt=json&indent=on	200	-	197	5	http://127.0.0.1:41427	Apache-HttpClient/4.4.1 (Java/9-ea)	-
   [junit4]   2> 4480 WARN  (qtp1711373646-39) [    ] o.e.j.s.ServletHandler Error for /solr/collection1/schema/model-store
   [junit4]   2> java.lang.AssertionError: Attempted close of response output stream.
   [junit4]   2> 	at org.apache.solr.servlet.SolrDispatchFilter$2$1.close(SolrDispatchFilter.java:517)
   [junit4]   2> 	at org.eclipse.jetty.server.Dispatcher.commitResponse(Dispatcher.java:270)
   [junit4]   2> 	at org.eclipse.jetty.server.Dispatcher.forward(Dispatcher.java:202)
   [junit4]   2> 	at org.eclipse.jetty.server.Dispatcher.forward(Dispatcher.java:74)
   [junit4]   2> 	at org.apache.solr.servlet.SolrDispatchFilter.doFilter(SolrDispatchFilter.java:383)
   [junit4]   2> 	at org.apache.solr.servlet.SolrDispatchFilter.doFilter(SolrDispatchFilter.java:318)
   [junit4]   2> 	at org.eclipse.jetty.servlet.ServletHandler$CachedChain.doFilter(ServletHandler.java:1699)
   [junit4]   2> 	at org.apache.solr.client.solrj.embedded.JettySolrRunner$DebugFilter.doFilter(JettySolrRunner.java:139)
   [junit4]   2> 	at org.eclipse.jetty.servlet.ServletHandler$CachedChain.doFilter(ServletHandler.java:1699)
   [junit4]   2> 	at org.eclipse.jetty.servlet.ServletHandler.doHandle(ServletHandler.java:582)
   [junit4]   2> 	at org.eclipse.jetty.server.session.SessionHandler.doHandle(SessionHandler.java:224)
   [junit4]   2> 	at org.eclipse.jetty.server.handler.ContextHandler.doHandle(ContextHandler.java:1180)
   [junit4]   2> 	at org.eclipse.jetty.servlet.ServletHandler.doScope(ServletHandler.java:512)
   [junit4]   2> 	at org.eclipse.jetty.server.session.SessionHandler.doScope(SessionHandler.java:185)
   [junit4]   2> 	at org.eclipse.jetty.server.handler.ContextHandler.doScope(ContextHandler.java:1112)
   [junit4]   2> 	at org.eclipse.jetty.server.handler.ScopedHandler.handle(ScopedHandler.java:141)
   [junit4]   2> 	at org.eclipse.jetty.server.handler.gzip.GzipHandler.handle(GzipHandler.java:395)
   [junit4]   2> 	at org.eclipse.jetty.server.handler.HandlerWrapper.handle(HandlerWrapper.java:134)
   [junit4]   2> 	at org.eclipse.jetty.server.Server.handle(Server.java:534)
   [junit4]   2> 	at org.eclipse.jetty.server.HttpChannel.handle(HttpChannel.java:320)
   [junit4]   2> 	at org.eclipse.jetty.server.HttpConnection.onFillable(HttpConnection.java:251)
   [junit4]   2> 	at org.eclipse.jetty.io.AbstractConnection$ReadCallback.succeeded(AbstractConnection.java:273)
   [junit4]   2> 	at org.eclipse.jetty.io.FillInterest.fillable(FillInterest.java:95)
   [junit4]   2> 	at org.eclipse.jetty.io.SelectChannelEndPoint$2.run(SelectChannelEndPoint.java:93)
   [junit4]   2> 	at org.eclipse.jetty.util.thread.strategy.ExecuteProduceConsume.executeProduceConsume(ExecuteProduceConsume.java:303)
   [junit4]   2> 	at org.eclipse.jetty.util.thread.strategy.ExecuteProduceConsume.produceConsume(ExecuteProduceConsume.java:148)
   [junit4]   2> 	at org.eclipse.jetty.util.thread.strategy.ExecuteProduceConsume.run(ExecuteProduceConsume.java:136)
   [junit4]   2> 	at org.eclipse.jetty.util.thread.QueuedThreadPool.runJob(QueuedThreadPool.java:671)
   [junit4]   2> 	at org.eclipse.jetty.util.thread.QueuedThreadPool$2.run(QueuedThreadPool.java:589)
   [junit4]   2> 	at java.base/java.lang.Thread.run(Thread.java:844)
   [junit4]   2> 4483 INFO  (qtp1711373646-39) [    ] o.a.s.c.S.Request [collection1]  webapp=/solr path=/query params={q=title:w11&indent=on&fl=*,+score&rows=4&wt=json&rq={!ltr+model%3Ddescription-model3+reRankDocs%3D8}} hits=1 status=0 QTime=1
   [junit4]   2> 4484 INFO  (TEST-TestFieldLengthFeature.testIfFieldIsEmptyLengthIsZero-seed#[DC3017ADBDFFF73B]) [    ] o.a.s.SolrTestCaseJ4 ###Ending testIfFieldIsEmptyLengthIsZero
   [junit4]   2> 4492 INFO  (SUITE-TestFieldLengthFeature-seed#[DC3017ADBDFFF73B]-worker) [    ] o.e.j.s.AbstractConnector Stopped ServerConnector@234f551b{HTTP/1.1,[http/1.1]}{127.0.0.1:0}
   [junit4]   2> 4492 INFO  (SUITE-TestFieldLengthFeature-seed#[DC3017ADBDFFF73B]-worker) [    ] o.a.s.c.CoreContainer Shutting down CoreContainer instance=569154938
   [junit4]   2> 4493 INFO  (SUITE-TestFieldLengthFeature-seed#[DC3017ADBDFFF73B]-worker) [    ] o.a.s.m.SolrMetricManager Closing metric reporters for registry=solr.node, tag=null
   [junit4]   2> 4493 INFO  (SUITE-TestFieldLengthFeature-seed#[DC3017ADBDFFF73B]-worker) [    ] o.a.s.m.SolrMetricManager Closing metric reporters for registry=solr.jvm, tag=null
   [junit4]   2> 4493 INFO  (SUITE-TestFieldLengthFeature-seed#[DC3017ADBDFFF73B]-worker) [    ] o.a.s.m.SolrMetricManager Closing metric reporters for registry=solr.jetty, tag=null
   [junit4]   2> 4493 INFO  (SUITE-TestFieldLengthFeature-seed#[DC3017ADBDFFF73B]-worker) [    ] o.a.s.c.TransientSolrCoreCacheDefault Allocating transient cache for 2147483647 transient cores
   [junit4]   2> 4509 INFO  (coreCloseExecutor-36-thread-1) [    ] o.a.s.c.SolrCore [collection1]  CLOSING SolrCore org.apache.solr.core.SolrCore@118131b0
   [junit4]   2> 4533 INFO  (coreCloseExecutor-36-thread-1) [    ] o.a.s.m.SolrMetricManager Closing metric reporters for registry=solr.core.collection1, tag=293679536
   [junit4]   2> 4536 INFO  (SUITE-TestFieldLengthFeature-seed#[DC3017ADBDFFF73B]-worker) [    ] o.e.j.s.h.ContextHandler Stopped o.e.j.s.ServletContextHandler@78f1a3d2{/solr,null,UNAVAILABLE}
   [junit4]   2> 4541 INFO  (SUITE-TestFieldLengthFeature-seed#[DC3017ADBDFFF73B]-worker) [    ] o.a.s.SolrTestCaseJ4 ###deleteCore
   [junit4]   2> 4541 INFO  (SUITE-TestFieldLengthFeature-seed#[DC3017ADBDFFF73B]-worker) [    ] o.a.s.c.CoreContainer Shutting down CoreContainer instance=2103985567
   [junit4]   2> 4541 INFO  (SUITE-TestFieldLengthFeature-seed#[DC3017ADBDFFF73B]-worker) [    ] o.a.s.m.SolrMetricManager Closing metric reporters for registry=solr.node, tag=null
   [junit4]   2> 4541 INFO  (SUITE-TestFieldLengthFeature-seed#[DC3017ADBDFFF73B]-worker) [    ] o.a.s.m.SolrMetricManager Closing metric reporters for registry=solr.jvm, tag=null
   [junit4]   2> 4541 INFO  (SUITE-TestFieldLengthFeature-seed#[DC3017ADBDFFF73B]-worker) [    ] o.a.s.m.SolrMetricManager Closing metric reporters for registry=solr.jetty, tag=null
   [junit4]   2> 4541 INFO  (SUITE-TestFieldLengthFeature-seed#[DC3017ADBDFFF73B]-worker) [    ] o.a.s.c.TransientSolrCoreCacheDefault Allocating transient cache for 2147483647 transient cores
   [junit4]   2> 4542 INFO  (coreCloseExecutor-38-thread-1) [    ] o.a.s.c.SolrCore [collection1]  CLOSING SolrCore org.apache.solr.core.SolrCore@45489d24
   [junit4]   2> 4542 INFO  (coreCloseExecutor-38-thread-1) [    ] o.a.s.m.SolrMetricManager Closing metric reporters for registry=solr.core.collection1, tag=1162386724
   [junit4]   2> NOTE: leaving temporary files on disk at: /home/jenkins/workspace/Lucene-Solr-master-Linux/solr/build/contrib/solr-ltr/test/J0/temp/solr.ltr.feature.TestFieldLengthFeature_DC3017ADBDFFF73B-001
   [junit4]   2> May 23, 2017 2:35:13 PM com.carrotsearch.randomizedtesting.ThreadLeakControl checkThreadLeaks
   [junit4]   2> WARNING: Will linger awaiting termination of 2 leaked thread(s).
   [junit4]   2> NOTE: test params are: codec=Asserting(Lucene70): {_version_=TestBloomFilteredLucenePostings(BloomFilteringPostingsFormat(Lucene50(blocksize=128))), description=PostingsFormat(name=MockRandom), id=FST50, text=PostingsFormat(name=Asserting), title=PostingsFormat(name=MockRandom)}, docValues:{}, maxPointsInLeafNode=283, maxMBSortInHeap=5.481055550377126, sim=RandomSimilarity(queryNorm=false): {}, locale=mas-KE, timezone=Brazil/West
   [junit4]   2> NOTE: Linux 4.8.0-52-generic amd64/Oracle Corporation 9-ea (64-bit)/cpus=8,threads=1,free=412526848,total=518979584
   [junit4]   2> NOTE: All tests run in this JVM: [TestManagedFeatureStore, TestFieldLengthFeature]
   [junit4] Completed [3/33 (1!)] on J0 in 2.69s, 3 tests, 1 error <<< FAILURES!

[...truncated 34 lines...]
   [junit4] Suite: org.apache.solr.ltr.TestLTRQParserPlugin
   [junit4]   2> Creating dataDir: /home/jenkins/workspace/Lucene-Solr-master-Linux/solr/build/contrib/solr-ltr/test/J2/temp/solr.ltr.TestLTRQParserPlugin_DC3017ADBDFFF73B-001/init-core-data-001
   [junit4]   2> 9648 WARN  (SUITE-TestLTRQParserPlugin-seed#[DC3017ADBDFFF73B]-worker) [    ] o.a.s.SolrTestCaseJ4 startTrackingSearchers: numOpens=3 numCloses=3
   [junit4]   2> 9648 INFO  (SUITE-TestLTRQParserPlugin-seed#[DC3017ADBDFFF73B]-worker) [    ] o.a.s.SolrTestCaseJ4 Using TrieFields
   [junit4]   2> 9649 INFO  (SUITE-TestLTRQParserPlugin-seed#[DC3017ADBDFFF73B]-worker) [    ] o.a.s.SolrTestCaseJ4 Randomized ssl (false) and clientAuth (true) via: @org.apache.solr.util.RandomizeSSL(reason="", ssl=0.0/0.0, value=0.0/0.0, clientAuth=0.0/0.0)
   [junit4]   2> 9649 INFO  (SUITE-TestLTRQParserPlugin-seed#[DC3017ADBDFFF73B]-worker) [    ] o.a.s.SolrTestCaseJ4 ####initCore
   [junit4]   2> 9655 INFO  (SUITE-TestLTRQParserPlugin-seed#[DC3017ADBDFFF73B]-worker) [    ] o.a.s.c.SolrConfig Using Lucene MatchVersion: 6.0.0
   [junit4]   2> 9683 INFO  (SUITE-TestLTRQParserPlugin-seed#[DC3017ADBDFFF73B]-worker) [    ] o.a.s.s.IndexSchema [null] Schema name=example
   [junit4]   2> 9691 INFO  (SUITE-TestLTRQParserPlugin-seed#[DC3017ADBDFFF73B]-worker) [    ] o.a.s.s.IndexSchema Loaded schema example/1.5 with uniqueid field id
   [junit4]   2> 9721 WARN  (SUITE-TestLTRQParserPlugin-seed#[DC3017ADBDFFF73B]-worker) [    ] o.a.s.m.r.SolrJmxReporter No JMX server found. Not exposing Solr metrics via JMX.
   [junit4]   2> 9721 WARN  (SUITE-TestLTRQParserPlugin-seed#[DC3017ADBDFFF73B]-worker) [    ] o.a.s.m.r.SolrJmxReporter No JMX server found. Not exposing Solr metrics via JMX.
   [junit4]   2> 9721 WARN  (SUITE-TestLTRQParserPlugin-seed#[DC3017ADBDFFF73B]-worker) [    ] o.a.s.m.r.SolrJmxReporter No JMX server found. Not exposing Solr metrics via JMX.
   [junit4]   2> 9729 INFO  (coreLoadExecutor-153-thread-1) [    ] o.a.s.c.SolrConfig Using Lucene MatchVersion: 6.0.0
   [junit4]   2> 9738 INFO  (coreLoadExecutor-153-thread-1) [    ] o.a.s.s.IndexSchema [collection1] Schema name=example
   [junit4]   2> 9746 INFO  (coreLoadExecutor-153-thread-1) [    ] o.a.s.s.IndexSchema Loaded schema example/1.5 with uniqueid field id
   [junit4]   2> 9748 INFO  (coreLoadExecutor-153-thread-1) [    ] o.a.s.c.CoreContainer Creating SolrCore 'collection1' using configuration from instancedir /home/jenkins/workspace/Lucene-Solr-master-Linux/solr/contrib/ltr/src/test-files/solr/collection1, trusted=true
   [junit4]   2> 9748 WARN  (coreLoadExecutor-153-thread-1) [    ] o.a.s.m.r.SolrJmxReporter No JMX server found. Not exposing Solr metrics via JMX.
   [junit4]   2> 9748 INFO  (coreLoadExecutor-153-thread-1) [    ] o.a.s.c.SolrCore solr.RecoveryStrategy.Builder
   [junit4]   2> 9749 INFO  (coreLoadExecutor-153-thread-1) [    ] o.a.s.c.SolrCore [[collection1] ] Opening new SolrCore at [/home/jenkins/workspace/Lucene-Solr-master-Linux/solr/contrib/ltr/src/test-files/solr/collection1], dataDir=[/home/jenkins/workspace/Lucene-Solr-master-Linux/solr/build/contrib/solr-ltr/test/J2/temp/solr.ltr.TestLTRQParserPlugin_DC3017ADBDFFF73B-001/init-core-data-001/]
   [junit4]   2> 9789 WARN  (coreLoadExecutor-153-thread-1) [    ] o.a.s.c.RequestHandlers no default request handler is registered (either '/select' or 'standard')
   [junit4]   2> 9790 INFO  (coreLoadExecutor-153-thread-1) [    ] o.a.s.u.UpdateHandler Using UpdateLog implementation: org.apache.solr.update.UpdateLog
   [junit4]   2> 9790 INFO  (coreLoadExecutor-153-thread-1) [    ] o.a.s.u.UpdateLog Initializing UpdateLog: dataDir= defaultSyncLevel=FLUSH numRecordsToKeep=100 maxNumLogsToKeep=10 numVersionBuckets=65536
   [junit4]   2> 9791 INFO  (coreLoadExecutor-153-thread-1) [    ] o.a.s.u.CommitTracker Hard AutoCommit: if uncommited for 15000ms; 
   [junit4]   2> 9791 INFO  (coreLoadExecutor-153-thread-1) [    ] o.a.s.u.CommitTracker Soft AutoCommit: if uncommited for 1000ms; 
   [junit4]   2> 9792 INFO  (coreLoadExecutor-153-thread-1) [    ] o.a.s.s.SolrIndexSearcher Opening [Searcher@489e8cce[collection1] main]
   [junit4]   2> 9792 WARN  (coreLoadExecutor-153-thread-1) [    ] o.a.s.r.ManagedResourceStorage Cannot write to config directory /home/jenkins/workspace/Lucene-Solr-master-Linux/solr/contrib/ltr/src/test-files/solr/collection1/conf; switching to use InMemory storage instead.
   [junit4]   2> 9793 INFO  (coreLoadExecutor-153-thread-1) [    ] o.a.s.r.RestManager Registered ManagedResource impl org.apache.solr.ltr.store.rest.ManagedFeatureStore for path /schema/feature-store
   [junit4]   2> 9793 WARN  (coreLoadExecutor-153-thread-1) [    ] o.a.s.r.ManagedResource No stored data found for /schema/feature-store
   [junit4]   2> 9793 INFO  (coreLoadExecutor-153-thread-1) [    ] o.a.s.l.s.r.ManagedFeatureStore ------ managed feature ~ loading ------
   [junit4]   2> 9793 INFO  (coreLoadExecutor-153-thread-1) [    ] o.a.s.r.ManagedResource Notified 1 observers of /schema/feature-store
   [junit4]   2> 9793 INFO  (coreLoadExecutor-153-thread-1) [    ] o.a.s.r.RestManager Registered new managed resource /schema/feature-store
   [junit4]   2> 9793 INFO  (coreLoadExecutor-153-thread-1) [    ] o.a.s.r.RestManager Registered ManagedResource impl org.apache.solr.ltr.store.rest.ManagedModelStore for path /schema/model-store
   [junit4]   2> 9793 WARN  (coreLoadExecutor-153-thread-1) [    ] o.a.s.r.ManagedResource No stored data found for /schema/model-store
   [junit4]   2> 9793 INFO  (coreLoadExecutor-153-thread-1) [    ] o.a.s.l.s.r.ManagedModelStore INIT model store
   [junit4]   2> 9793 INFO  (coreLoadExecutor-153-thread-1) [    ] o.a.s.l.s.r.ManagedModelStore ------ managed models ~ loading ------
   [junit4]   2> 9793 INFO  (coreLoadExecutor-153-thread-1) [    ] o.a.s.r.ManagedResource Notified 1 observers of /schema/model-store
   [junit4]   2> 9793 INFO  (coreLoadExecutor-153-thread-1) [    ] o.a.s.r.RestManager Registered new managed resource /schema/model-store
   [junit4]   2> 9793 INFO  (coreLoadExecutor-153-thread-1) [    ] o.a.s.h.ReplicationHandler Commits will be reserved for  10000
   [junit4]   2> 9793 INFO  (coreLoadExecutor-153-thread-1) [    ] o.a.s.u.UpdateLog Could not find max version in index or recent updates, using new clock 1568197961347760128
   [junit4]   2> 9794 INFO  (searcherExecutor-154-thread-1) [    ] o.a.s.c.SolrCore [collection1] Registered new searcher Searcher@489e8cce[collection1] main{ExitableDirectoryReader(UninvertingDirectoryReader())}
   [junit4]   2> 9797 INFO  (SUITE-TestLTRQParserPlugin-seed#[DC3017ADBDFFF73B]-worker) [    ] o.a.s.SolrTestCaseJ4 ####initCore end
   [junit4]   2> 9803 INFO  (SUITE-TestLTRQParserPlugin-seed#[DC3017ADBDFFF73B]-worker) [    ] o.a.s.SolrTestCaseJ4 ####initCore
   [junit4]   2> 9803 INFO  (SUITE-TestLTRQParserPlugin-seed#[DC3017ADBDFFF73B]-worker) [    ] o.a.s.SolrTestCaseJ4 ####initCore end
   [junit4]   2> 9803 INFO  (SUITE-TestLTRQParserPlugin-seed#[DC3017ADBDFFF73B]-worker) [    ] o.a.s.SolrTestCaseJ4 Writing core.properties file to /home/jenkins/workspace/Lucene-Solr-master-Linux/solr/build/contrib/solr-ltr/test/J2/temp/solr.ltr.TestLTRQParserPlugin_DC3017ADBDFFF73B-001/tempDir-003/cores/core
   [junit4]   2> 9805 INFO  (SUITE-TestLTRQParserPlugin-seed#[DC3017ADBDFFF73B]-worker) [    ] o.e.j.s.Server jetty-9.3.14.v20161028
   [junit4]   2> 9806 INFO  (SUITE-TestLTRQParserPlugin-seed#[DC3017ADBDFFF73B]-worker) [    ] o.e.j.s.h.ContextHandler Started o.e.j.s.ServletContextHandler@18565e2e{/solr,null,AVAILABLE}
   [junit4]   2> 9807 INFO  (SUITE-TestLTRQParserPlugin-seed#[DC3017ADBDFFF73B]-worker) [    ] o.e.j.s.AbstractConnector Started ServerConnector@762d0ef5{HTTP/1.1,[http/1.1]}{127.0.0.1:35347}
   [junit4]   2> 9807 INFO  (SUITE-TestLTRQParserPlugin-seed#[DC3017ADBDFFF73B]-worker) [    ] o.e.

[...truncated too long message...]

nHandler.doScope(SessionHandler.java:185)
   [junit4]   2> 	at org.eclipse.jetty.server.handler.ContextHandler.doScope(ContextHandler.java:1112)
   [junit4]   2> 	at org.eclipse.jetty.server.handler.ScopedHandler.handle(ScopedHandler.java:141)
   [junit4]   2> 	at org.eclipse.jetty.server.handler.gzip.GzipHandler.handle(GzipHandler.java:395)
   [junit4]   2> 	at org.eclipse.jetty.server.handler.HandlerWrapper.handle(HandlerWrapper.java:134)
   [junit4]   2> 	at org.eclipse.jetty.server.Server.handle(Server.java:534)
   [junit4]   2> 	at org.eclipse.jetty.server.HttpChannel.handle(HttpChannel.java:320)
   [junit4]   2> 	at org.eclipse.jetty.server.HttpConnection.onFillable(HttpConnection.java:251)
   [junit4]   2> 	at org.eclipse.jetty.io.AbstractConnection$ReadCallback.succeeded(AbstractConnection.java:273)
   [junit4]   2> 	at org.eclipse.jetty.io.FillInterest.fillable(FillInterest.java:95)
   [junit4]   2> 	at org.eclipse.jetty.io.SelectChannelEndPoint$2.run(SelectChannelEndPoint.java:93)
   [junit4]   2> 	at org.eclipse.jetty.util.thread.strategy.ExecuteProduceConsume.executeProduceConsume(ExecuteProduceConsume.java:303)
   [junit4]   2> 	at org.eclipse.jetty.util.thread.strategy.ExecuteProduceConsume.produceConsume(ExecuteProduceConsume.java:148)
   [junit4]   2> 	at org.eclipse.jetty.util.thread.strategy.ExecuteProduceConsume.run(ExecuteProduceConsume.java:136)
   [junit4]   2> 	at org.eclipse.jetty.util.thread.QueuedThreadPool.runJob(QueuedThreadPool.java:671)
   [junit4]   2> 	at org.eclipse.jetty.util.thread.QueuedThreadPool$2.run(QueuedThreadPool.java:589)
   [junit4]   2> 	at java.base/java.lang.Thread.run(Thread.java:844)
   [junit4]   2> 6732 INFO  (qtp1442433732-93) [    ] o.a.s.c.S.Request [collection1]  webapp=/solr path=/query params={q=*:*&indent=on&fl=*,score&rows=4&wt=json&rq={!ltr+reRankDocs%3D10+model%3Dexternalmodel+efi.user_query%3Dw3}} hits=5 status=0 QTime=9
   [junit4]   2> 6733 ERROR (TEST-TestParallelWeightCreation.testLTRScoringQueryParallelWeightCreationResultOrder-seed#[DC3017ADBDFFF73B]) [    ] o.a.s.u.RestTestBase query failed JSON validation. error=mismatch: '3'!='4' @ response/docs/[0]/id
   [junit4]   2>  expected =/response/docs/[0]/id=='3'
   [junit4]   2>  response = {
   [junit4]   2>   "responseHeader":{
   [junit4]   2>     "status":0,
   [junit4]   2>     "QTime":9,
   [junit4]   2>     "params":{
   [junit4]   2>       "q":"*:*",
   [junit4]   2>       "indent":"on",
   [junit4]   2>       "fl":"*,score",
   [junit4]   2>       "rows":"4",
   [junit4]   2>       "wt":"json",
   [junit4]   2>       "rq":"{!ltr reRankDocs=10 model=externalmodel efi.user_query=w3}"}},
   [junit4]   2>   "response":{"numFound":5,"start":0,"maxScore":0.36707595,"docs":[
   [junit4]   2>       {
   [junit4]   2>         "id":"4",
   [junit4]   2>         "title":"w3 w3",
   [junit4]   2>         "description":"w4",
   [junit4]   2>         "popularity":4,
   [junit4]   2>         "_version_":1568197958043697152,
   [junit4]   2>         "score":0.36707595},
   [junit4]   2>       {
   [junit4]   2>         "id":"3",
   [junit4]   2>         "title":"w3",
   [junit4]   2>         "description":"w3",
   [junit4]   2>         "popularity":3,
   [junit4]   2>         "_version_":1568197958040551424,
   [junit4]   2>         "score":0.33873552},
   [junit4]   2>       {
   [junit4]   2>         "id":"1",
   [junit4]   2>         "title":"w1 w3",
   [junit4]   2>         "description":"w1",
   [junit4]   2>         "popularity":1,
   [junit4]   2>         "_version_":1568197958031114240,
   [junit4]   2>         "score":0.2545195},
   [junit4]   2>       {
   [junit4]   2>         "id":"2",
   [junit4]   2>         "title":"w2",
   [junit4]   2>         "description":"w2",
   [junit4]   2>         "popularity":2,
   [junit4]   2>         "_version_":1568197958037405696,
   [junit4]   2>         "score":0.0}]
   [junit4]   2>   }}
   [junit4]   2> 
   [junit4]   2>  request = /query?q=*%3A*&fl=*%2Cscore&rows=4&rq=%7B%21ltr+reRankDocs%3D10+model%3Dexternalmodel+efi.user_query%3Dw3%7D&wt=json&indent=on
   [junit4]   2> 
   [junit4]   2> 6734 INFO  (TEST-TestParallelWeightCreation.testLTRScoringQueryParallelWeightCreationResultOrder-seed#[DC3017ADBDFFF73B]) [    ] o.a.s.SolrTestCaseJ4 ###Ending testLTRScoringQueryParallelWeightCreationResultOrder
   [junit4]   2> NOTE: reproduce with: ant test  -Dtestcase=TestParallelWeightCreation -Dtests.method=testLTRScoringQueryParallelWeightCreationResultOrder -Dtests.seed=DC3017ADBDFFF73B -Dtests.multiplier=3 -Dtests.slow=true -Dtests.locale=pt-TL -Dtests.timezone=Asia/Barnaul -Dtests.asserts=true -Dtests.file.encoding=UTF-8
   [junit4] ERROR   0.74s J1 | TestParallelWeightCreation.testLTRScoringQueryParallelWeightCreationResultOrder <<<
   [junit4]    > Throwable #1: java.lang.RuntimeException: mismatch: '3'!='4' @ response/docs/[0]/id
   [junit4]    > 	at __randomizedtesting.SeedInfo.seed([DC3017ADBDFFF73B:B97C37CD779D90D3]:0)
   [junit4]    > 	at org.apache.solr.util.RestTestBase.assertJQ(RestTestBase.java:248)
   [junit4]    > 	at org.apache.solr.util.RestTestBase.assertJQ(RestTestBase.java:192)
   [junit4]    > 	at org.apache.solr.ltr.TestParallelWeightCreation.testLTRScoringQueryParallelWeightCreationResultOrder(TestParallelWeightCreation.java:45)
   [junit4]    > 	at java.base/jdk.internal.reflect.NativeMethodAccessorImpl.invoke0(Native Method)
   [junit4]    > 	at java.base/jdk.internal.reflect.NativeMethodAccessorImpl.invoke(NativeMethodAccessorImpl.java:62)
   [junit4]    > 	at java.base/jdk.internal.reflect.DelegatingMethodAccessorImpl.invoke(DelegatingMethodAccessorImpl.java:43)
   [junit4]    > 	at java.base/java.lang.reflect.Method.invoke(Method.java:563)
   [junit4]    > 	at java.base/java.lang.Thread.run(Thread.java:844)
   [junit4]   2> 6740 INFO  (SUITE-TestParallelWeightCreation-seed#[DC3017ADBDFFF73B]-worker) [    ] o.e.j.s.AbstractConnector Stopped ServerConnector@9a38e6d{HTTP/1.1,[http/1.1]}{127.0.0.1:0}
   [junit4]   2> 6740 INFO  (SUITE-TestParallelWeightCreation-seed#[DC3017ADBDFFF73B]-worker) [    ] o.a.s.c.CoreContainer Shutting down CoreContainer instance=2007625029
   [junit4]   2> 6740 INFO  (SUITE-TestParallelWeightCreation-seed#[DC3017ADBDFFF73B]-worker) [    ] o.a.s.m.SolrMetricManager Closing metric reporters for registry=solr.node, tag=null
   [junit4]   2> 6740 INFO  (SUITE-TestParallelWeightCreation-seed#[DC3017ADBDFFF73B]-worker) [    ] o.a.s.m.SolrMetricManager Closing metric reporters for registry=solr.jvm, tag=null
   [junit4]   2> 6740 INFO  (SUITE-TestParallelWeightCreation-seed#[DC3017ADBDFFF73B]-worker) [    ] o.a.s.m.SolrMetricManager Closing metric reporters for registry=solr.jetty, tag=null
   [junit4]   2> 6741 INFO  (SUITE-TestParallelWeightCreation-seed#[DC3017ADBDFFF73B]-worker) [    ] o.a.s.c.TransientSolrCoreCacheDefault Allocating transient cache for 2147483647 transient cores
   [junit4]   2> 6751 INFO  (coreCloseExecutor-77-thread-1) [    ] o.a.s.c.SolrCore [collection1]  CLOSING SolrCore org.apache.solr.core.SolrCore@5ba71fce
   [junit4]   2> 6756 INFO  (coreCloseExecutor-77-thread-1) [    ] o.a.s.m.SolrMetricManager Closing metric reporters for registry=solr.core.collection1, tag=1537679310
   [junit4]   2> 6756 INFO  (SUITE-TestParallelWeightCreation-seed#[DC3017ADBDFFF73B]-worker) [    ] o.e.j.s.h.ContextHandler Stopped o.e.j.s.ServletContextHandler@7a1d62df{/solr,null,UNAVAILABLE}
   [junit4]   2> 6757 INFO  (SUITE-TestParallelWeightCreation-seed#[DC3017ADBDFFF73B]-worker) [    ] o.a.s.SolrTestCaseJ4 ###deleteCore
   [junit4]   2> 6757 INFO  (SUITE-TestParallelWeightCreation-seed#[DC3017ADBDFFF73B]-worker) [    ] o.a.s.c.CoreContainer Shutting down CoreContainer instance=1616854417
   [junit4]   2> 6757 INFO  (SUITE-TestParallelWeightCreation-seed#[DC3017ADBDFFF73B]-worker) [    ] o.a.s.m.SolrMetricManager Closing metric reporters for registry=solr.node, tag=null
   [junit4]   2> 6757 INFO  (SUITE-TestParallelWeightCreation-seed#[DC3017ADBDFFF73B]-worker) [    ] o.a.s.m.SolrMetricManager Closing metric reporters for registry=solr.jvm, tag=null
   [junit4]   2> 6757 INFO  (SUITE-TestParallelWeightCreation-seed#[DC3017ADBDFFF73B]-worker) [    ] o.a.s.m.SolrMetricManager Closing metric reporters for registry=solr.jetty, tag=null
   [junit4]   2> 6757 INFO  (SUITE-TestParallelWeightCreation-seed#[DC3017ADBDFFF73B]-worker) [    ] o.a.s.c.TransientSolrCoreCacheDefault Allocating transient cache for 2147483647 transient cores
   [junit4]   2> 6757 INFO  (coreCloseExecutor-79-thread-1) [    ] o.a.s.c.SolrCore [collection1]  CLOSING SolrCore org.apache.solr.core.SolrCore@76cf30d8
   [junit4]   2> 6758 INFO  (coreCloseExecutor-79-thread-1) [    ] o.a.s.m.SolrMetricManager Closing metric reporters for registry=solr.core.collection1, tag=1993289944
   [junit4]   2> NOTE: leaving temporary files on disk at: /home/jenkins/workspace/Lucene-Solr-master-Linux/solr/build/contrib/solr-ltr/test/J1/temp/solr.ltr.TestParallelWeightCreation_DC3017ADBDFFF73B-001
   [junit4]   2> May 23, 2017 2:35:15 PM com.carrotsearch.randomizedtesting.ThreadLeakControl checkThreadLeaks
   [junit4]   2> WARNING: Will linger awaiting termination of 1 leaked thread(s).
   [junit4]   2> NOTE: test params are: codec=Asserting(Lucene70): {_version_=PostingsFormat(name=Direct), popularity=PostingsFormat(name=Memory), description=PostingsFormat(name=Memory), id=FST50, text=PostingsFormat(name=Memory), title=PostingsFormat(name=Direct)}, docValues:{}, maxPointsInLeafNode=1658, maxMBSortInHeap=5.1868554267762, sim=RandomSimilarity(queryNorm=true): {}, locale=pt-TL, timezone=Asia/Barnaul
   [junit4]   2> NOTE: Linux 4.8.0-52-generic amd64/Oracle Corporation 9-ea (64-bit)/cpus=8,threads=1,free=404579392,total=518979584
   [junit4]   2> NOTE: All tests run in this JVM: [TestModelManager, TestFieldValueFeature, TestParallelWeightCreation]
   [junit4] Completed [23/33 (4!)] on J1 in 10.79s, 2 tests, 1 error <<< FAILURES!

[...truncated 29881 lines...]

Mime
View raw message