lucene-dev mailing list archives

Site index · List index
Message view « Date » · « Thread »
Top « Date » · « Thread »
From Policeman Jenkins Server <jenk...@thetaphi.de>
Subject [JENKINS] Lucene-Solr-6.x-Windows (32bit/jdk1.8.0_121) - Build # 834 - Unstable!
Date Fri, 07 Apr 2017 09:41:11 GMT
Build: https://jenkins.thetaphi.de/job/Lucene-Solr-6.x-Windows/834/
Java: 32bit/jdk1.8.0_121 -client -XX:+UseConcMarkSweepGC

2 tests failed.
FAILED:  junit.framework.TestSuite.org.apache.solr.handler.admin.CoreAdminCreateDiscoverTest

Error Message:
Could not remove the following files (in the order of attempts):    C:\Users\jenkins\workspace\Lucene-Solr-6.x-Windows\solr\build\solr-core\test\J1\temp\solr.handler.admin.CoreAdminCreateDiscoverTest_C26E39E403BB9A3-001\tempDir-001\duplicate: java.nio.file.DirectoryNotEmptyException: C:\Users\jenkins\workspace\Lucene-Solr-6.x-Windows\solr\build\solr-core\test\J1\temp\solr.handler.admin.CoreAdminCreateDiscoverTest_C26E39E403BB9A3-001\tempDir-001\duplicate    C:\Users\jenkins\workspace\Lucene-Solr-6.x-Windows\solr\build\solr-core\test\J1\temp\solr.handler.admin.CoreAdminCreateDiscoverTest_C26E39E403BB9A3-001\tempDir-001: java.nio.file.DirectoryNotEmptyException: C:\Users\jenkins\workspace\Lucene-Solr-6.x-Windows\solr\build\solr-core\test\J1\temp\solr.handler.admin.CoreAdminCreateDiscoverTest_C26E39E403BB9A3-001\tempDir-001    C:\Users\jenkins\workspace\Lucene-Solr-6.x-Windows\solr\build\solr-core\test\J1\temp\solr.handler.admin.CoreAdminCreateDiscoverTest_C26E39E403BB9A3-001\tempDir-001\duplicate\data: java.nio.file.AccessDeniedException: C:\Users\jenkins\workspace\Lucene-Solr-6.x-Windows\solr\build\solr-core\test\J1\temp\solr.handler.admin.CoreAdminCreateDiscoverTest_C26E39E403BB9A3-001\tempDir-001\duplicate\data    C:\Users\jenkins\workspace\Lucene-Solr-6.x-Windows\solr\build\solr-core\test\J1\temp\solr.handler.admin.CoreAdminCreateDiscoverTest_C26E39E403BB9A3-001: java.nio.file.DirectoryNotEmptyException: C:\Users\jenkins\workspace\Lucene-Solr-6.x-Windows\solr\build\solr-core\test\J1\temp\solr.handler.admin.CoreAdminCreateDiscoverTest_C26E39E403BB9A3-001 

Stack Trace:
java.io.IOException: Could not remove the following files (in the order of attempts):
   C:\Users\jenkins\workspace\Lucene-Solr-6.x-Windows\solr\build\solr-core\test\J1\temp\solr.handler.admin.CoreAdminCreateDiscoverTest_C26E39E403BB9A3-001\tempDir-001\duplicate: java.nio.file.DirectoryNotEmptyException: C:\Users\jenkins\workspace\Lucene-Solr-6.x-Windows\solr\build\solr-core\test\J1\temp\solr.handler.admin.CoreAdminCreateDiscoverTest_C26E39E403BB9A3-001\tempDir-001\duplicate
   C:\Users\jenkins\workspace\Lucene-Solr-6.x-Windows\solr\build\solr-core\test\J1\temp\solr.handler.admin.CoreAdminCreateDiscoverTest_C26E39E403BB9A3-001\tempDir-001: java.nio.file.DirectoryNotEmptyException: C:\Users\jenkins\workspace\Lucene-Solr-6.x-Windows\solr\build\solr-core\test\J1\temp\solr.handler.admin.CoreAdminCreateDiscoverTest_C26E39E403BB9A3-001\tempDir-001
   C:\Users\jenkins\workspace\Lucene-Solr-6.x-Windows\solr\build\solr-core\test\J1\temp\solr.handler.admin.CoreAdminCreateDiscoverTest_C26E39E403BB9A3-001\tempDir-001\duplicate\data: java.nio.file.AccessDeniedException: C:\Users\jenkins\workspace\Lucene-Solr-6.x-Windows\solr\build\solr-core\test\J1\temp\solr.handler.admin.CoreAdminCreateDiscoverTest_C26E39E403BB9A3-001\tempDir-001\duplicate\data
   C:\Users\jenkins\workspace\Lucene-Solr-6.x-Windows\solr\build\solr-core\test\J1\temp\solr.handler.admin.CoreAdminCreateDiscoverTest_C26E39E403BB9A3-001: java.nio.file.DirectoryNotEmptyException: C:\Users\jenkins\workspace\Lucene-Solr-6.x-Windows\solr\build\solr-core\test\J1\temp\solr.handler.admin.CoreAdminCreateDiscoverTest_C26E39E403BB9A3-001

	at __randomizedtesting.SeedInfo.seed([C26E39E403BB9A3]:0)
	at org.apache.lucene.util.IOUtils.rm(IOUtils.java:323)
	at org.apache.lucene.util.TestRuleTemporaryFilesCleanup.afterAlways(TestRuleTemporaryFilesCleanup.java:216)
	at com.carrotsearch.randomizedtesting.rules.TestRuleAdapter$1.afterAlways(TestRuleAdapter.java:31)
	at com.carrotsearch.randomizedtesting.rules.StatementAdapter.evaluate(StatementAdapter.java:43)
	at com.carrotsearch.randomizedtesting.rules.StatementAdapter.evaluate(StatementAdapter.java:36)
	at org.apache.lucene.util.TestRuleAssertionsRequired$1.evaluate(TestRuleAssertionsRequired.java:53)
	at org.apache.lucene.util.TestRuleMarkFailure$1.evaluate(TestRuleMarkFailure.java:47)
	at org.apache.lucene.util.TestRuleIgnoreAfterMaxFailures$1.evaluate(TestRuleIgnoreAfterMaxFailures.java:64)
	at org.apache.lucene.util.TestRuleIgnoreTestSuites$1.evaluate(TestRuleIgnoreTestSuites.java:54)
	at com.carrotsearch.randomizedtesting.rules.StatementAdapter.evaluate(StatementAdapter.java:36)
	at com.carrotsearch.randomizedtesting.ThreadLeakControl$StatementRunner.run(ThreadLeakControl.java:368)
	at java.lang.Thread.run(Thread.java:745)


FAILED:  org.apache.solr.update.HardAutoCommitTest.testCommitWithin

Error Message:
Exception during query

Stack Trace:
java.lang.RuntimeException: Exception during query
	at __randomizedtesting.SeedInfo.seed([C26E39E403BB9A3:B6F48CE6C31557B6]:0)
	at org.apache.solr.SolrTestCaseJ4.assertQ(SolrTestCaseJ4.java:881)
	at org.apache.solr.update.HardAutoCommitTest.testCommitWithin(HardAutoCommitTest.java:128)
	at sun.reflect.NativeMethodAccessorImpl.invoke0(Native Method)
	at sun.reflect.NativeMethodAccessorImpl.invoke(NativeMethodAccessorImpl.java:62)
	at sun.reflect.DelegatingMethodAccessorImpl.invoke(DelegatingMethodAccessorImpl.java:43)
	at java.lang.reflect.Method.invoke(Method.java:498)
	at com.carrotsearch.randomizedtesting.RandomizedRunner.invoke(RandomizedRunner.java:1713)
	at com.carrotsearch.randomizedtesting.RandomizedRunner$8.evaluate(RandomizedRunner.java:907)
	at com.carrotsearch.randomizedtesting.RandomizedRunner$9.evaluate(RandomizedRunner.java:943)
	at com.carrotsearch.randomizedtesting.RandomizedRunner$10.evaluate(RandomizedRunner.java:957)
	at com.carrotsearch.randomizedtesting.rules.SystemPropertiesRestoreRule$1.evaluate(SystemPropertiesRestoreRule.java:57)
	at org.apache.lucene.util.TestRuleSetupTeardownChained$1.evaluate(TestRuleSetupTeardownChained.java:49)
	at org.apache.lucene.util.AbstractBeforeAfterRule$1.evaluate(AbstractBeforeAfterRule.java:45)
	at org.apache.lucene.util.TestRuleThreadAndTestName$1.evaluate(TestRuleThreadAndTestName.java:48)
	at org.apache.lucene.util.TestRuleIgnoreAfterMaxFailures$1.evaluate(TestRuleIgnoreAfterMaxFailures.java:64)
	at org.apache.lucene.util.TestRuleMarkFailure$1.evaluate(TestRuleMarkFailure.java:47)
	at com.carrotsearch.randomizedtesting.rules.StatementAdapter.evaluate(StatementAdapter.java:36)
	at com.carrotsearch.randomizedtesting.ThreadLeakControl$StatementRunner.run(ThreadLeakControl.java:368)
	at com.carrotsearch.randomizedtesting.ThreadLeakControl.forkTimeoutingTask(ThreadLeakControl.java:817)
	at com.carrotsearch.randomizedtesting.ThreadLeakControl$3.evaluate(ThreadLeakControl.java:468)
	at com.carrotsearch.randomizedtesting.RandomizedRunner.runSingleTest(RandomizedRunner.java:916)
	at com.carrotsearch.randomizedtesting.RandomizedRunner$5.evaluate(RandomizedRunner.java:802)
	at com.carrotsearch.randomizedtesting.RandomizedRunner$6.evaluate(RandomizedRunner.java:852)
	at com.carrotsearch.randomizedtesting.RandomizedRunner$7.evaluate(RandomizedRunner.java:863)
	at com.carrotsearch.randomizedtesting.rules.StatementAdapter.evaluate(StatementAdapter.java:36)
	at com.carrotsearch.randomizedtesting.rules.SystemPropertiesRestoreRule$1.evaluate(SystemPropertiesRestoreRule.java:57)
	at org.apache.lucene.util.AbstractBeforeAfterRule$1.evaluate(AbstractBeforeAfterRule.java:45)
	at com.carrotsearch.randomizedtesting.rules.StatementAdapter.evaluate(StatementAdapter.java:36)
	at org.apache.lucene.util.TestRuleStoreClassName$1.evaluate(TestRuleStoreClassName.java:41)
	at com.carrotsearch.randomizedtesting.rules.NoShadowingOrOverridesOnMethodsRule$1.evaluate(NoShadowingOrOverridesOnMethodsRule.java:40)
	at com.carrotsearch.randomizedtesting.rules.NoShadowingOrOverridesOnMethodsRule$1.evaluate(NoShadowingOrOverridesOnMethodsRule.java:40)
	at com.carrotsearch.randomizedtesting.rules.StatementAdapter.evaluate(StatementAdapter.java:36)
	at com.carrotsearch.randomizedtesting.rules.StatementAdapter.evaluate(StatementAdapter.java:36)
	at com.carrotsearch.randomizedtesting.rules.StatementAdapter.evaluate(StatementAdapter.java:36)
	at org.apache.lucene.util.TestRuleAssertionsRequired$1.evaluate(TestRuleAssertionsRequired.java:53)
	at org.apache.lucene.util.TestRuleMarkFailure$1.evaluate(TestRuleMarkFailure.java:47)
	at org.apache.lucene.util.TestRuleIgnoreAfterMaxFailures$1.evaluate(TestRuleIgnoreAfterMaxFailures.java:64)
	at org.apache.lucene.util.TestRuleIgnoreTestSuites$1.evaluate(TestRuleIgnoreTestSuites.java:54)
	at com.carrotsearch.randomizedtesting.rules.StatementAdapter.evaluate(StatementAdapter.java:36)
	at com.carrotsearch.randomizedtesting.ThreadLeakControl$StatementRunner.run(ThreadLeakControl.java:368)
	at java.lang.Thread.run(Thread.java:745)
Caused by: java.lang.RuntimeException: REQUEST FAILED: xpath=//result[@numFound=1]
	xml response was: <?xml version="1.0" encoding="UTF-8"?>
<response>
<lst name="responseHeader"><int name="status">0</int><int name="QTime">0</int></lst><result name="response" numFound="0" start="0"></result>
</response>

	request was:q=id:530&qt=standard&start=0&rows=20&version=2.2
	at org.apache.solr.SolrTestCaseJ4.assertQ(SolrTestCaseJ4.java:874)
	... 40 more




Build Log:
[...truncated 11279 lines...]
   [junit4] Suite: org.apache.solr.update.HardAutoCommitTest
   [junit4]   2> Creating dataDir: C:\Users\jenkins\workspace\Lucene-Solr-6.x-Windows\solr\build\solr-core\test\J0\temp\solr.update.HardAutoCommitTest_C26E39E403BB9A3-001\init-core-data-001
   [junit4]   2> 692938 WARN  (SUITE-HardAutoCommitTest-seed#[C26E39E403BB9A3]-worker) [    ] o.a.s.SolrTestCaseJ4 startTrackingSearchers: numOpens=2 numCloses=2
   [junit4]   2> 692938 INFO  (SUITE-HardAutoCommitTest-seed#[C26E39E403BB9A3]-worker) [    ] o.a.s.SolrTestCaseJ4 Using PointFields
   [junit4]   2> 692945 INFO  (SUITE-HardAutoCommitTest-seed#[C26E39E403BB9A3]-worker) [    ] o.a.s.SolrTestCaseJ4 Randomized ssl (false) and clientAuth (false) via: @org.apache.solr.util.RandomizeSSL(reason=, value=NaN, ssl=NaN, clientAuth=NaN)
   [junit4]   2> 692946 INFO  (SUITE-HardAutoCommitTest-seed#[C26E39E403BB9A3]-worker) [    ] o.a.s.SolrTestCaseJ4 ####initCore
   [junit4]   2> 692947 INFO  (SUITE-HardAutoCommitTest-seed#[C26E39E403BB9A3]-worker) [    ] o.a.s.c.SolrResourceLoader [null] Added 2 libs to classloader, from paths: [/C:/Users/jenkins/workspace/Lucene-Solr-6.x-Windows/solr/core/src/test-files/solr/collection1/lib, /C:/Users/jenkins/workspace/Lucene-Solr-6.x-Windows/solr/core/src/test-files/solr/collection1/lib/classes]
   [junit4]   2> 693074 INFO  (SUITE-HardAutoCommitTest-seed#[C26E39E403BB9A3]-worker) [    ] o.a.s.c.SolrConfig Using Lucene MatchVersion: 6.6.0
   [junit4]   2> 693142 INFO  (SUITE-HardAutoCommitTest-seed#[C26E39E403BB9A3]-worker) [    ] o.a.s.s.IndexSchema [null] Schema name=test
   [junit4]   2> 693390 WARN  (SUITE-HardAutoCommitTest-seed#[C26E39E403BB9A3]-worker) [    ] o.a.s.s.IndexSchema [null] default search field in schema is text. WARNING: Deprecated, please use 'df' on request instead.
   [junit4]   2> 693396 INFO  (SUITE-HardAutoCommitTest-seed#[C26E39E403BB9A3]-worker) [    ] o.a.s.s.IndexSchema Loaded schema test/1.0 with uniqueid field id
   [junit4]   2> 693435 INFO  (SUITE-HardAutoCommitTest-seed#[C26E39E403BB9A3]-worker) [    ] o.a.s.u.UpdateShardHandler Creating UpdateShardHandler HTTP client with params: socketTimeout=30000&connTimeout=30000&retry=true
   [junit4]   2> 693577 WARN  (SUITE-HardAutoCommitTest-seed#[C26E39E403BB9A3]-worker) [    ] o.a.s.m.r.SolrJmxReporter No serviceUrl or agentId was configured, using first MBeanServer.
   [junit4]   2> 693588 INFO  (SUITE-HardAutoCommitTest-seed#[C26E39E403BB9A3]-worker) [    ] o.a.s.m.r.SolrJmxReporter JMX monitoring enabled at server: com.sun.jmx.mbeanserver.JmxMBeanServer@9b7e05
   [junit4]   2> 693588 WARN  (SUITE-HardAutoCommitTest-seed#[C26E39E403BB9A3]-worker) [    ] o.a.s.m.r.SolrJmxReporter No serviceUrl or agentId was configured, using first MBeanServer.
   [junit4]   2> 693593 INFO  (SUITE-HardAutoCommitTest-seed#[C26E39E403BB9A3]-worker) [    ] o.a.s.m.r.SolrJmxReporter JMX monitoring enabled at server: com.sun.jmx.mbeanserver.JmxMBeanServer@9b7e05
   [junit4]   2> 693594 WARN  (SUITE-HardAutoCommitTest-seed#[C26E39E403BB9A3]-worker) [    ] o.a.s.m.r.SolrJmxReporter No serviceUrl or agentId was configured, using first MBeanServer.
   [junit4]   2> 693594 INFO  (SUITE-HardAutoCommitTest-seed#[C26E39E403BB9A3]-worker) [    ] o.a.s.m.r.SolrJmxReporter JMX monitoring enabled at server: com.sun.jmx.mbeanserver.JmxMBeanServer@9b7e05
   [junit4]   2> 693606 INFO  (coreLoadExecutor-1982-thread-1) [    x:collection1] o.a.s.c.SolrResourceLoader [null] Added 2 libs to classloader, from paths: [/C:/Users/jenkins/workspace/Lucene-Solr-6.x-Windows/solr/core/src/test-files/solr/collection1/lib, /C:/Users/jenkins/workspace/Lucene-Solr-6.x-Windows/solr/core/src/test-files/solr/collection1/lib/classes]
   [junit4]   2> 693725 INFO  (coreLoadExecutor-1982-thread-1) [    x:collection1] o.a.s.c.SolrConfig Using Lucene MatchVersion: 6.6.0
   [junit4]   2> 693788 INFO  (coreLoadExecutor-1982-thread-1) [    x:collection1] o.a.s.s.IndexSchema [collection1] Schema name=test
   [junit4]   2> 694028 WARN  (coreLoadExecutor-1982-thread-1) [    x:collection1] o.a.s.s.IndexSchema [collection1] default search field in schema is text. WARNING: Deprecated, please use 'df' on request instead.
   [junit4]   2> 694036 INFO  (coreLoadExecutor-1982-thread-1) [    x:collection1] o.a.s.s.IndexSchema Loaded schema test/1.0 with uniqueid field id
   [junit4]   2> 694061 INFO  (coreLoadExecutor-1982-thread-1) [    x:collection1] o.a.s.c.CoreContainer Creating SolrCore 'collection1' using configuration from instancedir C:\Users\jenkins\workspace\Lucene-Solr-6.x-Windows\solr\core\src\test-files\solr\collection1, trusted=true
   [junit4]   2> 694062 WARN  (coreLoadExecutor-1982-thread-1) [    x:collection1] o.a.s.m.r.SolrJmxReporter No serviceUrl or agentId was configured, using first MBeanServer.
   [junit4]   2> 694062 INFO  (coreLoadExecutor-1982-thread-1) [    x:collection1] o.a.s.m.r.SolrJmxReporter JMX monitoring enabled at server: com.sun.jmx.mbeanserver.JmxMBeanServer@9b7e05
   [junit4]   2> 694062 INFO  (coreLoadExecutor-1982-thread-1) [    x:collection1] o.a.s.c.SolrCore solr.RecoveryStrategy.Builder
   [junit4]   2> 694062 INFO  (coreLoadExecutor-1982-thread-1) [    x:collection1] o.a.s.c.SolrCore [[collection1] ] Opening new SolrCore at [C:\Users\jenkins\workspace\Lucene-Solr-6.x-Windows\solr\core\src\test-files\solr\collection1], dataDir=[C:\Users\jenkins\workspace\Lucene-Solr-6.x-Windows\solr\build\solr-core\test\J0\temp\solr.update.HardAutoCommitTest_C26E39E403BB9A3-001\init-core-data-001\]
   [junit4]   2> 694065 INFO  (coreLoadExecutor-1982-thread-1) [    x:collection1] o.a.s.c.JmxMonitoredMap JMX monitoring is enabled. Adding Solr mbeans to JMX Server: com.sun.jmx.mbeanserver.JmxMBeanServer@9b7e05
   [junit4]   2> 694068 INFO  (coreLoadExecutor-1982-thread-1) [    x:collection1] o.a.s.u.RandomMergePolicy RandomMergePolicy wrapping class org.apache.lucene.index.TieredMergePolicy: [TieredMergePolicy: maxMergeAtOnce=43, maxMergeAtOnceExplicit=45, maxMergedSegmentMB=37.4677734375, floorSegmentMB=0.5380859375, forceMergeDeletesPctAllowed=11.376217041906436, segmentsPerTier=17.0, maxCFSSegmentSizeMB=8.796093022207999E12, noCFSRatio=1.0
   [junit4]   2> 694318 INFO  (coreLoadExecutor-1982-thread-1) [    x:collection1] o.a.s.u.UpdateHandler Using UpdateLog implementation: org.apache.solr.update.UpdateLog
   [junit4]   2> 694318 INFO  (coreLoadExecutor-1982-thread-1) [    x:collection1] o.a.s.u.UpdateLog Initializing UpdateLog: dataDir= defaultSyncLevel=FLUSH numRecordsToKeep=100 maxNumLogsToKeep=10 numVersionBuckets=65536
   [junit4]   2> 694321 INFO  (coreLoadExecutor-1982-thread-1) [    x:collection1] o.a.s.u.CommitTracker Hard AutoCommit: disabled
   [junit4]   2> 694321 INFO  (coreLoadExecutor-1982-thread-1) [    x:collection1] o.a.s.u.CommitTracker Soft AutoCommit: disabled
   [junit4]   2> 694325 INFO  (coreLoadExecutor-1982-thread-1) [    x:collection1] o.a.s.u.RandomMergePolicy RandomMergePolicy wrapping class org.apache.lucene.index.AlcoholicMergePolicy: [AlcoholicMergePolicy: minMergeSize=0, mergeFactor=10, maxMergeSize=1759633910, maxMergeSizeForForcedMerge=9223372036854775807, calibrateSizeByDeletes=true, maxMergeDocs=2147483647, maxCFSSegmentSizeMB=8.796093022207999E12, noCFSRatio=0.1]
   [junit4]   2> 694327 INFO  (coreLoadExecutor-1982-thread-1) [    x:collection1] o.a.s.s.SolrIndexSearcher Opening [Searcher@1910eb[collection1] main]
   [junit4]   2> 694328 INFO  (coreLoadExecutor-1982-thread-1) [    x:collection1] o.a.s.h.c.SpellCheckComponent Initializing spell checkers
   [junit4]   2> 694340 INFO  (coreLoadExecutor-1982-thread-1) [    x:collection1] o.a.s.s.DirectSolrSpellChecker init: {name=direct,classname=DirectSolrSpellChecker,field=lowerfilt,minQueryLength=3}
   [junit4]   2> 694410 INFO  (coreLoadExecutor-1982-thread-1) [    x:collection1] o.a.s.h.ReplicationHandler Commits will be reserved for  10000
   [junit4]   2> 694413 INFO  (searcherExecutor-1983-thread-1-processing-x:collection1) [    x:collection1] o.a.s.h.c.SpellCheckComponent Loading spell index for spellchecker: default
   [junit4]   2> 694414 INFO  (searcherExecutor-1983-thread-1-processing-x:collection1) [    x:collection1] o.a.s.h.c.SpellCheckComponent Loading spell index for spellchecker: direct
   [junit4]   2> 694414 INFO  (searcherExecutor-1983-thread-1-processing-x:collection1) [    x:collection1] o.a.s.h.c.SpellCheckComponent Loading spell index for spellchecker: wordbreak
   [junit4]   2> 694414 INFO  (searcherExecutor-1983-thread-1-processing-x:collection1) [    x:collection1] o.a.s.h.c.SpellCheckComponent Loading spell index for spellchecker: multipleFields
   [junit4]   2> 694414 INFO  (searcherExecutor-1983-thread-1-processing-x:collection1) [    x:collection1] o.a.s.h.c.SpellCheckComponent Loading spell index for spellchecker: jarowinkler
   [junit4]   2> 694415 INFO  (searcherExecutor-1983-thread-1-processing-x:collection1) [    x:collection1] o.a.s.h.c.SpellCheckComponent Loading spell index for spellchecker: external
   [junit4]   2> 694416 INFO  (searcherExecutor-1983-thread-1-processing-x:collection1) [    x:collection1] o.a.s.h.c.SpellCheckComponent Loading spell index for spellchecker: freq
   [junit4]   2> 694418 INFO  (searcherExecutor-1983-thread-1-processing-x:collection1) [    x:collection1] o.a.s.h.c.SpellCheckComponent Loading spell index for spellchecker: fqcn
   [junit4]   2> 694418 INFO  (searcherExecutor-1983-thread-1-processing-x:collection1) [    x:collection1] o.a.s.h.c.SpellCheckComponent Loading spell index for spellchecker: perDict
   [junit4]   2> 694421 INFO  (searcherExecutor-1983-thread-1-processing-x:collection1) [    x:collection1] o.a.s.c.SolrCore [collection1] Registered new searcher Searcher@1910eb[collection1] main{ExitableDirectoryReader(UninvertingDirectoryReader())}
   [junit4]   2> 694422 INFO  (coreLoadExecutor-1982-thread-1) [    x:collection1] o.a.s.c.TransientSolrCoreCacheDefault Allocating transient cache for 2147483647 transient cores
   [junit4]   2> 694427 INFO  (coreLoadExecutor-1982-thread-1) [    x:collection1] o.a.s.u.UpdateLog Could not find max version in index or recent updates, using new clock 1564007441598775296
   [junit4]   2> 694438 INFO  (SUITE-HardAutoCommitTest-seed#[C26E39E403BB9A3]-worker) [    ] o.a.s.SolrTestCaseJ4 ####initCore end
   [junit4]   2> 694446 INFO  (TEST-HardAutoCommitTest.testCommitWithin-seed#[C26E39E403BB9A3]) [    ] o.a.s.SolrTestCaseJ4 ###Starting testCommitWithin
   [junit4]   2> 694446 INFO  (TEST-HardAutoCommitTest.testCommitWithin-seed#[C26E39E403BB9A3]) [    ] o.a.s.u.DirectUpdateHandler2 [collection1] REMOVING ALL DOCUMENTS FROM INDEX
   [junit4]   2> 694447 INFO  (TEST-HardAutoCommitTest.testCommitWithin-seed#[C26E39E403BB9A3]) [    ] o.a.s.s.SolrIndexSearcher Opening [Searcher@1618e6e[collection1] realtime]
   [junit4]   2> 694447 INFO  (TEST-HardAutoCommitTest.testCommitWithin-seed#[C26E39E403BB9A3]) [    ] o.a.s.u.p.LogUpdateProcessorFactory [collection1]  webapp=null path=null params={_version_=-9223372036854775807&update.distrib=FROMLEADER&versions=true&wt=json&indent=true}{deleteByQuery=*:* (-9223372036854775807)} 0 1
   [junit4]   2> 694449 INFO  (TEST-HardAutoCommitTest.testCommitWithin-seed#[C26E39E403BB9A3]) [    ] o.a.s.c.SolrResourceLoader [null] Added 2 libs to classloader, from paths: [/C:/Users/jenkins/workspace/Lucene-Solr-6.x-Windows/solr/core/src/test-files/solr/collection1/lib, /C:/Users/jenkins/workspace/Lucene-Solr-6.x-Windows/solr/core/src/test-files/solr/collection1/lib/classes]
   [junit4]   2> 694595 INFO  (TEST-HardAutoCommitTest.testCommitWithin-seed#[C26E39E403BB9A3]) [    ] o.a.s.c.SolrConfig Using Lucene MatchVersion: 6.6.0
   [junit4]   2> 694672 INFO  (TEST-HardAutoCommitTest.testCommitWithin-seed#[C26E39E403BB9A3]) [    ] o.a.s.s.IndexSchema [collection1] Schema name=test
   [junit4]   2> 694948 WARN  (TEST-HardAutoCommitTest.testCommitWithin-seed#[C26E39E403BB9A3]) [    ] o.a.s.s.IndexSchema [collection1] default search field in schema is text. WARNING: Deprecated, please use 'df' on request instead.
   [junit4]   2> 694952 INFO  (TEST-HardAutoCommitTest.testCommitWithin-seed#[C26E39E403BB9A3]) [    ] o.a.s.s.IndexSchema Loaded schema test/1.0 with uniqueid field id
   [junit4]   2> 694977 INFO  (TEST-HardAutoCommitTest.testCommitWithin-seed#[C26E39E403BB9A3]) [    ] o.a.s.c.CoreContainer Reloading SolrCore 'collection1' using configuration from instancedir C:\Users\jenkins\workspace\Lucene-Solr-6.x-Windows\solr\core\src\test-files\solr\collection1
   [junit4]   2> 694979 WARN  (TEST-HardAutoCommitTest.testCommitWithin-seed#[C26E39E403BB9A3]) [    x:collection1] o.a.s.m.r.SolrJmxReporter No serviceUrl or agentId was configured, using first MBeanServer.
   [junit4]   2> 695003 INFO  (TEST-HardAutoCommitTest.testCommitWithin-seed#[C26E39E403BB9A3]) [    x:collection1] o.a.s.m.r.SolrJmxReporter JMX monitoring enabled at server: com.sun.jmx.mbeanserver.JmxMBeanServer@9b7e05
   [junit4]   2> 695004 INFO  (TEST-HardAutoCommitTest.testCommitWithin-seed#[C26E39E403BB9A3]) [    x:collection1] o.a.s.m.SolrMetricManager Replacing existing reporter 'default' in registry 'solr.core.collection1': [org.apache.solr.metrics.reporters.SolrJmxReporter@1f0843a: domain = solr.core.collection1, service url = null, agent id = null]
   [junit4]   2> 695019 INFO  (TEST-HardAutoCommitTest.testCommitWithin-seed#[C26E39E403BB9A3]) [    x:collection1] o.a.s.c.SolrCore [[collection1] ] Opening new SolrCore at [C:\Users\jenkins\workspace\Lucene-Solr-6.x-Windows\solr\core\src\test-files\solr\collection1], dataDir=[C:\Users\jenkins\workspace\Lucene-Solr-6.x-Windows\solr\build\solr-core\test\J0\temp\solr.update.HardAutoCommitTest_C26E39E403BB9A3-001\init-core-data-001\]
   [junit4]   2> 695024 INFO  (TEST-HardAutoCommitTest.testCommitWithin-seed#[C26E39E403BB9A3]) [    x:collection1] o.a.s.c.JmxMonitoredMap JMX monitoring is enabled. Adding Solr mbeans to JMX Server: com.sun.jmx.mbeanserver.JmxMBeanServer@9b7e05
   [junit4]   2> 695265 INFO  (TEST-HardAutoCommitTest.testCommitWithin-seed#[C26E39E403BB9A3]) [    x:collection1] o.a.s.u.CommitTracker Hard AutoCommit: disabled
   [junit4]   2> 695266 INFO  (TEST-HardAutoCommitTest.testCommitWithin-seed#[C26E39E403BB9A3]) [    x:collection1] o.a.s.u.CommitTracker Soft AutoCommit: disabled
   [junit4]   2> 695268 INFO  (TEST-HardAutoCommitTest.testCommitWithin-seed#[C26E39E403BB9A3]) [    x:collection1] o.a.s.s.SolrIndexSearcher Opening [Searcher@12c9790[collection1] main]
   [junit4]   2> 695270 INFO  (TEST-HardAutoCommitTest.testCommitWithin-seed#[C26E39E403BB9A3]) [    x:collection1] o.a.s.h.c.SpellCheckComponent Initializing spell checkers
   [junit4]   2> 695273 INFO  (TEST-HardAutoCommitTest.testCommitWithin-seed#[C26E39E403BB9A3]) [    x:collection1] o.a.s.s.DirectSolrSpellChecker init: {name=direct,classname=DirectSolrSpellChecker,field=lowerfilt,minQueryLength=3}
   [junit4]   2> 695289 INFO  (TEST-HardAutoCommitTest.testCommitWithin-seed#[C26E39E403BB9A3]) [    x:collection1] o.a.s.h.ReplicationHandler Commits will be reserved for  10000
   [junit4]   2> 695289 INFO  (searcherExecutor-1988-thread-1-processing-x:collection1) [    x:collection1] o.a.s.h.c.SpellCheckComponent Loading spell index for spellchecker: default
   [junit4]   2> 695290 INFO  (searcherExecutor-1988-thread-1-processing-x:collection1) [    x:collection1] o.a.s.h.c.SpellCheckComponent Loading spell index for spellchecker: direct
   [junit4]   2> 695290 INFO  (searcherExecutor-1988-thread-1-processing-x:collection1) [    x:collection1] o.a.s.h.c.SpellCheckComponent Loading spell index for spellchecker: wordbreak
   [junit4]   2> 695290 INFO  (searcherExecutor-1988-thread-1-processing-x:collection1) [    x:collection1] o.a.s.h.c.SpellCheckComponent Loading spell index for spellchecker: multipleFields
   [junit4]   2> 695290 INFO  (searcherExecutor-1988-thread-1-processing-x:collection1) [    x:collection1] o.a.s.h.c.SpellCheckComponent Loading spell index for spellchecker: jarowinkler
   [junit4]   2> 695291 INFO  (searcherExecutor-1988-thread-1-processing-x:collection1) [    x:collection1] o.a.s.h.c.SpellCheckComponent Loading spell index for spellchecker: external
   [junit4]   2> 695291 INFO  (searcherExecutor-1988-thread-1-processing-x:collection1) [    x:collection1] o.a.s.h.c.SpellCheckComponent Loading spell index for spellchecker: freq
   [junit4]   2> 695292 INFO  (searcherExecutor-1988-thread-1-processing-x:collection1) [    x:collection1] o.a.s.h.c.SpellCheckComponent Loading spell index for spellchecker: fqcn
   [junit4]   2> 695293 INFO  (searcherExecutor-1988-thread-1-processing-x:collection1) [    x:collection1] o.a.s.h.c.SpellCheckComponent Loading spell index for spellchecker: perDict
   [junit4]   2> 695302 INFO  (searcherExecutor-1988-thread-1-processing-x:collection1) [    x:collection1] o.a.s.c.SolrCore [collection1] Registered new searcher Searcher@12c9790[collection1] main{ExitableDirectoryReader(UninvertingDirectoryReader())}
   [junit4]   2> 695306 INFO  (TEST-HardAutoCommitTest.testCommitWithin-seed#[C26E39E403BB9A3]) [    x:collection1] o.a.s.u.UpdateLog Could not find max version in index or recent updates, using new clock 1564007442520473600
   [junit4]   2> 695310 INFO  (TEST-HardAutoCommitTest.testCommitWithin-seed#[C26E39E403BB9A3]) [    x:collection1] o.a.s.u.RandomMergePolicy RandomMergePolicy wrapping class org.apache.lucene.index.TieredMergePolicy: [TieredMergePolicy: maxMergeAtOnce=49, maxMergeAtOnceExplicit=40, maxMergedSegmentMB=94.5888671875, floorSegmentMB=0.630859375, forceMergeDeletesPctAllowed=7.3446618803440336, segmentsPerTier=13.0, maxCFSSegmentSizeMB=8.796093022207999E12, noCFSRatio=0.7857292629012697
   [junit4]   2> 695310 INFO  (TEST-HardAutoCommitTest.testCommitWithin-seed#[C26E39E403BB9A3]) [    x:collection1] o.a.s.u.DefaultSolrCoreState New IndexWriter is ready to be used.
   [junit4]   2> 695312 INFO  (TEST-HardAutoCommitTest.testCommitWithin-seed#[C26E39E403BB9A3]) [    x:collection1] o.a.s.s.SolrIndexSearcher Opening [Searcher@10d0a45[collection1] main]
   [junit4]   2> 695316 INFO  (TEST-HardAutoCommitTest.testCommitWithin-seed#[C26E39E403BB9A3]) [    x:collection1] o.a.s.c.SolrCore [collection1]  CLOSING SolrCore org.apache.solr.core.SolrCore@81e9a3
   [junit4]   2> 695319 INFO  (searcherExecutor-1988-thread-1-processing-x:collection1) [    x:collection1] o.a.s.c.SolrCore [collection1] Registered new searcher Searcher@10d0a45[collection1] main{ExitableDirectoryReader(UninvertingDirectoryReader())}
   [junit4]   2> 695496 INFO  (TEST-HardAutoCommitTest.testCommitWithin-seed#[C26E39E403BB9A3]) [    x:collection1] o.a.s.m.SolrMetricManager Closing metric reporters for: solr.core.collection1
   [junit4]   2> 695513 INFO  (TEST-HardAutoCommitTest.testCommitWithin-seed#[C26E39E403BB9A3]) [    x:collection1] o.a.s.u.p.LogUpdateProcessorFactory [collection1] {add=[529 (1564007442732285952)]} 0 8
   [junit4]   2> 695514 INFO  (TEST-HardAutoCommitTest.testCommitWithin-seed#[C26E39E403BB9A3]) [    x:collection1] o.a.s.c.S.Request [collection1]  webapp=null path=null params={q=id:529&qt=standard&start=0&rows=20&version=2.2} hits=0 status=0 QTime=0
   [junit4]   2> 697514 INFO  (commitScheduler-1990-thread-1) [    x:collection1] o.a.s.u.DirectUpdateHandler2 start commit{,optimize=false,openSearcher=true,waitSearcher=true,expungeDeletes=false,softCommit=false,prepareCommit=false}
   [junit4]   2> 697514 INFO  (commitScheduler-1990-thread-1) [    x:collection1] o.a.s.u.SolrIndexWriter Calling setCommitData with IW:org.apache.solr.update.SolrIndexWriter@df64de
   [junit4]   2> 697528 INFO  (commitScheduler-1990-thread-1) [    x:collection1] o.a.s.s.SolrIndexSearcher Opening [Searcher@18d8991[collection1] main]
   [junit4]   2> 697530 INFO  (commitScheduler-1990-thread-1) [    x:collection1] o.a.s.u.DirectUpdateHandler2 end_commit_flush
   [junit4]   2> 697537 INFO  (searcherExecutor-1988-thread-1-processing-x:collection1) [    x:collection1] o.a.s.c.SolrCore [collection1] Registered new searcher Searcher@18d8991[collection1] main{ExitableDirectoryReader(UninvertingDirectoryReader(Uninverting(_0(6.6.0):C1)))}
   [junit4]   2> 697786 INFO  (TEST-HardAutoCommitTest.testCommitWithin-seed#[C26E39E403BB9A3]) [    x:collection1] o.a.s.u.p.LogUpdateProcessorFactory [collection1] {add=[530 (1564007445113602048)]} 0 2280
   [junit4]   2> 697786 INFO  (TEST-HardAutoCommitTest.testCommitWithin-seed#[C26E39E403BB9A3]) [    x:collection1] o.a.s.c.S.Request [collection1]  webapp=null path=null params={q=id:530&qt=standard&start=0&rows=20&version=2.2} hits=0 status=0 QTime=0
   [junit4]   2> 697788 INFO  (TEST-HardAutoCommitTest.testCommitWithin-seed#[C26E39E403BB9A3]) [    x:collection1] o.a.s.u.p.LogUpdateProcessorFactory [collection1] {delete=[529 (-1564007445123039232)]} 0 2283
   [junit4]   2> 697788 INFO  (TEST-HardAutoCommitTest.testCommitWithin-seed#[C26E39E403BB9A3]) [    x:collection1] o.a.s.c.S.Request [collection1]  webapp=null path=null params={q=id:529&qt=standard&start=0&rows=20&version=2.2} hits=1 status=0 QTime=0
   [junit4]   2> 698789 INFO  (commitScheduler-1990-thread-1) [    x:collection1] o.a.s.u.DirectUpdateHandler2 start commit{,optimize=false,openSearcher=true,waitSearcher=true,expungeDeletes=false,softCommit=false,prepareCommit=false}
   [junit4]   2> 698789 INFO  (commitScheduler-1990-thread-1) [    x:collection1] o.a.s.u.SolrIndexWriter Calling setCommitData with IW:org.apache.solr.update.SolrIndexWriter@df64de
   [junit4]   2> 698802 INFO  (commitScheduler-1990-thread-1) [    x:collection1] o.a.s.s.SolrIndexSearcher Opening [Searcher@fa2626[collection1] main]
   [junit4]   2> 698804 INFO  (commitScheduler-1990-thread-1) [    x:collection1] o.a.s.u.DirectUpdateHandler2 end_commit_flush
   [junit4]   2> 698811 INFO  (searcherExecutor-1988-thread-1-processing-x:collection1) [    x:collection1] o.a.s.c.SolrCore [collection1] Registered new searcher Searcher@fa2626[collection1] main{ExitableDirectoryReader(UninvertingDirectoryReader(Uninverting(_1(6.6.0):C1)))}
   [junit4]   2> 699042 INFO  (TEST-HardAutoCommitTest.testCommitWithin-seed#[C26E39E403BB9A3]) [    x:collection1] o.a.s.c.S.Request [collection1]  webapp=null path=null params={q=id:529&qt=standard&start=0&rows=20&version=2.2} hits=0 status=0 QTime=0
   [junit4]   2> 699044 INFO  (TEST-HardAutoCommitTest.testCommitWithin-seed#[C26E39E403BB9A3]) [    x:collection1] o.a.s.c.S.Request [collection1]  webapp=null path=null params={q=id:530&qt=standard&start=0&rows=20&version=2.2} hits=1 status=0 QTime=0
   [junit4]   2> 699048 INFO  (TEST-HardAutoCommitTest.testCommitWithin-seed#[C26E39E403BB9A3]) [    x:collection1] o.a.s.u.p.LogUpdateProcessorFactory [collection1] {add=[500 (1564007446441099264)]} 0 3543
   [junit4]   2> 699048 INFO  (TEST-HardAutoCommitTest.testCommitWithin-seed#[C26E39E403BB9A3]) [    x:collection1] o.a.s.u.p.LogUpdateProcessorFactory [collection1] {add=[500 (1564007446444244992)]} 0 3544
   [junit4]   2> 699050 INFO  (TEST-HardAutoCommitTest.testCommitWithin-seed#[C26E39E403BB9A3]) [    x:collection1] o.a.s.u.p.LogUpdateProcessorFactory [collection1] {add=[500 (1564007446445293568)]} 0 3544
   [junit4]   2> 699050 INFO  (TEST-HardAutoCommitTest.testCommitWithin-seed#[C26E39E403BB9A3]) [    x:collection1] o.a.s.u.p.LogUpdateProcessorFactory [collection1] {add=[500 (1564007446446342144)]} 0 3545
   [junit4]   2> 699051 INFO  (TEST-HardAutoCommitTest.testCommitWithin-seed#[C26E39E403BB9A3]) [    x:collection1] o.a.s.u.p.LogUpdateProcessorFactory [collection1] {add=[500 (1564007446446342145)]} 0 3546
   [junit4]   2> 699051 INFO  (TEST-HardAutoCommitTest.testCommitWithin-seed#[C26E39E403BB9A3]) [    x:collection1] o.a.s.u.p.LogUpdateProcessorFactory [collection1] {add=[500 (1564007446447390720)]} 0 3546
   [junit4]   2> 699052 INFO  (TEST-HardAutoCommitTest.testCommitWithin-seed#[C26E39E403BB9A3]) [    x:collection1] o.a.s.u.p.LogUpdateProcessorFactory [collection1] {add=[500 (1564007446447390721)]} 0 3547
   [junit4]   2> 699052 INFO  (TEST-HardAutoCommitTest.testCommitWithin-seed#[C26E39E403BB9A3]) [    x:collection1] o.a.s.u.p.LogUpdateProcessorFactory [collection1] {add=[500 (1564007446448439296)]} 0 3548
   [junit4]   2> 699053 INFO  (TEST-HardAutoCommitTest.testCommitWithin-seed#[C26E39E403BB9A3]) [    x:collection1] o.a.s.u.p.LogUpdateProcessorFactory [collection1] {add=[500 (1564007446448439297)]} 0 3548
   [junit4]   2> 699054 INFO  (TEST-HardAutoCommitTest.testCommitWithin-seed#[C26E39E403BB9A3]) [    x:collection1] o.a.s.u.p.LogUpdateProcessorFactory [collection1] {add=[500 (1564007446449487872)]} 0 3549
   [junit4]   2> 699055 INFO  (TEST-HardAutoCommitTest.testCommitWithin-seed#[C26E39E403BB9A3]) [    x:collection1] o.a.s.c.S.Request [collection1]  webapp=null path=null params={q=id:500&qt=standard&start=0&rows=20&version=2.2} hits=0 status=0 QTime=0
   [junit4]   2> 699056 INFO  (TEST-HardAutoCommitTest.testCommitWithin-seed#[C26E39E403BB9A3]) [    x:collection1] o.a.s.u.p.LogUpdateProcessorFactory [collection1] {delete=[530 (-1564007446451585024)]} 0 3551
   [junit4]   2> 699056 INFO  (TEST-HardAutoCommitTest.testCommitWithin-seed#[C26E39E403BB9A3]) [    x:collection1] o.a.s.u.p.LogUpdateProcessorFactory [collection1] {delete=[530 (-1564007446452633600)]} 0 3551
   [junit4]   2> 699056 INFO  (TEST-HardAutoCommitTest.testCommitWithin-seed#[C26E39E403BB9A3]) [    x:collection1] o.a.s.u.p.LogUpdateProcessorFactory [collection1] {delete=[530 (-1564007446452633601)]} 0 3552
   [junit4]   2> 699057 INFO  (TEST-HardAutoCommitTest.testCommitWithin-seed#[C26E39E403BB9A3]) [    x:collection1] o.a.s.u.p.LogUpdateProcessorFactory [collection1] {delete=[530 (-1564007446453682176)]} 0 3552
   [junit4]   2> 699057 INFO  (TEST-HardAutoCommitTest.testCommitWithin-seed#[C26E39E403BB9A3]) [    x:collection1] o.a.s.u.p.LogUpdateProcessorFactory [collection1] {delete=[530 (-1564007446453682177)]} 0 3552
   [junit4]   2> 699057 INFO  (TEST-HardAutoCommitTest.testCommitWithin-seed#[C26E39E403BB9A3]) [    x:collection1] o.a.s.u.p.LogUpdateProcessorFactory [collection1] {delete=[530 (-1564007446453682178)]} 0 3553
   [junit4]   2> 699058 INFO  (TEST-HardAutoCommitTest.testCommitWithin-seed#[C26E39E403BB9A3]) [    x:collection1] o.a.s.u.p.LogUpdateProcessorFactory [collection1] {delete=[530 (-1564007446454730752)]} 0 3553
   [junit4]   2> 700057 INFO  (commitScheduler-1990-thread-1) [    x:collection1] o.a.s.u.DirectUpdateHandler2 start commit{,optimize=false,openSearcher=true,waitSearcher=true,expungeDeletes=false,softCommit=false,prepareCommit=false}
   [junit4]   2> 700057 INFO  (commitScheduler-1990-thread-1) [    x:collection1] o.a.s.u.SolrIndexWriter Calling setCommitData with IW:org.apache.solr.update.SolrIndexWriter@df64de
   [junit4]   2> 700064 INFO  (commitScheduler-1990-thread-1) [    x:collection1] o.a.s.s.SolrIndexSearcher Opening [Searcher@1a1fbce[collection1] main]
   [junit4]   2> 700072 INFO  (searcherExecutor-1988-thread-1-processing-x:collection1) [    x:collection1] o.a.s.c.SolrCore [collection1] Registered new searcher Searcher@1a1fbce[collection1] main{ExitableDirectoryReader(UninvertingDirectoryReader(Uninverting(_2(6.6.0):C10/9:delGen=1)))}
   [junit4]   2> 700792 INFO  (TEST-HardAutoCommitTest.testCommitWithin-seed#[C26E39E403BB9A3]) [    x:collection1] o.a.s.u.p.LogUpdateProcessorFactory [collection1] {delete=[530 (-1564007446454730753)]} 0 5286
   [junit4]   2> 700792 INFO  (commitScheduler-1990-thread-1) [    x:collection1] o.a.s.u.DirectUpdateHandler2 end_commit_flush
   [junit4]   2> 700794 INFO  (TEST-HardAutoCommitTest.testCommitWithin-seed#[C26E39E403BB9A3]) [    x:collection1] o.a.s.u.p.LogUpdateProcessorFactory [collection1] {delete=[530 (-1564007448272961536)]} 0 5288
   [junit4]   2> 700794 INFO  (TEST-HardAutoCommitTest.testCommitWithin-seed#[C26E39E403BB9A3]) [    x:collection1] o.a.s.u.p.LogUpdateProcessorFactory [collection1] {delete=[530 (-1564007448275058688)]} 0 5289
   [junit4]   2> 700795 INFO  (TEST-HardAutoCommitTest.testCommitWithin-seed#[C26E39E403BB9A3]) [    x:collection1] o.a.s.c.S.Request [collection1]  webapp=null path=null params={q=id:530&qt=standard&start=0&rows=20&version=2.2} hits=0 status=0 QTime=0
   [junit4]   2> 700796 ERROR (TEST-HardAutoCommitTest.testCommitWithin-seed#[C26E39E403BB9A3]) [    x:collection1] o.a.s.SolrTestCaseJ4 REQUEST FAILED: xpath=//result[@numFound=1]
   [junit4]   2> 	xml response was: <?xml version="1.0" encoding="UTF-8"?>
   [junit4]   2> <response>
   [junit4]   2> <lst name="responseHeader"><int name="status">0</int><int name="QTime">0</int></lst><result name="response" numFound="0" start="0"></result>
   [junit4]   2> </response>
   [junit4]   2> 
   [junit4]   2> 	request was:q=id:530&qt=standard&start=0&rows=20&version=2.2
   [junit4]   2> 700799 ERROR (TEST-HardAutoCommitTest.testCommitWithin-seed#[C26E39E403BB9A3]) [    x:collection1] o.a.s.SolrTestCaseJ4 REQUEST FAILED: q=id:530&qt=standard&start=0&rows=20&version=2.2:java.lang.RuntimeException: REQUEST FAILED: xpath=//result[@numFound=1]
   [junit4]   2> 	xml response was: <?xml version="1.0" encoding="UTF-8"?>
   [junit4]   2> <response>
   [junit4]   2> <lst name="responseHeader"><int name="status">0</int><int name="QTime">0</int></lst><result name="response" numFound="0" start="0"></result>
   [junit4]   2> </response>
   [junit4]   2> 
   [junit4]   2> 	request was:q=id:530&qt=standard&start=0&rows=20&version=2.2
   [junit4]   2> 	at org.apache.solr.SolrTestCaseJ4.assertQ(SolrTestCaseJ4.java:874)
   [junit4]   2> 	at org.apache.solr.update.HardAutoCommitTest.testCommitWithin(HardAutoCommitTest.java:128)
   [junit4]   2> 	at sun.reflect.NativeMethodAccessorImpl.invoke0(Native Method)
   [junit4]   2> 	at sun.reflect.NativeMethodAccessorImpl.invoke(NativeMethodAccessorImpl.java:62)
   [junit4]   2> 	at sun.reflect.DelegatingMethodAccessorImpl.invoke(DelegatingMethodAccessorImpl.java:43)
   [junit4]   2> 	at java.lang.reflect.Method.invoke(Method.java:498)
   [junit4]   2> 	at com.carrotsearch.randomizedtesting.RandomizedRunner.invoke(RandomizedRunner.java:1713)
   [junit4]   2> 	at com.carrotsearch.randomizedtesting.RandomizedRunner$8.evaluate(RandomizedRunner.java:907)
   [junit4]   2> 	at com.carrotsearch.randomizedtesting.RandomizedRunner$9.evaluate(RandomizedRunner.java:943)
   [junit4]   2> 	at com.carrotsearch.randomizedtesting.RandomizedRunner$10.evaluate(RandomizedRunner.java:957)
   [junit4]   2> 	at com.carrotsearch.randomizedtesting.rules.SystemPropertiesRestoreRule$1.evaluate(SystemPropertiesRestoreRule.java:57)
   [junit4]   2> 	at org.apache.lucene.util.TestRuleSetupTeardownChained$1.evaluate(TestRuleSetupTeardownChained.java:49)
   [junit4]   2> 	at org.apache.lucene.util.AbstractBeforeAfterRule$1.evaluate(AbstractBeforeAfterRule.java:45)
   [junit4]   2> 	at org.apache.lucene.util.TestRuleThreadAndTestName$1.evaluate(TestRuleThreadAndTestName.java:48)
   [junit4]   2> 	at org.apache.lucene.util.TestRuleIgnoreAfterMaxFailures$1.evaluate(TestRuleIgnoreAfterMaxFailures.java:64)
   [junit4]   2> 	at org.apache.lucene.util.TestRuleMarkFailure$1.evaluate(TestRuleMarkFailure.java:47)
   [junit4]   2> 	at com.carrotsearch.randomizedtesting.rules.StatementAdapter.evaluate(StatementAdapter.java:36)
   [junit4]   2> 	at com.carrotsearch.randomizedtesting.ThreadLeakControl$StatementRunner.run(ThreadLeakControl.java:368)
   [junit4]   2> 	at com.carrotsearch.randomizedtesting.ThreadLeakControl.forkTimeoutingTask(ThreadLeakControl.java:817)
   [junit4]   2> 	at com.carrotsearch.randomizedtesting.ThreadLeakControl$3.evaluate(ThreadLeakControl.java:468)
   [junit4]   2> 	at com.carrotsearch.randomizedtesting.RandomizedRunner.runSingleTest(RandomizedRunner.java:916)
   [junit4]   2> 	at com.carrotsearch.randomizedtesting.RandomizedRunner$5.evaluate(RandomizedRunner.java:802)
   [junit4]   2> 	at com.carrotsearch.randomizedtesting.RandomizedRunner$6.evaluate(RandomizedRunner.java:852)
   [junit4]   2> 	at com.carrotsearch.randomizedtesting.RandomizedRunner$7.evaluate(RandomizedRunner.java:863)
   [junit4]   2> 	at com.carrotsearch.randomizedtesting.rules.StatementAdapter.evaluate(StatementAdapter.java:36)
   [junit4]   2> 	at com.carrotsearch.randomizedtesting.rules.SystemPropertiesRestoreRule$1.evaluate(SystemPropertiesRestoreRule.java:57)
   [junit4]   2> 	at org.apache.lucene.util.AbstractBeforeAfterRule$1.evaluate(AbstractBeforeAfterRule.java:45)
   [junit4]   2> 	at com.carrotsearch.randomizedtesting.rules.StatementAdapter.evaluate(StatementAdapter.java:36)
   [junit4]   2> 	at org.apache.lucene.util.TestRuleStoreClassName$1.evaluate(TestRuleStoreClassName.java:41)
   [junit4]   2> 	at com.carrotsearch.randomizedtesting.rules.NoShadowingOrOverridesOnMethodsRule$1.evaluate(NoShadowingOrOverridesOnMethodsRule.java:40)
   [junit4]   2> 	at com.carrotsearch.randomizedtesting.rules.NoShadowingOrOverridesOnMethodsRule$1.evaluate(NoShadowingOrOverridesOnMethodsRule.java:40)
   [junit4]   2> 	at com.carrotsearch.randomizedtesting.rules.StatementAdapter.evaluate(StatementAdapter.java:36)
   [junit4]   2> 	at com.carrotsearch.randomizedtesting.rules.StatementAdapter.evaluate(StatementAdapter.java:36)
   [junit4]   2> 	at com.carrotsearch.randomizedtesting.rules.StatementAdapter.evaluate(StatementAdapter.java:36)
   [junit4]   2> 	at org.apache.lucene.util.TestRuleAssertionsRequired$1.evaluate(TestRuleAssertionsRequired.java:53)
   [junit4]   2> 	at org.apache.lucene.util.TestRuleMarkFailure$1.evaluate(TestRuleMarkFailure.java:47)
   [junit4]   2> 	at org.apache.lucene.util.TestRuleIgnoreAfterMaxFailures$1.evaluate(TestRuleIgnoreAfterMaxFailures.java:64)
   [junit4]   2> 	at org.apache.lucene.util.TestRuleIgnoreTestSuites$1.evaluate(TestRuleIgnoreTestSuites.java:54)
   [junit4]   2> 	at com.carrotsearch.randomizedtesting.rules.StatementAdapter.evaluate(StatementAdapter.java:36)
   [junit4]   2> 	at com.carrotsearch.randomizedtesting.ThreadLeakControl$StatementRunner.run(ThreadLeakControl.java:368)
   [junit4]   2> 	at java.lang.Thread.run(Thread.java:745)
   [junit4]   2> 
   [junit4]   2> 700800 INFO  (TEST-HardAutoCommitTest.testCommitWithin-seed#[C26E39E403BB9A3]) [    x:collection1] o.a.s.SolrTestCaseJ4 ###Ending testCommitWithin
   [junit4]   2> NOTE: reproduce with: ant test  -Dtestcase=HardAutoCommitTest -Dtests.method=testCommitWithin -Dtests.seed=C26E39E403BB9A3 -Dtests.slow=true -Dtests.locale=und -Dtests.timezone=America/St_Lucia -Dtests.asserts=true -Dtests.file.encoding=Cp1252
   [junit4] ERROR   6.37s J0 | HardAutoCommitTest.testCommitWithin <<<
   [junit4]    > Throwable #1: java.lang.RuntimeException: Exception during query
   [junit4]    > 	at __randomizedtesting.SeedInfo.seed([C26E39E403BB9A3:B6F48CE6C31557B6]:0)
   [junit4]    > 	at org.apache.solr.SolrTestCaseJ4.assertQ(SolrTestCaseJ4.java:881)
   [junit4]    > 	at org.apache.solr.update.HardAutoCommitTest.testCommitWithin(HardAutoCommitTest.java:128)
   [junit4]    > 	at java.lang.Thread.run(Thread.java:745)
   [junit4]    > Caused by: java.lang.RuntimeException: REQUEST FAILED: xpath=//result[@numFound=1]
   [junit4]    > 	xml response was: <?xml version="1.0" encoding="UTF-8"?>
   [junit4]    > <response>
   [junit4]    > <lst name="responseHeader"><int name="status">0</int><int name="QTime">0</int></lst><result name="response" numFound="0" start="0"></result>
   [junit4]    > </response>
   [junit4]    > 	request was:q=id:530&qt=standard&start=0&rows=20&version=2.2
   [junit4]    > 	at org.apache.solr.SolrTestCaseJ4.assertQ(SolrTestCaseJ4.java:874)
   [junit4]    > 	... 40 more
   [junit4]   2> 700803 INFO  (SUITE-HardAutoCommitTest-seed#[C26E39E403BB9A3]-worker) [    x:collection1] o.a.s.SolrTestCaseJ4 ###deleteCore
   [junit4]   2> 700803 INFO  (SUITE-HardAutoCommitTest-seed#[C26E39E403BB9A3]-worker) [    x:collection1] o.a.s.c.CoreContainer Shutting down CoreContainer instance=27207015
   [junit4]   2> 700805 INFO  (coreCloseExecutor-1992-thread-1-processing-x:collection1) [    x:collection1] o.a.s.c.SolrCore [collection1]  CLOSING SolrCore org.apache.solr.core.SolrCore@18ed905
   [junit4]   2> 700806 INFO  (coreCloseExecutor-1992-thread-1-processing-x:collection1) [    x:collection1] o.a.s.u.DirectUpdateHandler2 Committing on IndexWriter close.
   [junit4]   2> 700806 INFO  (coreCloseExecutor-1992-thread-1-processing-x:collection1) [    x:collection1] o.a.s.u.SolrIndexWriter Calling setCommitData with IW:org.apache.solr.update.SolrIndexWriter@df64de
   [junit4]   2> 701036 INFO  (coreCloseExecutor-1992-thread-1-processing-x:collection1) [    x:collection1] o.a.s.m.SolrMetricManager Closing metric reporters for: solr.core.collection1
   [junit4]   2> 701041 INFO  (SUITE-HardAutoCommitTest-seed#[C26E39E403BB9A3]-worker) [    x:collection1] o.a.s.m.SolrMetricManager Closing metric reporters for: solr.node
   [junit4]   2> NOTE: leaving temporary files on disk at: C:\Users\jenkins\workspace\Lucene-Solr-6.x-Windows\solr\build\solr-core\test\J0\temp\solr.update.HardAutoCommitTest_C26E39E403BB9A3-001
   [junit4]   2> NOTE: test params are: codec=Asserting(Lucene62): {field_t=PostingsFormat(name=Direct), multiDefault=PostingsFormat(name=LuceneFixedGap), subject=PostingsFormat(name=LuceneFixedGap), id=FSTOrd50, text=PostingsFormat(name=Direct)}, docValues:{range_facet_l_dv=DocValuesFormat(name=Direct), _version_=DocValuesFormat(name=Memory), intDefault=DocValuesFormat(name=Memory), range_facet_i_dv=DocValuesFormat(name=Memory), intDvoDefault=DocValuesFormat(name=Lucene54), range_facet_l=DocValuesFormat(name=Memory), timestamp=DocValuesFormat(name=Memory)}, maxPointsInLeafNode=449, maxMBSortInHeap=7.902724274671842, sim=RandomSimilarity(queryNorm=true,coord=no): {}, locale=und, timezone=America/St_Lucia
   [junit4]   2> NOTE: Windows 10 10.0 x86/Oracle Corporation 1.8.0_121 (32-bit)/cpus=3,threads=1,free=59684904,total=197926912
   [junit4]   2> NOTE: All tests run in this JVM: [HdfsWriteToMultipleCollectionsTest, TestPerFieldSimilarityClassic, SolrJmxReporterTest, XsltUpdateRequestHandlerTest, MultiTermTest, ShufflingReplicaListTransformerTest, HttpSolrCallGetCoreTest, TestCSVLoader, TestRTGBase, HLLUtilTest, TestHashQParserPlugin, CloudExitableDirectoryReaderTest, QueryElevationComponentTest, SchemaVersionSpecificBehaviorTest, TestManagedSynonymFilterFactory, SystemInfoHandlerTest, OverseerStatusTest, CoreSorterTest, TestFieldCacheWithThreads, InfoHandlerTest, DistributedMLTComponentTest, TestUseDocValuesAsStored2, SaslZkACLProviderTest, TestConfigReload, TestExtendedDismaxParser, HdfsNNFailoverTest, TestFaceting, PeerSyncTest, TestDFISimilarityFactory, OverriddenZkACLAndCredentialsProvidersTest, TestLRUCache, TestFastOutputStream, LeaderFailoverAfterPartitionTest, TestHighlightDedupGrouping, TestEmbeddedSolrServerConstructors, ZkNodePropsTest, TestWordDelimiterFilterFactory, TestDistributedSearch, DataDrivenBlockJoinTest, TestComplexPhraseLeadingWildcard, TestSolrQueryParserDefaultOperatorResource, DeleteStatusTest, ClassificationUpdateProcessorTest, TestDeleteCollectionOnDownNodes, TestMacroExpander, TestRebalanceLeaders, TestSha256AuthenticationProvider, UpdateLogTest, ResponseLogComponentTest, TestNRTOpen, SolrGangliaReporterTest, VMParamsZkACLAndCredentialsProvidersTest, CursorPagingTest, AnalysisAfterCoreReloadTest, TestOverriddenPrefixQueryForCustomFieldType, PKIAuthenticationIntegrationTest, TimeZoneUtilsTest, DocumentBuilderTest, BaseCdcrDistributedZkTest, AnalyticsQueryTest, PropertiesRequestHandlerTest, BooleanFieldTest, TestFreeTextSuggestions, TestIBSimilarityFactory, TestSolr4Spatial2, DistributedDebugComponentTest, BitVectorTest, TestDynamicFieldResource, ZkControllerTest, CustomCollectionTest, SmileWriterTest, SyncSliceTest, TestChildDocTransformer, TestConfigSetsAPIZkFailure, XmlUpdateRequestHandlerTest, DeleteLastCustomShardedReplicaTest, HardAutoCommitTest]
   [junit4] Completed [91/703 (1!)] on J0 in 8.16s, 1 test, 1 error <<< FAILURES!

[...truncated 145 lines...]
   [junit4] Suite: org.apache.solr.handler.admin.CoreAdminCreateDiscoverTest
   [junit4]   2> Creating dataDir: C:\Users\jenkins\workspace\Lucene-Solr-6.x-Windows\solr\build\solr-core\test\J1\temp\solr.handler.admin.CoreAdminCreateDiscoverTest_C26E39E403BB9A3-001\init-core-data-001
   [junit4]   2> 943648 WARN  (SUITE-CoreAdminCreateDiscoverTest-seed#[C26E39E403BB9A3]-worker) [    ] o.a.s.SolrTestCaseJ4 startTrackingSearchers: numOpens=16 numCloses=16
   [junit4]   2> 943648 INFO  (SUITE-CoreAdminCreateDiscoverTest-seed#[C26E39E403BB9A3]-worker) [    ] o.a.s.SolrTestCaseJ4 Using PointFields
   [junit4]   2> 943656 INFO  (SUITE-CoreAdminCreateDiscoverTest-seed#[C26E39E403BB9A3]-worker) [    ] o.a.s.SolrTestCaseJ4 Randomized ssl (true) and clientAuth (false) via: @org.apache.solr.util.RandomizeSSL(reason=, value=NaN, ssl=NaN, clientAuth=NaN)
   [junit4]   2> 943664 INFO  (SUITE-CoreAdminCreateDiscoverTest-seed#[C26E39E403BB9A3]-worker) [    ] o.a.s.c.SolrXmlConfig Loading container configuration from C:\Users\jenkins\workspace\Lucene-Solr-6.x-Windows\solr\build\solr-core\test\J1\temp\solr.handler.admin.CoreAdminCreateDiscoverTest_C26E39E403BB9A3-001\tempDir-001\solr.xml
   [junit4]   2> 943690 INFO  (SUITE-CoreAdminCreateDiscoverTest-seed#[C26E39E403BB9A3]-worker) [    ] o.a.s.u.UpdateShardHandler Creating UpdateShardHandler HTTP client with params: socketTimeout=600000&connTimeout=60000&retry=true
   [junit4]   2> 943795 INFO  (SUITE-CoreAdminCreateDiscoverTest-seed#[C26E39E403BB9A3]-worker) [    ] o.a.s.c.CorePropertiesLocator Found 0 core definitions underneath C:\Users\jenkins\workspace\Lucene-Solr-6.x-Windows\solr\build\solr-core\test\J1\temp\solr.handler.admin.CoreAdminCreateDiscoverTest_C26E39E403BB9A3-001\tempDir-001
   [junit4]   2> 943803 INFO  (TEST-CoreAdminCreateDiscoverTest.testCannotCreateTwoCoresWithSameInstanceDir-seed#[C26E39E403BB9A3]) [    ] o.a.s.SolrTestCaseJ4 ###Starting testCannotCreateTwoCoresWithSameInstanceDir
   [junit4]   2> 943812 INFO  (TEST-CoreAdminCreateDiscoverTest.testCannotCreateTwoCoresWithSameInstanceDir-seed#[C26E39E403BB9A3]) [    ] o.a.s.c.TransientSolrCoreCacheDefault Allocating transient cache for 2147483647 transient cores
   [junit4]   2> 943812 INFO  (TEST-CoreAdminCreateDiscoverTest.testCannotCreateTwoCoresWithSameInstanceDir-seed#[C26E39E403BB9A3]) [    ] o.a.s.h.a.CoreAdminOperation core create command schema=schema_ren.xml&dataDir=C:\Users\jenkins\workspace\Lucene-Solr-6.x-Windows\solr\build\solr-core\test\J1\temp\solr.handler.admin.CoreAdminCreateDiscoverTest_C26E39E403BB9A3-001\tempDir-001\duplicate\data&name=duplicate&action=CREATE&instanceDir=C:\Users\jenkins\workspace\Lucene-Solr-6.x-Windows\solr\build\solr-core\test\J1\temp\solr.handler.admin.CoreAdminCreateDiscoverTest_C26E39E403BB9A3-001\tempDir-001\duplicate&config=solrconfig_ren.xml&wt=xml
   [junit4]   2> 943878 WARN  (TEST-CoreAdminCreateDiscoverTest.testCannotCreateTwoCoresWithSameInstanceDir-seed#[C26E39E403BB9A3]) [    x:duplicate] o.a.s.c.Config Beginning with Solr 5.5, <mergePolicy> is deprecated, use <mergePolicyFactory> instead.
   [junit4]   2> 943879 INFO  (TEST-CoreAdminCreateDiscoverTest.testCannotCreateTwoCoresWithSameInstanceDir-seed#[C26E39E403BB9A3]) [    x:duplicate] o.a.s.c.SolrConfig Using Lucene MatchVersion: 6.6.0
   [junit4]   2> 943897 INFO  (TEST-CoreAdminCreateDiscoverTest.testCannotCreateTwoCoresWithSameInstanceDir-seed#[C26E39E403BB9A3]) [    x:duplicate] o.a.s.s.IndexSchema [duplicate] Schema name=tiny
   [junit4]   2> 943903 INFO  (TEST-CoreAdminCreateDiscoverTest.testCannotCreateTwoCoresWithSameInstanceDir-seed#[C26E39E403BB9A3]) [    x:duplicate] o.a.s.s.IndexSchema Loaded schema tiny/1.1 with uniqueid field id
   [junit4]   2> 943903 INFO  (TEST-CoreAdminCreateDiscoverTest.testCannotCreateTwoCoresWithSameInstanceDir-seed#[C26E39E403BB9A3]) [    x:duplicate] o.a.s.c.CoreContainer Creating SolrCore 'duplicate' using configuration from instancedir C:\Users\jenkins\workspace\Lucene-Solr-6.x-Windows\solr\build\solr-core\test\J1\temp\solr.handler.admin.CoreAdminCreateDiscoverTest_C26E39E403BB9A3-001\tempDir-001\duplicate, trusted=true
   [junit4]   2> 943904 INFO  (TEST-CoreAdminCreateDiscoverTest.testCannotCreateTwoCoresWithSameInstanceDir-seed#[C26E39E403BB9A3]) [    x:duplicate] o.a.s.c.SolrCore solr.RecoveryStrategy.Builder
   [junit4]   2> 943904 INFO  (TEST-CoreAdminCreateDiscoverTest.testCannotCreateTwoCoresWithSameInstanceDir-seed#[C26E39E403BB9A3]) [    x:duplicate] o.a.s.c.SolrCore [[duplicate] ] Opening new SolrCore at [C:\Users\jenkins\workspace\Lucene-Solr-6.x-Windows\solr\build\solr-core\test\J1\temp\solr.handler.admin.CoreAdminCreateDiscoverTest_C26E39E403BB9A3-001\tempDir-001\duplicate], dataDir=[C:\Users\jenkins\workspace\Lucene-Solr-6.x-Windows\solr\build\solr-core\test\J1\temp\solr.handler.admin.CoreAdminCreateDiscoverTest_C26E39E403BB9A3-001\tempDir-001\duplicate\data\]
   [junit4]   2> 943910 INFO  (TEST-CoreAdminCreateDiscoverTest.testCannotCreateTwoCoresWithSameInstanceDir-seed#[C26E39E403BB9A3]) [    x:duplicate] o.a.s.u.RandomMergePolicy RandomMergePolicy wrapping class org.apache.lucene.index.LogByteSizeMergePolicy: [LogByteSizeMergePolicy: minMergeSize=1677721, mergeFactor=47, maxMergeSize=2147483648, maxMergeSizeForForcedMerge=9223372036854775807, calibrateSizeByDeletes=false, maxMergeDocs=2147483647, maxCFSSegmentSizeMB=8.796093022207999E12, noCFSRatio=1.0]
   [junit4]   2> 944047 INFO  (TEST-CoreAdminCreateDiscoverTest.testCannotCreateTwoCoresWithSameInstanceDir-seed#[C26E39E403BB9A3]) [    x:duplicate] o.a.s.u.CommitTracker Hard AutoCommit: disabled
   [junit4]   2> 944047 INFO  (TEST-CoreAdminCreateDiscoverTest.testCannotCreateTwoCoresWithSameInstanceDir-seed#[C26E39E403BB9A3]) [    x:duplicate] o.a.s.u.CommitTracker Soft AutoCommit: disabled
   [junit4]   2> 944048 INFO  (TEST-CoreAdminCreateDiscoverTest.testCannotCreateTwoCoresWithSameInstanceDir-seed#[C26E39E403BB9A3]) [    x:duplicate] o.a.s.u.RandomMergePolicy RandomMergePolicy wrapping class org.apache.lucene.index.AlcoholicMergePolicy: [AlcoholicMergePolicy: minMergeSize=0, mergeFactor=10, maxMergeSize=978087366, maxMergeSizeForForcedMerge=9223372036854775807, calibrateSizeByDeletes=true, maxMergeDocs=2147483647, maxCFSSegmentSizeMB=8.796093022207999E12, noCFSRatio=0.1]
   [junit4]   2> 944049 INFO  (TEST-CoreAdminCreateDiscoverTest.testCannotCreateTwoCoresWithSameInstanceDir-seed#[C26E39E403BB9A3]) [    x:duplicate] o.a.s.s.SolrIndexSearcher Opening [Searcher@1474fd[duplicate] main]
   [junit4]   2> 944051 INFO  (TEST-CoreAdminCreateDiscoverTest.testCannotCreateTwoCoresWithSameInstanceDir-seed#[C26E39E403BB9A3]) [    x:duplicate] o.a.s.r.ManagedResourceStorage File-based storage initialized to use dir: C:\Users\jenkins\workspace\Lucene-Solr-6.x-Windows\solr\build\solr-core\test\J1\temp\solr.handler.admin.CoreAdminCreateDiscoverTest_C26E39E403BB9A3-001\tempDir-001\duplicate\conf
   [junit4]   2> 944052 INFO  (TEST-CoreAdminCreateDiscoverTest.testCannotCreateTwoCoresWithSameInstanceDir-seed#[C26E39E403BB9A3]) [    x:duplicate] o.a.s.h.ReplicationHandler Commits will be reserved for  10000
   [junit4]   2> 944052 INFO  (searcherExecutor-2042-thread-1-processing-x:duplicate) [    x:duplicate] o.a.s.c.SolrCore [duplicate] Registered new searcher Searcher@1474fd[duplicate] main{ExitableDirectoryReader(UninvertingDirectoryReader())}
   [junit4]   2> 944054 INFO  (TEST-CoreAdminCreateDiscoverTest.testCannotCreateTwoCoresWithSameInstanceDir-seed#[C26E39E403BB9A3]) [    x:duplicate] o.a.s.h.a.CoreAdminOperation core create command schema=schema_ren.xml&dataDir=C:\Users\jenkins\workspace\Lucene-Solr-6.x-Windows\solr\build\solr-core\test\J1\temp\solr.handler.admin.CoreAdminCreateDiscoverTest_C26E39E403BB9A3-001\tempDir-001\duplicate\data&name=different_name_core&action=CREATE&instanceDir=C:\Users\jenkins\workspace\Lucene-Solr-6.x-Windows\solr\build\solr-core\test\J1\temp\solr.handler.admin.CoreAdminCreateDiscoverTest_C26E39E403BB9A3-001\tempDir-001\duplicate&config=solrconfig_ren.xml&wt=xml
   [junit4]   2> 944096 WARN  (TEST-CoreAdminCreateDiscoverTest.testCannotCreateTwoCoresWithSameInstanceDir-seed#[C26E39E403BB9A3]) [    x:duplicate] o.a.s.c.Config Beginning with Solr 5.5, <mergePolicy> is deprecated, use <mergePolicyFactory> instead.
   [junit4]   2> 944097 INFO  (TEST-CoreAdminCreateDiscoverTest.testCannotCreateTwoCoresWithSameInstanceDir-seed#[C26E39E403BB9A3]) [    x:duplicate] o.a.s.c.SolrConfig Using Lucene MatchVersion: 6.6.0
   [junit4]   2> 944113 INFO  (TEST-CoreAdminCreateDiscoverTest.testCannotCreateTwoCoresWithSameInstanceDir-seed#[C26E39E403BB9A3]) [    x:duplicate] o.a.s.s.IndexSchema [different_name_core] Schema name=tiny
   [junit4]   2> 944132 INFO  (TEST-CoreAdminCreateDiscoverTest.testCannotCreateTwoCoresWithSameInstanceDir-seed#[C26E39E403BB9A3]) [    x:duplicate] o.a.s.s.IndexSchema Loaded schema tiny/1.1 with uniqueid field id
   [junit4]   2> 944133 INFO  (TEST-CoreAdminCreateDiscoverTest.testCannotCreateTwoCoresWithSameInstanceDir-seed#[C26E39E403BB9A3]) [    x:duplicate] o.a.s.c.CoreContainer Creating SolrCore 'different_name_core' using configuration from instancedir C:\Users\jenkins\workspace\Lucene-Solr-6.x-Windows\solr\build\solr-core\test\J1\temp\solr.handler.admin.CoreAdminCreateDiscoverTest_C26E39E403BB9A3-001\tempDir-001\duplicate, trusted=true
   [junit4]   2> 944134 INFO  (TEST-CoreAdminCreateDiscoverTest.testCannotCreateTwoCoresWithSameInstanceDir-seed#[C26E39E403BB9A3]) [    x:duplicate] o.a.s.c.SolrCore solr.RecoveryStrategy.Builder
   [junit4]   2> 944135 INFO  (TEST-CoreAdminCreateDiscoverTest.testCannotCreateTwoCoresWithSameInstanceDir-seed#[C26E39E403BB9A3]) [    x:duplicate] o.a.s.c.SolrCore [[different_name_core] ] Opening new SolrCore at [C:\Users\jenkins\workspace\Lucene-Solr-6.x-Windows\solr\build\solr-core\test\J1\temp\solr.handler.admin.CoreAdminCreateDiscoverTest_C26E39E403BB9A3-001\tempDir-001\duplicate], dataDir=[C:\Users\jenkins\workspace\Lucene-Solr-6.x-Windows\solr\build\solr-core\test\J1\temp\solr.handler.admin.CoreAdminCreateDiscoverTest_C26E39E403BB9A3-001\tempDir-001\duplicate\data\]
   [junit4]   2> 944465 INFO  (TEST-CoreAdminCreateDiscoverTest.testCannotCreateTwoCoresWithSameInstanceDir-seed#[C26E39E403BB9A3]) [    x:duplicate] o.a.s.u.CommitTracker Hard AutoCommit: disabled
   [junit4]   2> 944465 INFO  (TEST-CoreAdminCreateDiscoverTest.testCannotCreateTwoCoresWithSameInstanceDir-seed#[C26E39E403BB9A3]) [    x:duplicate] o.a.s.u.CommitTracker Soft AutoCommit: disabled
   [junit4]   2> 944467 INFO  (TEST-CoreAdminCreateDiscoverTest.testCannotCreateTwoCoresWithSameInstanceDir-seed#[C26E39E403BB9A3]) [    x:duplicate] o.a.s.u.RandomMergePolicy RandomMergePolicy wrapping class org.apache.lucene.index.TieredMergePolicy: [TieredMergePolicy: maxMergeAtOnce=25, maxMergeAtOnceExplicit=43, maxMergedSegmentMB=93.421875, floorSegmentMB=1.33984375, forceMergeDeletesPctAllowed=21.4486669525393, segmentsPerTier=19.0, maxCFSSegmentSizeMB=8.796093022207999E12, noCFSRatio=0.0
   [junit4]   2> 944469 INFO  (TEST-CoreAdminCreateDiscoverTest.testCannotCreateTwoCoresWithSameInstanceDir-seed#[C26E39E403BB9A3]) [    x:duplicate] o.a.s.s.SolrIndexSearcher Opening [Searcher@15478ea[different_name_core] main]
   [junit4]   2> 944470 INFO  (TEST-CoreAdminCreateDiscoverTest.testCannotCreateTwoCoresWithSameInstanceDir-seed#[C26E39E403BB9A3]) [    x:duplicate] o.a.s.r.ManagedResourceStorage File-based storage initialized to use dir: C:\Users\jenkins\workspace\Lucene-Solr-6.x-Windows\solr\build\solr-core\test\J1\temp\solr.handler.admin.CoreAdminCreateDiscoverTest_C26E39E403BB9A3-001\tempDir-001\duplicate\conf
   [junit4]   2> 944470 INFO  (TEST-CoreAdminCreateDiscoverTest.testCannotCreateTwoCoresWithSameInstanceDir-seed#[C26E39E403BB9A3]) [    x:duplicate] o.a.s.h.ReplicationHandler Commits will be reserved for  10000
   [junit4]   2> 944473 INFO  (TEST-CoreAdminCreateDiscoverTest.testCannotCreateTwoCoresWithSameInstanceDir-seed#[C26E39E403BB9A3]) [    x:duplicate] o.a.s.SolrTestCaseJ4 ###Ending testCannotCreateTwoCoresWithSameInstanceDir
   [junit4]   2> 944475 INFO  (searcherExecutor-2046-thread-1-processing-x:duplicate) [    x:duplicate] o.a.s.c.SolrCore [different_name_core] Registered new searcher Searcher@15478ea[different_name_core] main{ExitableDirectoryReader(UninvertingDirectoryReader())}
   [junit4]   2> 944475 INFO  (TEST-CoreAdminCreateDiscoverTest.testCreateSavesRegProps-seed#[C26E39E403BB9A3]) [    x:duplicate] o.a.s.SolrTestCaseJ4 ###Starting testCreateSavesRegProps
   [junit4]   2> 944484 INFO  (TEST-CoreAdminCreateDiscoverTest.testCreateSavesRegProps-seed#[C26E39E403BB9A3]) [    x:duplicate] o.a.s.h.a.CoreAdminOperation core create command schema=schema_ren.xml&dataDir=C:\Users\jenkins\workspace\Lucene-Solr-6.x-Windows\solr\build\solr-core\test\J1\temp\solr.handler.admin.CoreAdminCreateDiscoverTest_C26E39E403BB9A3-001\tempDir-001\normal\data&name=normal&action=CREATE&instanceDir=C:\Users\jenkins\workspace\Lucene-Solr-6.x-Windows\solr\build\solr-core\test\J1\temp\solr.handler.admin.CoreAdminCreateDiscoverTest_C26E39E403BB9A3-001\tempDir-001\normal&config=solrconfig_ren.xml&wt=xml
   [junit4]   2> 944531 WARN  (TEST-CoreAdminCreateDiscoverTest.testCreateSavesRegProps-seed#[C26E39E403BB9A3]) [    x:duplicate] o.a.s.c.Config Beginning with Solr 5.5, <mergePolicy> is deprecated, use <mergePolicyFactory> instead.
   [junit4]   2> 944533 INFO  (TEST-CoreAdminCreateDiscoverTest.testCreateSavesRegProps-seed#[C26E39E403BB9A3]) [    x:duplicate] o.a.s.c.SolrConfig Using Lucene MatchVersion: 6.6.0
   [junit4]   2> 944548 INFO  (TEST-CoreAdminCreateDiscoverTest.testCreateSavesRegProps-seed#[C26E39E403BB9A3]) [    x:duplicate] o.a.s.s.IndexSchema [normal] Schema name=tiny
   [junit4]   2> 944555 INFO  (TEST-CoreAdminCreateDiscoverTest.testCreateSavesRegProps-seed#[C26E39E403BB9A3]) [    x:duplicate] o.a.s.s.IndexSchema Loaded schema tiny/1.1 with uniqueid field id
   [junit4]   2> 944555 INFO  (TEST-CoreAdminCreateDiscoverTest.testCreateSavesRegProps-seed#[C26E39E403BB9A3]) [    x:duplicate] o.a.s.c.CoreContainer Creating SolrCore 'normal' using configuration from instancedir C:\Users\jenkins\workspace\Lucene-Solr-6.x-Windows\solr\build\solr-core\test\J1\temp\solr.handler.admin.CoreAdminCreateDiscoverTest_C26E39E403BB9A3-001\tempDir-001\normal, trusted=true
   [junit4]   2> 944555 INFO  (TEST-CoreAdminCreateDiscoverTest.testCreateSavesRegProps-seed#[C26E39E403BB9A3]) [    x:duplicate] o.a.s.c.SolrCore solr.RecoveryStrategy.Builder
   [junit4]   2> 944555 INFO  (TEST-CoreAdminCreateDiscoverTest.testCreateSavesRegProps-seed#[C26E39E403BB9A3]) [    x:duplicate] o.a.s.c.SolrCore [[normal] ] Opening new SolrCore at [C:\Users\jenkins\workspace\Lucene-Solr-6.x-Windows\solr\build\solr-core\test\J1\temp\solr.handler.admin.CoreAdminCreateDiscoverTest_C26E39E403BB9A3-001\tempDir-001\normal], dataDir=[C:\Users\jenkins\workspace\Lucene-Solr-6.x-Windows\solr\build\solr-core\test\J1\temp\solr.handler.admin.CoreAdminCreateDiscoverTest_C26E39E403BB9A3-001\tempDir-001\normal\data\]
   [junit4]   2> 944562 INFO  (TEST-CoreAdminCreateDiscoverTest.testCreateSavesRegProps-seed#[C26E39E403BB9A3]) [    x:duplicate] o.a.s.u.RandomMergePolicy RandomMergePolicy wrapping class org.apache.lucene.index.LogDocMergePolicy: [LogDocMergePolicy: minMergeSize=1000, mergeFactor=23, maxMergeSize=9223372036854775807, maxMergeSizeForForcedMerge=9223372036854775807, calibrateSizeByDeletes=false, maxMergeDocs=2147483647, maxCFSSegmentSizeMB=8.796093022207999E12, noCFSRatio=0.6083715711848136]
   [junit4]   2> 944697 INFO  (TEST-CoreAdminCreateDiscoverTest.testCreateSavesRegProps-seed#[C26E39E403BB9A3]) [    x:duplicate] o.a.s.u.CommitTracker Hard AutoCommit: disabled
   [junit4]   2> 944697 INFO  (TEST-CoreAdminCreateDiscoverTest.testCreateSavesRegProps-seed#[C26E39E403BB9A3]) [    x:duplicate] o.a.s.u.CommitTracker Soft AutoCommit: disabled
   [junit4]   2> 944698 INFO  (TEST-CoreAdminCreateDiscoverTest.testCreateSavesRegProps-seed#[C26E39E403BB9A3]) [    x:duplicate] o.a.s.u.RandomMergePolicy RandomMergePolicy wrapping class org.apache.lucene.index.LogDocMergePolicy: [LogDocMergePolicy: minMergeSize=1000, mergeFactor=42, maxMergeSize=9223372036854775807, maxMergeSizeForForcedMerge=9223372036854775807, calibrateSizeByDeletes=true, maxMergeDocs=2147483647, maxCFSSegmentSizeMB=8.796093022207999E12, noCFSRatio=0.8171960943367997]
   [junit4]   2> 944699 INFO  (TEST-CoreAdminCreateDiscoverTest.testCreateSavesRegProps-seed#[C26E39E403BB9A3]) [    x:duplicate] o.a.s.s.SolrIndexSearcher Opening [Searcher@13108de[normal] main]
   [junit4]   2> 944700 INFO  (TEST-CoreAdminCreateDiscoverTest.testCreateSavesRegProps-seed#[C26E39E403BB9A3]) [    x:duplicate] o.a.s.r.ManagedResourceStorage File-based storage initialized to use dir: C:\Users\jenkins\workspace\Lucene-Solr-6.x-Windows\solr\build\solr-core\test\J1\temp\solr.handler.admin.CoreAdminCreateDiscoverTest_C26E39E403BB9A3-001\tempDir-001\normal\conf
   [junit4]   2> 944702 INFO  (TEST-CoreAdminCreateDiscoverTest.testCreateSavesRegProps-seed#[C26E39E403BB9A3]) [    x:duplicate] o.a.s.h.ReplicationHandler Commits will be reserved for  10000
   [junit4]   2> 944702 INFO  (searcherExecutor-2050-thread-1-processing-x:duplicate) [    x:duplicate] o.a.s.c.SolrCore [normal] Registered new searcher Searcher@13108de[normal] main{ExitableDirectoryReader(UninvertingDirectoryReader())}
   [junit4]   2> 944704 INFO  (TEST-CoreAdminCreateDiscoverTest.testCreateSavesRegProps-seed#[C26E39E403BB9A3]) [    x:duplicate] o.a.s.SolrTestCaseJ4 ###Ending testCreateSavesRegProps
   [junit4]   2> 944707 INFO  (TEST-CoreAdminCreateDiscoverTest.testCreateSavesSysProps-seed#[C26E39E403BB9A3]) [    x:duplicate] o.a.s.SolrTestCaseJ4 ###Starting testCreateSavesSysProps
   [junit4]   2> 944719 INFO  (TEST-CoreAdminCreateDiscoverTest.testCreateSavesSysProps-seed#[C26E39E403BB9A3]) [    x:duplicate] o.a.s.h.a.CoreAdminOperation core create command schema=${SCHEMA_TEST}&dataDir=${DATA_TEST}&name=sys_props&action=CREATE&instanceDir=${INSTDIR_TEST}&config=${CONFIG_TEST}&wt=xml
   [junit4]   2> 944760 WARN  (TEST-CoreAdminCreateDiscoverTest.testCreateSavesSysProps-seed#[C26E39E403BB9A3]) [    x:duplicate] o.a.s.c.Config Beginning with Solr 5.5, <mergePolicy> is deprecated, use <mergePolicyFactory> instead.
   [junit4]   2> 944761 INFO  (TEST-CoreAdminCreateDiscoverTest.testCreateSavesSysProps-seed#[C26E39E403BB9A3]) [    x:duplicate] o.a.s.c.SolrConfig Using Lucene MatchVersion: 6.6.0
   [junit4]   2> 944782 INFO  (TEST-CoreAdminCreateDiscoverTest.testCreateSavesSysProps-seed#[C26E39E403BB9A3]) [    x:duplicate] o.a.s.s.IndexSchema [sys_props] Schema name=tiny
   [junit4]   2> 944804 INFO  (TEST-CoreAdminCreateDiscoverTest.testCreateSavesSysProps-seed#[C26E39E403BB9A3]) [    x:duplicate] o.a.s.s.IndexSchema Loaded schema tiny/1.1 with uniqueid field id
   [junit4]   2> 944804 INFO  (TEST-CoreAdminCreateDiscoverTest.testCreateSavesSysProps-seed#[C26E39E403BB9A3]) [    x:duplicate] o.a.s.c.CoreContainer Creating SolrCore 'sys_props' using configuration from instancedir C:\Users\jenkins\workspace\Lucene-Solr-6.x-Windows\solr\build\solr-core\test\J1\temp\solr.handler.admin.CoreAdminCreateDiscoverTest_C26E39E403BB9A3-001\tempDir-001\sys_props, trusted=true
   [junit4]   2> 944804 INFO  (TEST-CoreAdminCreateDiscoverTest.testCreateSavesSysProps-seed#[C26E39E403BB9A3]) [    x:duplicate] o.a.s.c.SolrCore solr.RecoveryStrategy.Builder
   [junit4]   2> 944804 INFO  (TEST-CoreAdminCreateDiscoverTest.testCreateSavesSysProps-seed#[C26E39E403BB9A3]) [    x:duplicate] o.a.s.c.SolrCore [[sys_props] ] Opening new SolrCore at [C:\Users\jenkins\workspace\Lucene-Solr-6.x-Windows\solr\build\solr-core\test\J1\temp\solr.handler.admin.CoreAdminCreateDiscoverTest_C26E39E403BB9A3-001\tempDir-001\sys_props], dataDir=[C:\Users\jenkins\workspace\Lucene-Solr-6.x-Windows\solr\build\solr-core\test\J1\temp\solr.handler.admin.CoreAdminCreateDiscoverTest_C26E39E403BB9A3-001\tempDir-001\sys_props\data_diff\]
   [junit4]   2> 944810 INFO  (TEST-CoreAdminCreateDiscoverTest.testCreateSavesSysProps-seed#[C26E39E403BB9A3]) [    x:duplicate] o.a.s.u.RandomMergePolicy RandomMergePolicy wrapping class org.apache.lucene.index.TieredMergePolicy: [TieredMergePolicy: maxMergeAtOnce=17, maxMergeAtOnceExplicit=39, maxMergedSegmentMB=26.0322265625, floorSegmentMB=1.40625, forceMergeDeletesPctAllowed=29.732437116269725, segmentsPerTier=21.0, maxCFSSegmentSizeMB=8.796093022207999E12, noCFSRatio=0.6945819299345755
   [junit4]   2> 944966 INFO  (TEST-CoreAdminCreateDiscoverTest.testCreateSavesSysProps-seed#[C26E39E403BB9A3]) [    x:duplicate] o.a.s.u.CommitTracker Hard AutoCommit: disabled
   [junit4]   2> 944966 INFO  (TEST-CoreAdminCreateDiscoverTest.testCreateSavesSysProps-seed#[C26E39E403BB9A3]) [    x:duplicate] o.a.s.u.CommitTracker Soft AutoCommit: disabled
   [junit4]   2> 944967 INFO  (TEST-CoreAdminCreateDiscoverTest.testCreateSavesSysProps-seed#[C26E39E403BB9A3]) [    x:duplicate] o.a.s.u.RandomMergePolicy RandomMergePolicy wrapping class org.apache.lucene.index.AlcoholicMergePolicy: [AlcoholicMergePolicy: minMergeSize=0, mergeFactor=10, maxMergeSize=1358743954, maxMergeSizeForForcedMerge=9223372036854775807, calibrateSizeByDeletes=true, maxMergeDocs=2147483647, maxCFSSegmentSizeMB=8.796093022207999E12, noCFSRatio=0.1]
   [junit4]   2> 944968 INFO  (TEST-CoreAdminCreateDiscoverTest.testCreateSavesSysProps-seed#[C26E39E403BB9A3]) [    x:duplicate] o.a.s.s.SolrIndexSearcher Opening [Searcher@61471[sys_props] main]
   [junit4]   2> 944969 INFO  (TEST-CoreAdminCreateDiscoverTest.testCreateSavesSysProps-seed#[C26E39E403BB9A3]) [    x:duplicate] o.a.s.r.ManagedResourceStorage File-based storage initialized to use dir: C:\Users\jenkins\workspace\Lucene-Solr-6.x-Windows\solr\build\solr-core\test\J1\temp\solr.handler.admin.CoreAdminCreateDiscoverTest_C26E39E403BB9A3-001\tempDir-001\sys_props\conf
   [junit4]   2> 944971 INFO  (TEST-CoreAdminCreateDiscoverTest.testCreateSavesSysProps-seed#[C26E39E403BB9A3]) [    x:duplicate] o.a.s.h.ReplicationHandler Commits will be reserved for  10000
   [junit4]   2> 944973 INFO  (searcherExecutor-2054-thread-1-processing-x:duplicate) [    x:duplicate] o.a.s.c.SolrCore [sys_props] Registered new searcher Searcher@61471[sys_props] main{ExitableDirectoryReader(UninvertingDirectoryReader())}
   [junit4]   2> 944973 INFO  (TEST-CoreAdminCreateDiscoverTest.testCreateSavesSysProps-seed#[C26E39E403BB9A3]) [    x:duplicate] o.a.s.SolrTestCaseJ4 ###Ending testCreateSavesSysProps
   [junit4]   2> 944983 INFO  (TEST-CoreAdminCreateDiscoverTest.testInstanceDirAsPropertyParam-seed#[C26E39E403BB9A3]) [    x:duplicate] o.a.s.SolrTestCaseJ4 ###Starting testInstanceDirAsPropertyParam
   [junit4]   2> 944993 INFO  (TEST-CoreAdminCreateDiscoverTest.testInstanceDirAsPropertyParam-seed#[C26E39E403BB9A3]) [    x:duplicate] o.a.s.h.a.CoreAdminOperation core create command schema=schema_ren.xml&dataDir=C:\Users\jenkins\workspace\Lucene-Solr-6.x-Windows\solr\build\solr-core\test\J1\temp\solr.handler.admin.CoreAdminCreateDiscoverTest_C26E39E403BB9A3-001\tempDir-001\testInstanceDirAsPropertyParam-XYZ\data&name=testInstanceDirAsPropertyParam&action=CREATE&config=solrconfig_ren.xml&wt=xml&property.instanceDir=C:\Users\jenkins\workspace\Lucene-Solr-6.x-Windows\solr\build\solr-core\test\J1\temp\solr.handler.admin.CoreAdminCreateDiscoverTest_C26E39E403BB9A3-001\tempDir-001\testInstanceDirAsPropertyParam-XYZ
   [junit4]   2> 945040 WARN  (TEST-CoreAdminCreateDiscoverTest.testInstanceDirAsPropertyParam-seed#[C26E39E403BB9A3]) [    x:duplicate] o.a.s.c.Config Beginning with Solr 5.5, <mergePolicy> is deprecated, use <mergePolicyFactory> instead.
   [junit4]   2> 945041 INFO  (TEST-CoreAdminCreateDiscoverTest.testInstanceDirAsPropertyParam-seed#[C26E39E403BB9A3]) [    x:duplicate] o.a.s.c.SolrConfig Using Lucene MatchVersion: 6.6.0
   [junit4]   2> 945063 INFO  (TEST-CoreAdminCreateDiscoverTest.testInstanceDirAsPropertyParam-seed#[C26E39E403BB9A3]) [    x:duplicate] o.a.s.s.IndexSchema [testInstanceDirAsPropertyParam] Schema name=tiny
   [junit4]   2> 945070 INFO  (TEST-CoreAdminCreateDiscoverTest.testInstanceDirAsPropertyParam-seed#[C26E39E403BB9A3]) [    x:duplicate] o.a.s.s.IndexSchema Loaded schema tiny/1.1 with uniqueid field id
   [junit4]   2> 945070 INFO  (TEST-CoreAdminCreateDiscoverTest.testInstanceDirAsPropertyParam-seed#[C26E39E403BB9A3]) [    x:duplicate] o.a.s.c.CoreContainer Creating SolrCore 'testInstanceDirAsPropertyParam' using configuration from instancedir C:\Users\jenkins\workspace\Lucene-Solr-6.x-Windows\solr\build\solr-core\test\J1\temp\solr.handler.admin.CoreAdminCreateDiscoverTest_C26E39E403BB9A3-001\tempDir-001\testInstanceDirAsPropertyParam-XYZ, trusted=true
   [junit4]   2> 945071 INFO  (TEST-CoreAdminCreateDiscoverTest.testInstanceDirAsPropertyParam-seed#[C26E39E403BB9A3]) [    x:duplicate] o.a.s.c.SolrCore solr.RecoveryStrategy.Builder
   [junit4]   2> 945071 INFO  (TEST-CoreAdminCreateDiscoverTest.testInstanceDirAsPropertyParam-seed#[C26E39E403BB9A3]) [    x:duplicate] o.a.s.c.SolrCore [[testInstanceDirAsPropertyParam] ] Opening new SolrCore at [C:\Users\jenkins\workspace\Lucene-Solr-6.x-Windows\solr\build\solr-core\test\J1\temp\solr.handler.admin.CoreAdminCreateDiscoverTest_C26E39E403BB9A3-001\tempDir-001\testInstanceDirAsPropertyParam-XYZ], dataDir=[C:\Users\jenkins\workspace\Lucene-Solr-6.x-Windows\solr\build\solr-core\test\J1\temp\solr.handler.admin.CoreAdminCreateDiscoverTest_C26E39E403BB9A3-001\tempDir-001\testInstanceDirAsPropertyParam-XYZ\data\]
   [junit4]   2> 945078 INFO  (TEST-CoreAdminCreateDiscoverTest.testInstanceDirAsPropertyParam-seed#[C26E39E403BB9A3]) [    x:duplicate] o.a.s.u.RandomMergePolicy RandomMergePolicy wrapping class org.apache.lucene.index.LogDocMergePolicy: [LogDocMergePolicy: minMergeSize=1000, mergeFactor=26, maxMergeSize=9223372036854775807, maxMergeSizeForForcedMerge=9223372036854775807, calibrateSizeByDeletes=false, maxMergeDocs=2147483647, maxCFSSegmentSizeMB=8.796093022207999E12, noCFSRatio=0.0]
   [junit4]   2> 945212 INFO  (TEST-CoreAdminCreateDiscoverTest.testInstanceDirAsPropertyParam-seed#[C26E39E403BB9A3]) [    x:duplicate] o.a.s.u.CommitTracker Hard AutoCommit: disabled
   [junit4]   2> 945212 INFO  (TEST-CoreAdminCreateDiscoverTest.testInstanceDirAsPropertyParam-seed#[C26E39E403BB9A3]) [    x:duplicate] o.a.s.u.CommitTracker Soft AutoCommit: disabled
   [junit4]   2> 945213 INFO  (TEST-CoreAdminCreateDiscoverTest.testInstanceDirAsPropertyParam-seed#[C26E39E403BB9A3]) [    x:duplicate] o.a.s.u.RandomMergePolicy RandomMergePolicy wrapping class org.apache.lucene.index.TieredMergePolicy: [TieredMergePolicy: maxMergeAtOnce=46, maxMergeAtOnceExplicit=21, maxMergedSegmentMB=65.0751953125, floorSegmentMB=1.9375, forceMergeDeletesPctAllowed=22.747356909878494, segmentsPerTier=46.0, maxCFSSegmentSizeMB=8.796093022207999E12, noCFSRatio=1.0
   [junit4]   2> 945214 INFO  (TEST-CoreAdminCreateDiscoverTest.testInstanceDirAsPropertyParam-seed#[C26E39E403BB9A3]) [    x:duplicate] o.a.s.s.SolrIndexSearcher Opening [Searcher@2fd6c3[testInstanceDirAsPropertyParam] main]
   [junit4]   2> 945215 INFO  (TEST-CoreAdminCreateDiscoverTest.testInstanceDirAsPropertyParam-seed#[C26E39E403BB9A3]) [    x:duplicate] o.a.s.r.ManagedResourceStorage File-based storage initialized to use dir: C:\Users\jenkins\workspace\Lucene-Solr-6.x-Windows\solr\build\solr-core\test\J1\temp\solr.handler.admin.CoreAdminCreateDiscoverTest_C26E39E403BB9A3-001\tempDir-001\testInstanceDirAsPropertyParam-XYZ\conf
   [junit4]   2> 945216 INFO  (TEST-CoreAdminCreateDiscoverTest.testInstanceDirAsPropertyParam-seed#[C26E39E403BB9A3]) [    x:duplicate] o.a.s.h.ReplicationHandler Commits will be reserved for  10000
   [junit4]   2> 945217 INFO  (searcherExecutor-2058-thread-1-processing-x:duplicate) [    x:duplicate] o.a.s.c.SolrCore [testInstanceDirAsPropertyParam] Registered new searcher Searcher@2fd6c3[testInstanceDirAsPropertyParam] main{ExitableDirectoryReader(UninvertingDirectoryReader())}
   [junit4]   2> 945219 INFO  (TEST-CoreAdminCreateDiscoverTest.testInstanceDirAsPropertyParam-seed#[C26E39E403BB9A3]) [    x:duplicate] o.a.s.SolrTestCaseJ4 ###Ending testInstanceDirAsPropertyParam
   [junit4]   2> 945220 INFO  (SUITE-CoreAdminCreateDiscoverTest-seed#[C26E39E403BB9A3]-worker) [    x:duplicate] o.a.s.SolrTestCaseJ4 ###deleteCore
   [junit4]   2> 945220 INFO  (SUITE-CoreAdminCreateDiscoverTest-seed#[C26E39E403BB9A3]-worker) [    x:duplicate] o.a.s.c.CoreContainer Shutting down CoreContainer instance=7295034
   [junit4]   2> 945221 INFO  (coreCloseExecutor-2062-thread-1-processing-x:duplicate) [    x:duplicate] o.a.s.c.SolrCore [duplicate]  CLOSING SolrCore org.apache.solr.core.SolrCore@10aba2
   [junit4]   2> 945221 INFO  (coreCloseExecutor-2062-thread-2-processing-x:duplicate) [    x:different_name_core] o.a.s.c.SolrCore [different_name_core]  CLOSING SolrCore org.apache.solr.core.SolrCore@dad524
   [junit4]   2> 945221 INFO  (coreCloseExecutor-2062-thread-3-processing-x:duplicate) [    x:normal] o.a.s.c.SolrCore [normal]  CLOSING SolrCore org.apache.solr.core.SolrCore@130f2c
   [junit4]   2> 945221 INFO  (coreCloseExecutor-2062-thread-4-processing-x:duplicate) [    x:sys_props] o.a.s.c.SolrCore [sys_props]  CLOSING SolrCore org.apache.solr.core.SolrCore@1d781a0
   [junit4]   2> 945223 INFO  (coreCloseExecutor-2062-thread-5-processing-x:duplicate) [    x:testInstanceDirAsPropertyParam] o.a.s.c.SolrCore [testInstanceDirAsPropertyParam]  CLOSING SolrCore org.apache.solr.core.SolrCore@afd922
   [junit4]   2> 945231 INFO  (coreCloseExecutor-2062-thread-5-processing-x:duplicate) [    x:testInstanceDirAsPropertyParam] o.a.s.m.SolrMetricManager Closing metric reporters for: solr.core.testInstanceDirAsPropertyParam
   [junit4]   2> 945236 INFO  (coreCloseExecutor-2062-thread-3-processing-x:duplicate) [    x:normal] o.a.s.m.SolrMetricManager Closing metric reporters for: solr.core.normal
   [junit4]   2> 945238 INFO  (coreCloseExecutor-2062-thread-2-processing-x:duplicate) [    x:different_name_core] o.a.s.m.SolrMetricManager Closing metric reporters for: solr.core.different_name_core
   [junit4]   2> 945240 INFO  (coreCloseExecutor-2062-thread-1-processing-x:duplicate) [    x:duplicate] o.a.s.m.SolrMetricManager Closing metric reporters for: solr.core.duplicate
   [junit4]   2> 945241 INFO  (coreCloseExecutor-2062-thread-4-processing-x:duplicate) [    x:sys_props] o.a.s.m.SolrMetricManager Closing metric reporters for: solr.core.sys_props
   [junit4]   2> 945243 INFO  (SUITE-CoreAdminCreateDiscoverTest-seed#[C26E39E403BB9A3]-worker) [    x:duplicate] o.a.s.m.SolrMetricManager Closing metric reporters for: solr.node
   [junit4]   2> 945243 INFO  (SUITE-CoreAdminCreateDiscoverTest-seed#[C26E39E403BB9A3]-worker) [    x:duplicate] o.a.s.SolrTestCaseJ4 ------------------------------------------------------- Done waiting for tracked resources to be released
   [junit4]   2> Apr 07, 2017 8:32:58 AM com.carrotsearch.randomizedtesting.ThreadLeakControl checkThreadLeaks
   [junit4]   2> WARNING: Will linger awaiting termination of 1 leaked thread(s).
   [junit4]   2> NOTE: test params are: codec=Asserting(Lucene62): {}, docValues:{}, maxPointsInLeafNode=490, maxMBSortInHeap=5.108132565409839, sim=RandomSimilarity(queryNorm=true,coord=yes): {}, locale=es-CL, timezone=Pacific/Honolulu
   [junit4]   2> NOTE: Windows 10 10.0 x86/Oracle Corporation 1.8.0_121 (32-bit)/cpus=3,threads=1,free=94028344,total=253849600
   [junit4]   2> NOTE: All tests run in this JVM: [TestRecoveryHdfs, TestBlobHandler, DistribCursorPagingTest, TestRawResponseWriter, ShardRoutingCustomTest, BadIndexSchemaTest, TestCopyFieldCollectionResource, FieldMutatingUpdateProcessorTest, SolrMetricManagerTest, ShardSplitTest, TestObjectReleaseTracker, TestExclusionRuleCollectionAccess, TestFieldSortValues, AliasIntegrationTest, TestLMJelinekMercerSimilarityFactory, TestStressCloudBlindAtomicUpdates, TestStandardQParsers, TestSolrQueryParser, DistributedVersionInfoTest, OpenCloseCoreStressTest, TestSuggestSpellingConverter, TestDocSet, TestFieldTypeCollectionResource, BigEndianAscendingWordSerializerTest, OverseerCollectionConfigSetProcessorTest, CoreAdminHandlerTest, WordBreakSolrSpellCheckerTest, HdfsChaosMonkeyNothingIsSafeTest, TestUseDocValuesAsStored, ChangedSchemaMergeTest, TestZkChroot, StatsReloadRaceTest, BlockDirectoryTest, BasicZkTest, UpdateRequestProcessorFactoryTest, SpatialRPTFieldTypeTest, HdfsBasicDistributedZk2Test, TestCryptoKeys, TolerantUpdateProcessorTest, TestSolrQueryParserResource, VersionInfoTest, CoreAdminCreateDiscoverTest]
   [junit4]   2> NOTE: reproduce with: ant test  -Dtestcase=CoreAdminCreateDiscoverTest -Dtests.seed=C26E39E403BB9A3 -Dtests.slow=true -Dtests.locale=es-CL -Dtests.timezone=Pacific/Honolulu -Dtests.asserts=true -Dtests.file.encoding=Cp1252
   [junit4] ERROR   0.00s J1 | CoreAdminCreateDiscoverTest (suite) <<<
   [junit4]    > Throwable #1: java.io.IOException: Could not remove the following files (in the order of attempts):
   [junit4]    >    C:\Users\jenkins\workspace\Lucene-Solr-6.x-Windows\solr\build\solr-core\test\J1\temp\solr.handler.admin.CoreAdminCreateDiscoverTest_C26E39E403BB9A3-001\tempDir-001\duplicate: java.nio.file.DirectoryNotEmptyException: C:\Users\jenkins\workspace\Lucene-Solr-6.x-Windows\solr\build\solr-core\test\J1\temp\solr.handler.admin.CoreAdminCreateDiscoverTest_C26E39E403BB9A3-001\tempDir-001\duplicate
   [junit4]    >    C:\Users\jenkins\workspace\Lucene-Solr-6.x-Windows\solr\build\solr-core\test\J1\temp\solr.handler.admin.CoreAdminCreateDiscoverTest_C26E39E403BB9A3-001\tempDir-001: java.nio.file.DirectoryNotEmptyException: C:\Users\jenkins\workspace\Lucene-Solr-6.x-Windows\solr\build\solr-core\test\J1\temp\solr.handler.admin.CoreAdminCreateDiscoverTest_C26E39E403BB9A3-001\tempDir-001
   [junit4]    >    C:\Users\jenkins\workspace\Lucene-Solr-6.x-Windows\solr\build\solr-core\test\J1\temp\solr.handler.admin.CoreAdminCreateDiscoverTest_C26E39E403BB9A3-001\tempDir-001\duplicate\data: java.nio.file.AccessDeniedException: C:\Users\jenkins\workspace\Lucene-Solr-6.x-Windows\solr\build\solr-core\test\J1\temp\solr.handler.admin.CoreAdminCreateDiscoverTest_C26E39E403BB9A3-001\tempDir-001\duplicate\data
   [junit4]    >    C:\Users\jenkins\workspace\Lucene-Solr-6.x-Windows\solr\build\solr-core\test\J1\temp\solr.handler.admin.CoreAdminCreateDiscoverTest_C26E39E403BB9A3-001: java.nio.file.DirectoryNotEmptyException: C:\Users\jenkins\workspace\Lucene-Solr-6.x-Windows\solr\build\solr-core\test\J1\temp\solr.handler.admin.CoreAdminCreateDiscoverTest_C26E39E403BB9A3-001
   [junit4]    > 	at __randomizedtesting.SeedInfo.seed([C26E39E403BB9A3]:0)
   [junit4]    > 	at org.apache.lucene.util.IOUtils.rm(IOUtils.java:323)
   [junit4]    > 	at java.lang.Thread.run(Thread.java:745)
   [junit4] Completed [136/703 (2!)] on J1 in 1.92s, 4 tests, 1 error <<< FAILURES!

[...truncated 41266 lines...]


Mime
View raw message