lucene-dev mailing list archives

Site index · List index
Message view « Date » · « Thread »
Top « Date » · « Thread »
From Apache Jenkins Server <jenk...@builds.apache.org>
Subject [JENKINS] Lucene-Solr-Tests-master - Build # 1775 - Unstable
Date Wed, 19 Apr 2017 00:39:16 GMT
Build: https://builds.apache.org/job/Lucene-Solr-Tests-master/1775/

1 tests failed.
FAILED:  org.apache.solr.update.AutoCommitTest.testCommitWithin

Error Message:
Exception during query

Stack Trace:
java.lang.RuntimeException: Exception during query
	at __randomizedtesting.SeedInfo.seed([99AD8954415D9E27:237FE62CC2737032]:0)
	at org.apache.solr.SolrTestCaseJ4.assertQ(SolrTestCaseJ4.java:896)
	at org.apache.solr.update.AutoCommitTest.testCommitWithin(AutoCommitTest.java:353)
	at sun.reflect.NativeMethodAccessorImpl.invoke0(Native Method)
	at sun.reflect.NativeMethodAccessorImpl.invoke(NativeMethodAccessorImpl.java:62)
	at sun.reflect.DelegatingMethodAccessorImpl.invoke(DelegatingMethodAccessorImpl.java:43)
	at java.lang.reflect.Method.invoke(Method.java:498)
	at com.carrotsearch.randomizedtesting.RandomizedRunner.invoke(RandomizedRunner.java:1713)
	at com.carrotsearch.randomizedtesting.RandomizedRunner$8.evaluate(RandomizedRunner.java:907)
	at com.carrotsearch.randomizedtesting.RandomizedRunner$9.evaluate(RandomizedRunner.java:943)
	at com.carrotsearch.randomizedtesting.RandomizedRunner$10.evaluate(RandomizedRunner.java:957)
	at com.carrotsearch.randomizedtesting.rules.SystemPropertiesRestoreRule$1.evaluate(SystemPropertiesRestoreRule.java:57)
	at org.apache.lucene.util.TestRuleSetupTeardownChained$1.evaluate(TestRuleSetupTeardownChained.java:49)
	at org.apache.lucene.util.AbstractBeforeAfterRule$1.evaluate(AbstractBeforeAfterRule.java:45)
	at org.apache.lucene.util.TestRuleThreadAndTestName$1.evaluate(TestRuleThreadAndTestName.java:48)
	at org.apache.lucene.util.TestRuleIgnoreAfterMaxFailures$1.evaluate(TestRuleIgnoreAfterMaxFailures.java:64)
	at org.apache.lucene.util.TestRuleMarkFailure$1.evaluate(TestRuleMarkFailure.java:47)
	at com.carrotsearch.randomizedtesting.rules.StatementAdapter.evaluate(StatementAdapter.java:36)
	at com.carrotsearch.randomizedtesting.ThreadLeakControl$StatementRunner.run(ThreadLeakControl.java:368)
	at com.carrotsearch.randomizedtesting.ThreadLeakControl.forkTimeoutingTask(ThreadLeakControl.java:817)
	at com.carrotsearch.randomizedtesting.ThreadLeakControl$3.evaluate(ThreadLeakControl.java:468)
	at com.carrotsearch.randomizedtesting.RandomizedRunner.runSingleTest(RandomizedRunner.java:916)
	at com.carrotsearch.randomizedtesting.RandomizedRunner$5.evaluate(RandomizedRunner.java:802)
	at com.carrotsearch.randomizedtesting.RandomizedRunner$6.evaluate(RandomizedRunner.java:852)
	at com.carrotsearch.randomizedtesting.RandomizedRunner$7.evaluate(RandomizedRunner.java:863)
	at com.carrotsearch.randomizedtesting.rules.StatementAdapter.evaluate(StatementAdapter.java:36)
	at com.carrotsearch.randomizedtesting.rules.SystemPropertiesRestoreRule$1.evaluate(SystemPropertiesRestoreRule.java:57)
	at org.apache.lucene.util.AbstractBeforeAfterRule$1.evaluate(AbstractBeforeAfterRule.java:45)
	at com.carrotsearch.randomizedtesting.rules.StatementAdapter.evaluate(StatementAdapter.java:36)
	at org.apache.lucene.util.TestRuleStoreClassName$1.evaluate(TestRuleStoreClassName.java:41)
	at com.carrotsearch.randomizedtesting.rules.NoShadowingOrOverridesOnMethodsRule$1.evaluate(NoShadowingOrOverridesOnMethodsRule.java:40)
	at com.carrotsearch.randomizedtesting.rules.NoShadowingOrOverridesOnMethodsRule$1.evaluate(NoShadowingOrOverridesOnMethodsRule.java:40)
	at com.carrotsearch.randomizedtesting.rules.StatementAdapter.evaluate(StatementAdapter.java:36)
	at com.carrotsearch.randomizedtesting.rules.StatementAdapter.evaluate(StatementAdapter.java:36)
	at com.carrotsearch.randomizedtesting.rules.StatementAdapter.evaluate(StatementAdapter.java:36)
	at org.apache.lucene.util.TestRuleAssertionsRequired$1.evaluate(TestRuleAssertionsRequired.java:53)
	at org.apache.lucene.util.TestRuleMarkFailure$1.evaluate(TestRuleMarkFailure.java:47)
	at org.apache.lucene.util.TestRuleIgnoreAfterMaxFailures$1.evaluate(TestRuleIgnoreAfterMaxFailures.java:64)
	at org.apache.lucene.util.TestRuleIgnoreTestSuites$1.evaluate(TestRuleIgnoreTestSuites.java:54)
	at com.carrotsearch.randomizedtesting.rules.StatementAdapter.evaluate(StatementAdapter.java:36)
	at com.carrotsearch.randomizedtesting.ThreadLeakControl$StatementRunner.run(ThreadLeakControl.java:368)
	at java.lang.Thread.run(Thread.java:745)
Caused by: java.lang.RuntimeException: REQUEST FAILED: xpath=//result[@numFound=1]
	xml response was: <?xml version="1.0" encoding="UTF-8"?>
<response>
<lst name="responseHeader"><int name="status">0</int><int name="QTime">0</int></lst><result name="response" numFound="0" start="0"></result>
</response>

	request was:q=id:529&qt=standard&start=0&rows=20&version=2.2
	at org.apache.solr.SolrTestCaseJ4.assertQ(SolrTestCaseJ4.java:889)
	... 40 more




Build Log:
[...truncated 11606 lines...]
   [junit4] Suite: org.apache.solr.update.AutoCommitTest
   [junit4]   2> Creating dataDir: /x1/jenkins/jenkins-slave/workspace/Lucene-Solr-Tests-master/solr/build/solr-core/test/J2/temp/solr.update.AutoCommitTest_99AD8954415D9E27-001/init-core-data-001
   [junit4]   2> 895029 WARN  (SUITE-AutoCommitTest-seed#[99AD8954415D9E27]-worker) [    ] o.a.s.SolrTestCaseJ4 startTrackingSearchers: numOpens=14 numCloses=14
   [junit4]   2> 895030 INFO  (SUITE-AutoCommitTest-seed#[99AD8954415D9E27]-worker) [    ] o.a.s.SolrTestCaseJ4 Using TrieFields
   [junit4]   2> 895031 INFO  (SUITE-AutoCommitTest-seed#[99AD8954415D9E27]-worker) [    ] o.a.s.SolrTestCaseJ4 Randomized ssl (false) and clientAuth (false) via: @org.apache.solr.util.RandomizeSSL(reason=, ssl=NaN, value=NaN, clientAuth=NaN)
   [junit4]   2> 895031 INFO  (SUITE-AutoCommitTest-seed#[99AD8954415D9E27]-worker) [    ] o.a.s.SolrTestCaseJ4 ####initCore
   [junit4]   2> 895032 INFO  (SUITE-AutoCommitTest-seed#[99AD8954415D9E27]-worker) [    ] o.a.s.c.SolrResourceLoader [null] Added 2 libs to classloader, from paths: [/x1/jenkins/jenkins-slave/workspace/Lucene-Solr-Tests-master/solr/core/src/test-files/solr/collection1/lib, /x1/jenkins/jenkins-slave/workspace/Lucene-Solr-Tests-master/solr/core/src/test-files/solr/collection1/lib/classes]
   [junit4]   2> 895069 WARN  (SUITE-AutoCommitTest-seed#[99AD8954415D9E27]-worker) [    ] o.a.s.c.Config Beginning with Solr 5.5, <mergePolicy> is deprecated, use <mergePolicyFactory> instead.
   [junit4]   2> 895070 INFO  (SUITE-AutoCommitTest-seed#[99AD8954415D9E27]-worker) [    ] o.a.s.c.SolrConfig Using Lucene MatchVersion: 7.0.0
   [junit4]   2> 895095 INFO  (SUITE-AutoCommitTest-seed#[99AD8954415D9E27]-worker) [    ] o.a.s.s.IndexSchema [null] Schema name=test
   [junit4]   2> 895213 WARN  (SUITE-AutoCommitTest-seed#[99AD8954415D9E27]-worker) [    ] o.a.s.s.IndexSchema [null] default search field in schema is text. WARNING: Deprecated, please use 'df' on request instead.
   [junit4]   2> 895216 INFO  (SUITE-AutoCommitTest-seed#[99AD8954415D9E27]-worker) [    ] o.a.s.s.IndexSchema Loaded schema test/1.0 with uniqueid field id
   [junit4]   2> 895269 INFO  (SUITE-AutoCommitTest-seed#[99AD8954415D9E27]-worker) [    ] o.a.s.m.r.SolrJmxReporter JMX monitoring for 'solr.node' (registry 'solr.node') enabled at server: com.sun.jmx.mbeanserver.JmxMBeanServer@5631b867
   [junit4]   2> 895274 INFO  (SUITE-AutoCommitTest-seed#[99AD8954415D9E27]-worker) [    ] o.a.s.m.r.SolrJmxReporter JMX monitoring for 'solr.jvm' (registry 'solr.jvm') enabled at server: com.sun.jmx.mbeanserver.JmxMBeanServer@5631b867
   [junit4]   2> 895274 INFO  (SUITE-AutoCommitTest-seed#[99AD8954415D9E27]-worker) [    ] o.a.s.m.r.SolrJmxReporter JMX monitoring for 'solr.jetty' (registry 'solr.jetty') enabled at server: com.sun.jmx.mbeanserver.JmxMBeanServer@5631b867
   [junit4]   2> 895276 INFO  (coreLoadExecutor-2461-thread-1) [    x:collection1] o.a.s.c.SolrResourceLoader [null] Added 2 libs to classloader, from paths: [/x1/jenkins/jenkins-slave/workspace/Lucene-Solr-Tests-master/solr/core/src/test-files/solr/collection1/lib, /x1/jenkins/jenkins-slave/workspace/Lucene-Solr-Tests-master/solr/core/src/test-files/solr/collection1/lib/classes]
   [junit4]   2> 895313 WARN  (coreLoadExecutor-2461-thread-1) [    x:collection1] o.a.s.c.Config Beginning with Solr 5.5, <mergePolicy> is deprecated, use <mergePolicyFactory> instead.
   [junit4]   2> 895315 INFO  (coreLoadExecutor-2461-thread-1) [    x:collection1] o.a.s.c.SolrConfig Using Lucene MatchVersion: 7.0.0
   [junit4]   2> 895339 INFO  (coreLoadExecutor-2461-thread-1) [    x:collection1] o.a.s.s.IndexSchema [collection1] Schema name=test
   [junit4]   2> 895457 WARN  (coreLoadExecutor-2461-thread-1) [    x:collection1] o.a.s.s.IndexSchema [collection1] default search field in schema is text. WARNING: Deprecated, please use 'df' on request instead.
   [junit4]   2> 895459 INFO  (coreLoadExecutor-2461-thread-1) [    x:collection1] o.a.s.s.IndexSchema Loaded schema test/1.0 with uniqueid field id
   [junit4]   2> 895466 INFO  (coreLoadExecutor-2461-thread-1) [    x:collection1] o.a.s.c.CoreContainer Creating SolrCore 'collection1' using configuration from instancedir /x1/jenkins/jenkins-slave/workspace/Lucene-Solr-Tests-master/solr/core/src/test-files/solr/collection1, trusted=true
   [junit4]   2> 895466 INFO  (coreLoadExecutor-2461-thread-1) [    x:collection1] o.a.s.m.r.SolrJmxReporter JMX monitoring for 'solr.core.collection1' (registry 'solr.core.collection1') enabled at server: com.sun.jmx.mbeanserver.JmxMBeanServer@5631b867
   [junit4]   2> 895467 INFO  (coreLoadExecutor-2461-thread-1) [    x:collection1] o.a.s.c.SolrCore solr.RecoveryStrategy.Builder
   [junit4]   2> 895467 INFO  (coreLoadExecutor-2461-thread-1) [    x:collection1] o.a.s.c.SolrCore [[collection1] ] Opening new SolrCore at [/x1/jenkins/jenkins-slave/workspace/Lucene-Solr-Tests-master/solr/core/src/test-files/solr/collection1], dataDir=[/x1/jenkins/jenkins-slave/workspace/Lucene-Solr-Tests-master/solr/build/solr-core/test/J2/temp/solr.update.AutoCommitTest_99AD8954415D9E27-001/init-core-data-001/]
   [junit4]   2> 895469 INFO  (coreLoadExecutor-2461-thread-1) [    x:collection1] o.a.s.u.RandomMergePolicy RandomMergePolicy wrapping class org.apache.lucene.index.TieredMergePolicy: [TieredMergePolicy: maxMergeAtOnce=37, maxMergeAtOnceExplicit=47, maxMergedSegmentMB=10.9560546875, floorSegmentMB=1.2958984375, forceMergeDeletesPctAllowed=12.181894932934876, segmentsPerTier=48.0, maxCFSSegmentSizeMB=8.796093022207999E12, noCFSRatio=0.47983326777750035
   [junit4]   2> 895595 INFO  (coreLoadExecutor-2461-thread-1) [    x:collection1] o.a.s.u.UpdateHandler Using UpdateLog implementation: org.apache.solr.update.UpdateLog
   [junit4]   2> 895596 INFO  (coreLoadExecutor-2461-thread-1) [    x:collection1] o.a.s.u.UpdateLog Initializing UpdateLog: dataDir= defaultSyncLevel=FLUSH numRecordsToKeep=100 maxNumLogsToKeep=10 numVersionBuckets=65536
   [junit4]   2> 895597 INFO  (coreLoadExecutor-2461-thread-1) [    x:collection1] o.a.s.u.CommitTracker Hard AutoCommit: disabled
   [junit4]   2> 895597 INFO  (coreLoadExecutor-2461-thread-1) [    x:collection1] o.a.s.u.CommitTracker Soft AutoCommit: disabled
   [junit4]   2> 895598 INFO  (coreLoadExecutor-2461-thread-1) [    x:collection1] o.a.s.u.RandomMergePolicy RandomMergePolicy wrapping class org.apache.lucene.index.TieredMergePolicy: [TieredMergePolicy: maxMergeAtOnce=14, maxMergeAtOnceExplicit=42, maxMergedSegmentMB=90.294921875, floorSegmentMB=1.6396484375, forceMergeDeletesPctAllowed=13.223040614813025, segmentsPerTier=26.0, maxCFSSegmentSizeMB=8.796093022207999E12, noCFSRatio=0.8350331255169214
   [junit4]   2> 895598 INFO  (coreLoadExecutor-2461-thread-1) [    x:collection1] o.a.s.s.SolrIndexSearcher Opening [Searcher@7494a437[collection1] main]
   [junit4]   2> 895599 INFO  (coreLoadExecutor-2461-thread-1) [    x:collection1] o.a.s.h.c.SpellCheckComponent Initializing spell checkers
   [junit4]   2> 895606 INFO  (coreLoadExecutor-2461-thread-1) [    x:collection1] o.a.s.s.DirectSolrSpellChecker init: {name=direct,classname=DirectSolrSpellChecker,field=lowerfilt,minQueryLength=3}
   [junit4]   2> 895641 INFO  (coreLoadExecutor-2461-thread-1) [    x:collection1] o.a.s.h.ReplicationHandler Commits will be reserved for  10000
   [junit4]   2> 895642 INFO  (searcherExecutor-2462-thread-1-processing-x:collection1) [    x:collection1] o.a.s.h.c.SpellCheckComponent Loading spell index for spellchecker: default
   [junit4]   2> 895642 INFO  (searcherExecutor-2462-thread-1-processing-x:collection1) [    x:collection1] o.a.s.h.c.SpellCheckComponent Loading spell index for spellchecker: direct
   [junit4]   2> 895642 INFO  (searcherExecutor-2462-thread-1-processing-x:collection1) [    x:collection1] o.a.s.h.c.SpellCheckComponent Loading spell index for spellchecker: wordbreak
   [junit4]   2> 895642 INFO  (searcherExecutor-2462-thread-1-processing-x:collection1) [    x:collection1] o.a.s.h.c.SpellCheckComponent Loading spell index for spellchecker: multipleFields
   [junit4]   2> 895643 INFO  (searcherExecutor-2462-thread-1-processing-x:collection1) [    x:collection1] o.a.s.h.c.SpellCheckComponent Loading spell index for spellchecker: jarowinkler
   [junit4]   2> 895643 INFO  (searcherExecutor-2462-thread-1-processing-x:collection1) [    x:collection1] o.a.s.h.c.SpellCheckComponent Loading spell index for spellchecker: external
   [junit4]   2> 895643 INFO  (searcherExecutor-2462-thread-1-processing-x:collection1) [    x:collection1] o.a.s.h.c.SpellCheckComponent Loading spell index for spellchecker: freq
   [junit4]   2> 895643 INFO  (searcherExecutor-2462-thread-1-processing-x:collection1) [    x:collection1] o.a.s.h.c.SpellCheckComponent Loading spell index for spellchecker: fqcn
   [junit4]   2> 895643 INFO  (searcherExecutor-2462-thread-1-processing-x:collection1) [    x:collection1] o.a.s.h.c.SpellCheckComponent Loading spell index for spellchecker: perDict
   [junit4]   2> 895645 INFO  (searcherExecutor-2462-thread-1-processing-x:collection1) [    x:collection1] o.a.s.c.SolrCore [collection1] Registered new searcher Searcher@7494a437[collection1] main{ExitableDirectoryReader(UninvertingDirectoryReader())}
   [junit4]   2> 895645 INFO  (coreLoadExecutor-2461-thread-1) [    x:collection1] o.a.s.u.UpdateLog Could not find max version in index or recent updates, using new clock 1565061258762256384
   [junit4]   2> 895649 INFO  (SUITE-AutoCommitTest-seed#[99AD8954415D9E27]-worker) [    ] o.a.s.SolrTestCaseJ4 ####initCore end
   [junit4]   2> 895651 INFO  (TEST-AutoCommitTest.testMaxDocs-seed#[99AD8954415D9E27]) [    ] o.a.s.SolrTestCaseJ4 ###Starting testMaxDocs
   [junit4]   2> 895652 INFO  (TEST-AutoCommitTest.testMaxDocs-seed#[99AD8954415D9E27]) [    ] o.a.s.u.DirectUpdateHandler2 [collection1] REMOVING ALL DOCUMENTS FROM INDEX
   [junit4]   2> 895653 INFO  (TEST-AutoCommitTest.testMaxDocs-seed#[99AD8954415D9E27]) [    ] o.a.s.s.SolrIndexSearcher Opening [Searcher@17c6386d[collection1] realtime]
   [junit4]   2> 895653 INFO  (TEST-AutoCommitTest.testMaxDocs-seed#[99AD8954415D9E27]) [    ] o.a.s.u.p.LogUpdateProcessorFactory [collection1]  webapp=null path=null params={_version_=-9223372036854775807&update.distrib=FROMLEADER&versions=true&wt=json&indent=true}{deleteByQuery=*:* (-9223372036854775807)} 0 1
   [junit4]   2> 895654 ERROR (TEST-AutoCommitTest.testMaxDocs-seed#[99AD8954415D9E27]) [    ] o.a.s.c.CorePropertiesLocator Couldn't load core descriptor from /x1/jenkins/jenkins-slave/workspace/Lucene-Solr-Tests-master/solr/core/src/test-files/solr/collection1/conf/solrcore.properties:java.nio.file.NoSuchFileException: /x1/jenkins/jenkins-slave/workspace/Lucene-Solr-Tests-master/solr/core/src/test-files/solr/collection1/conf/solrcore.properties
   [junit4]   2> 895654 INFO  (TEST-AutoCommitTest.testMaxDocs-seed#[99AD8954415D9E27]) [    ] o.a.s.c.SolrResourceLoader [null] Added 2 libs to classloader, from paths: [/x1/jenkins/jenkins-slave/workspace/Lucene-Solr-Tests-master/solr/core/src/test-files/solr/collection1/lib, /x1/jenkins/jenkins-slave/workspace/Lucene-Solr-Tests-master/solr/core/src/test-files/solr/collection1/lib/classes]
   [junit4]   2> 895703 WARN  (TEST-AutoCommitTest.testMaxDocs-seed#[99AD8954415D9E27]) [    ] o.a.s.c.Config Beginning with Solr 5.5, <mergePolicy> is deprecated, use <mergePolicyFactory> instead.
   [junit4]   2> 895705 INFO  (TEST-AutoCommitTest.testMaxDocs-seed#[99AD8954415D9E27]) [    ] o.a.s.c.SolrConfig Using Lucene MatchVersion: 7.0.0
   [junit4]   2> 895880 INFO  (TEST-AutoCommitTest.testMaxDocs-seed#[99AD8954415D9E27]) [    ] o.a.s.s.IndexSchema [collection1] Schema name=test
   [junit4]   2> 896031 WARN  (TEST-AutoCommitTest.testMaxDocs-seed#[99AD8954415D9E27]) [    ] o.a.s.s.IndexSchema [collection1] default search field in schema is text. WARNING: Deprecated, please use 'df' on request instead.
   [junit4]   2> 896033 INFO  (TEST-AutoCommitTest.testMaxDocs-seed#[99AD8954415D9E27]) [    ] o.a.s.s.IndexSchema Loaded schema test/1.0 with uniqueid field id
   [junit4]   2> 896039 INFO  (TEST-AutoCommitTest.testMaxDocs-seed#[99AD8954415D9E27]) [    ] o.a.s.c.CoreContainer Reloading SolrCore 'collection1' using configuration from instancedir /x1/jenkins/jenkins-slave/workspace/Lucene-Solr-Tests-master/solr/core/src/test-files/solr/collection1
   [junit4]   2> 896071 INFO  (TEST-AutoCommitTest.testMaxDocs-seed#[99AD8954415D9E27]) [    x:collection1] o.a.s.m.r.SolrJmxReporter JMX monitoring for 'solr.core.collection1' (registry 'solr.core.collection1') enabled at server: com.sun.jmx.mbeanserver.JmxMBeanServer@5631b867
   [junit4]   2> 896072 INFO  (TEST-AutoCommitTest.testMaxDocs-seed#[99AD8954415D9E27]) [    x:collection1] o.a.s.c.SolrCore [[collection1] ] Opening new SolrCore at [/x1/jenkins/jenkins-slave/workspace/Lucene-Solr-Tests-master/solr/core/src/test-files/solr/collection1], dataDir=[/x1/jenkins/jenkins-slave/workspace/Lucene-Solr-Tests-master/solr/build/solr-core/test/J2/temp/solr.update.AutoCommitTest_99AD8954415D9E27-001/init-core-data-001/]
   [junit4]   2> 896171 INFO  (TEST-AutoCommitTest.testMaxDocs-seed#[99AD8954415D9E27]) [    x:collection1] o.a.s.u.CommitTracker Hard AutoCommit: disabled
   [junit4]   2> 896171 INFO  (TEST-AutoCommitTest.testMaxDocs-seed#[99AD8954415D9E27]) [    x:collection1] o.a.s.u.CommitTracker Soft AutoCommit: disabled
   [junit4]   2> 896172 INFO  (TEST-AutoCommitTest.testMaxDocs-seed#[99AD8954415D9E27]) [    x:collection1] o.a.s.s.SolrIndexSearcher Opening [Searcher@3258fbee[collection1] main]
   [junit4]   2> 896173 INFO  (TEST-AutoCommitTest.testMaxDocs-seed#[99AD8954415D9E27]) [    x:collection1] o.a.s.h.c.SpellCheckComponent Initializing spell checkers
   [junit4]   2> 896180 INFO  (TEST-AutoCommitTest.testMaxDocs-seed#[99AD8954415D9E27]) [    x:collection1] o.a.s.s.DirectSolrSpellChecker init: {name=direct,classname=DirectSolrSpellChecker,field=lowerfilt,minQueryLength=3}
   [junit4]   2> 896187 INFO  (TEST-AutoCommitTest.testMaxDocs-seed#[99AD8954415D9E27]) [    x:collection1] o.a.s.h.ReplicationHandler Commits will be reserved for  10000
   [junit4]   2> 896188 INFO  (TEST-AutoCommitTest.testMaxDocs-seed#[99AD8954415D9E27]) [    x:collection1] o.a.s.u.UpdateLog Could not find max version in index or recent updates, using new clock 1565061259331633152
   [junit4]   2> 896198 INFO  (searcherExecutor-2467-thread-1-processing-x:collection1) [    x:collection1] o.a.s.h.c.SpellCheckComponent Loading spell index for spellchecker: default
   [junit4]   2> 896198 INFO  (searcherExecutor-2467-thread-1-processing-x:collection1) [    x:collection1] o.a.s.h.c.SpellCheckComponent Loading spell index for spellchecker: direct
   [junit4]   2> 896199 INFO  (searcherExecutor-2467-thread-1-processing-x:collection1) [    x:collection1] o.a.s.h.c.SpellCheckComponent Loading spell index for spellchecker: wordbreak
   [junit4]   2> 896199 INFO  (searcherExecutor-2467-thread-1-processing-x:collection1) [    x:collection1] o.a.s.h.c.SpellCheckComponent Loading spell index for spellchecker: multipleFields
   [junit4]   2> 896199 INFO  (searcherExecutor-2467-thread-1-processing-x:collection1) [    x:collection1] o.a.s.h.c.SpellCheckComponent Loading spell index for spellchecker: jarowinkler
   [junit4]   2> 896199 INFO  (searcherExecutor-2467-thread-1-processing-x:collection1) [    x:collection1] o.a.s.h.c.SpellCheckComponent Loading spell index for spellchecker: external
   [junit4]   2> 896200 INFO  (searcherExecutor-2467-thread-1-processing-x:collection1) [    x:collection1] o.a.s.h.c.SpellCheckComponent Loading spell index for spellchecker: freq
   [junit4]   2> 896200 INFO  (searcherExecutor-2467-thread-1-processing-x:collection1) [    x:collection1] o.a.s.h.c.SpellCheckComponent Loading spell index for spellchecker: fqcn
   [junit4]   2> 896200 INFO  (searcherExecutor-2467-thread-1-processing-x:collection1) [    x:collection1] o.a.s.h.c.SpellCheckComponent Loading spell index for spellchecker: perDict
   [junit4]   2> 896203 INFO  (searcherExecutor-2467-thread-1-processing-x:collection1) [    x:collection1] o.a.s.c.SolrCore [collection1] Registered new searcher Searcher@3258fbee[collection1] main{ExitableDirectoryReader(UninvertingDirectoryReader())}
   [junit4]   2> 896220 INFO  (TEST-AutoCommitTest.testMaxDocs-seed#[99AD8954415D9E27]) [    x:collection1] o.a.s.u.RandomMergePolicy RandomMergePolicy wrapping class org.apache.lucene.index.LogByteSizeMergePolicy: [LogByteSizeMergePolicy: minMergeSize=1677721, mergeFactor=36, maxMergeSize=2147483648, maxMergeSizeForForcedMerge=9223372036854775807, calibrateSizeByDeletes=false, maxMergeDocs=2147483647, maxCFSSegmentSizeMB=8.796093022207999E12, noCFSRatio=0.6384018218426953]
   [junit4]   2> 896221 INFO  (TEST-AutoCommitTest.testMaxDocs-seed#[99AD8954415D9E27]) [    x:collection1] o.a.s.u.DefaultSolrCoreState New IndexWriter is ready to be used.
   [junit4]   2> 896221 INFO  (TEST-AutoCommitTest.testMaxDocs-seed#[99AD8954415D9E27]) [    x:collection1] o.a.s.s.SolrIndexSearcher Opening [Searcher@40f5faf3[collection1] main]
   [junit4]   2> 896221 INFO  (TEST-AutoCommitTest.testMaxDocs-seed#[99AD8954415D9E27]) [    x:collection1] o.a.s.c.SolrCore [collection1]  CLOSING SolrCore org.apache.solr.core.SolrCore@52a203d5
   [junit4]   2> 896224 INFO  (searcherExecutor-2467-thread-1-processing-x:collection1) [    x:collection1] o.a.s.c.SolrCore [collection1] Registered new searcher Searcher@40f5faf3[collection1] main{ExitableDirectoryReader(UninvertingDirectoryReader())}
   [junit4]   2> 896224 INFO  (TEST-AutoCommitTest.testMaxDocs-seed#[99AD8954415D9E27]) [    x:collection1] o.a.s.m.SolrMetricManager Closing metric reporters for registry=solr.core.collection1, tag=1386349525
   [junit4]   2> 896438 INFO  (TEST-AutoCommitTest.testMaxDocs-seed#[99AD8954415D9E27]) [    x:collection1] o.a.s.u.p.LogUpdateProcessorFactory [collection1] {add=[0 (1565061259590631424)]} 0 3
   [junit4]   2> 896439 INFO  (TEST-AutoCommitTest.testMaxDocs-seed#[99AD8954415D9E27]) [    x:collection1] o.a.s.u.p.LogUpdateProcessorFactory [collection1] {add=[1 (1565061259593777152)]} 0 4
   [junit4]   2> 896439 INFO  (TEST-AutoCommitTest.testMaxDocs-seed#[99AD8954415D9E27]) [    x:collection1] o.a.s.u.p.LogUpdateProcessorFactory [collection1] {add=[2 (1565061259594825728)]} 0 4
   [junit4]   2> 896442 INFO  (TEST-AutoCommitTest.testMaxDocs-seed#[99AD8954415D9E27]) [    x:collection1] o.a.s.u.p.LogUpdateProcessorFactory [collection1] {add=[3 (1565061259594825729)]} 0 7
   [junit4]   2> 896442 INFO  (TEST-AutoCommitTest.testMaxDocs-seed#[99AD8954415D9E27]) [    x:collection1] o.a.s.u.p.LogUpdateProcessorFactory [collection1] {add=[4 (1565061259597971456)]} 0 7
   [junit4]   2> 896443 INFO  (TEST-AutoCommitTest.testMaxDocs-seed#[99AD8954415D9E27]) [    x:collection1] o.a.s.u.p.LogUpdateProcessorFactory [collection1] {add=[5 (1565061259597971457)]} 0 8
   [junit4]   2> 896443 INFO  (TEST-AutoCommitTest.testMaxDocs-seed#[99AD8954415D9E27]) [    x:collection1] o.a.s.u.p.LogUpdateProcessorFactory [collection1] {add=[6 (1565061259599020032)]} 0 8
   [junit4]   2> 896444 INFO  (TEST-AutoCommitTest.testMaxDocs-seed#[99AD8954415D9E27]) [    x:collection1] o.a.s.u.p.LogUpdateProcessorFactory [collection1] {add=[7 (1565061259599020033)]} 0 9
   [junit4]   2> 896444 INFO  (TEST-AutoCommitTest.testMaxDocs-seed#[99AD8954415D9E27]) [    x:collection1] o.a.s.u.p.LogUpdateProcessorFactory [collection1] {add=[8 (1565061259600068608)]} 0 9
   [junit4]   2> 896444 INFO  (TEST-AutoCommitTest.testMaxDocs-seed#[99AD8954415D9E27]) [    x:collection1] o.a.s.u.p.LogUpdateProcessorFactory [collection1] {add=[9 (1565061259600068609)]} 0 9
   [junit4]   2> 896445 INFO  (TEST-AutoCommitTest.testMaxDocs-seed#[99AD8954415D9E27]) [    x:collection1] o.a.s.u.p.LogUpdateProcessorFactory [collection1] {add=[10 (1565061259600068610)]} 0 10
   [junit4]   2> 896448 INFO  (TEST-AutoCommitTest.testMaxDocs-seed#[99AD8954415D9E27]) [    x:collection1] o.a.s.u.p.LogUpdateProcessorFactory [collection1] {add=[11 (1565061259601117184)]} 0 13
   [junit4]   2> 896448 INFO  (TEST-AutoCommitTest.testMaxDocs-seed#[99AD8954415D9E27]) [    x:collection1] o.a.s.u.p.LogUpdateProcessorFactory [collection1] {add=[12 (1565061259604262912)]} 0 13
   [junit4]   2> 896448 INFO  (TEST-AutoCommitTest.testMaxDocs-seed#[99AD8954415D9E27]) [    x:collection1] o.a.s.u.p.LogUpdateProcessorFactory [collection1] {add=[13 (1565061259604262913)]} 0 13
   [junit4]   2> 896449 INFO  (TEST-AutoCommitTest.testMaxDocs-seed#[99AD8954415D9E27]) [    x:collection1] o.a.s.c.S.Request [collection1]  webapp=null path=null params={q=id:1&qt=standard&start=0&rows=20&version=2.2} hits=0 status=0 QTime=0
   [junit4]   2> 896453 INFO  (TEST-AutoCommitTest.testMaxDocs-seed#[99AD8954415D9E27]) [    x:collection1] o.a.s.u.p.LogUpdateProcessorFactory [collection1] {add=[14 (1565061259608457216)]} 0 18
   [junit4]   2> 896456 INFO  (commitScheduler-2470-thread-1) [    x:collection1] o.a.s.u.DirectUpdateHandler2 start commit{,optimize=false,openSearcher=true,waitSearcher=true,expungeDeletes=false,softCommit=true,prepareCommit=false}
   [junit4]   2> 896463 INFO  (commitScheduler-2470-thread-1) [    x:collection1] o.a.s.s.SolrIndexSearcher Opening [Searcher@765a4eb8[collection1] main]
   [junit4]   2> 896465 INFO  (searcherExecutor-2467-thread-1-processing-x:collection1) [    x:collection1] o.a.s.c.SolrCore [collection1] Registered new searcher Searcher@765a4eb8[collection1] main{ExitableDirectoryReader(UninvertingDirectoryReader(Uninverting(_0(7.0.0):c15)))}
   [junit4]   2> 896465 INFO  (commitScheduler-2470-thread-1) [    x:collection1] o.a.s.u.DirectUpdateHandler2 end_commit_flush
   [junit4]   2> 896705 INFO  (TEST-AutoCommitTest.testMaxDocs-seed#[99AD8954415D9E27]) [    x:collection1] o.a.s.u.p.LogUpdateProcessorFactory [collection1] {add=[15 (1565061259872698368)]} 0 270
   [junit4]   2> 896705 INFO  (TEST-AutoCommitTest.testMaxDocs-seed#[99AD8954415D9E27]) [    x:collection1] o.a.s.c.S.Request [collection1]  webapp=null path=null params={q=id:14&qt=standard&start=0&rows=20&version=2.2} hits=1 status=0 QTime=0
   [junit4]   2> 896706 INFO  (TEST-AutoCommitTest.testMaxDocs-seed#[99AD8954415D9E27]) [    x:collection1] o.a.s.c.S.Request [collection1]  webapp=null path=null params={q=id:15&qt=standard&start=0&rows=20&version=2.2} hits=0 status=0 QTime=0
   [junit4]   2> 896707 INFO  (TEST-AutoCommitTest.testMaxDocs-seed#[99AD8954415D9E27]) [    x:collection1] o.a.s.SolrTestCaseJ4 ###Ending testMaxDocs
   [junit4]   2> 896710 INFO  (TEST-AutoCommitTest.testCommitWithin-seed#[99AD8954415D9E27]) [    x:collection1] o.a.s.SolrTestCaseJ4 ###Starting testCommitWithin
   [junit4]   2> 896715 INFO  (TEST-AutoCommitTest.testCommitWithin-seed#[99AD8954415D9E27]) [    x:collection1] o.a.s.u.DirectUpdateHandler2 [collection1] REMOVING ALL DOCUMENTS FROM INDEX
   [junit4]   2> 896716 INFO  (TEST-AutoCommitTest.testCommitWithin-seed#[99AD8954415D9E27]) [    x:collection1] o.a.s.s.SolrIndexSearcher Opening [Searcher@25054c95[collection1] realtime]
   [junit4]   2> 896716 INFO  (TEST-AutoCommitTest.testCommitWithin-seed#[99AD8954415D9E27]) [    x:collection1] o.a.s.u.p.LogUpdateProcessorFactory [collection1]  webapp=null path=null params={_version_=-9223372036854775807&update.distrib=FROMLEADER&versions=true&wt=json&indent=true}{deleteByQuery=*:* (-9223372036854775807)} 0 6
   [junit4]   2> 896716 ERROR (TEST-AutoCommitTest.testCommitWithin-seed#[99AD8954415D9E27]) [    x:collection1] o.a.s.c.CorePropertiesLocator Couldn't load core descriptor from /x1/jenkins/jenkins-slave/workspace/Lucene-Solr-Tests-master/solr/core/src/test-files/solr/collection1/conf/solrcore.properties:java.nio.file.NoSuchFileException: /x1/jenkins/jenkins-slave/workspace/Lucene-Solr-Tests-master/solr/core/src/test-files/solr/collection1/conf/solrcore.properties
   [junit4]   2> 896717 INFO  (TEST-AutoCommitTest.testCommitWithin-seed#[99AD8954415D9E27]) [    x:collection1] o.a.s.c.SolrResourceLoader [null] Added 2 libs to classloader, from paths: [/x1/jenkins/jenkins-slave/workspace/Lucene-Solr-Tests-master/solr/core/src/test-files/solr/collection1/lib, /x1/jenkins/jenkins-slave/workspace/Lucene-Solr-Tests-master/solr/core/src/test-files/solr/collection1/lib/classes]
   [junit4]   2> 896748 WARN  (TEST-AutoCommitTest.testCommitWithin-seed#[99AD8954415D9E27]) [    x:collection1] o.a.s.c.Config Beginning with Solr 5.5, <mergePolicy> is deprecated, use <mergePolicyFactory> instead.
   [junit4]   2> 896750 INFO  (TEST-AutoCommitTest.testCommitWithin-seed#[99AD8954415D9E27]) [    x:collection1] o.a.s.c.SolrConfig Using Lucene MatchVersion: 7.0.0
   [junit4]   2> 896774 INFO  (TEST-AutoCommitTest.testCommitWithin-seed#[99AD8954415D9E27]) [    x:collection1] o.a.s.s.IndexSchema [collection1] Schema name=test
   [junit4]   2> 896893 WARN  (TEST-AutoCommitTest.testCommitWithin-seed#[99AD8954415D9E27]) [    x:collection1] o.a.s.s.IndexSchema [collection1] default search field in schema is text. WARNING: Deprecated, please use 'df' on request instead.
   [junit4]   2> 896895 INFO  (TEST-AutoCommitTest.testCommitWithin-seed#[99AD8954415D9E27]) [    x:collection1] o.a.s.s.IndexSchema Loaded schema test/1.0 with uniqueid field id
   [junit4]   2> 896902 INFO  (TEST-AutoCommitTest.testCommitWithin-seed#[99AD8954415D9E27]) [    x:collection1] o.a.s.c.CoreContainer Reloading SolrCore 'collection1' using configuration from instancedir /x1/jenkins/jenkins-slave/workspace/Lucene-Solr-Tests-master/solr/core/src/test-files/solr/collection1
   [junit4]   2> 896920 INFO  (TEST-AutoCommitTest.testCommitWithin-seed#[99AD8954415D9E27]) [    x:collection1] o.a.s.m.r.SolrJmxReporter JMX monitoring for 'solr.core.collection1' (registry 'solr.core.collection1') enabled at server: com.sun.jmx.mbeanserver.JmxMBeanServer@5631b867
   [junit4]   2> 896920 INFO  (TEST-AutoCommitTest.testCommitWithin-seed#[99AD8954415D9E27]) [    x:collection1] o.a.s.c.SolrCore [[collection1] ] Opening new SolrCore at [/x1/jenkins/jenkins-slave/workspace/Lucene-Solr-Tests-master/solr/core/src/test-files/solr/collection1], dataDir=[/x1/jenkins/jenkins-slave/workspace/Lucene-Solr-Tests-master/solr/build/solr-core/test/J2/temp/solr.update.AutoCommitTest_99AD8954415D9E27-001/init-core-data-001/]
   [junit4]   2> 897007 INFO  (TEST-AutoCommitTest.testCommitWithin-seed#[99AD8954415D9E27]) [    x:collection1] o.a.s.u.CommitTracker Hard AutoCommit: disabled
   [junit4]   2> 897007 INFO  (TEST-AutoCommitTest.testCommitWithin-seed#[99AD8954415D9E27]) [    x:collection1] o.a.s.u.CommitTracker Soft AutoCommit: disabled
   [junit4]   2> 897009 INFO  (TEST-AutoCommitTest.testCommitWithin-seed#[99AD8954415D9E27]) [    x:collection1] o.a.s.s.SolrIndexSearcher Opening [Searcher@5fb22217[collection1] main]
   [junit4]   2> 897009 INFO  (TEST-AutoCommitTest.testCommitWithin-seed#[99AD8954415D9E27]) [    x:collection1] o.a.s.h.c.SpellCheckComponent Initializing spell checkers
   [junit4]   2> 897020 INFO  (TEST-AutoCommitTest.testCommitWithin-seed#[99AD8954415D9E27]) [    x:collection1] o.a.s.s.DirectSolrSpellChecker init: {name=direct,classname=DirectSolrSpellChecker,field=lowerfilt,minQueryLength=3}
   [junit4]   2> 897023 INFO  (TEST-AutoCommitTest.testCommitWithin-seed#[99AD8954415D9E27]) [    x:collection1] o.a.s.h.ReplicationHandler Commits will be reserved for  10000
   [junit4]   2> 897026 INFO  (searcherExecutor-2471-thread-1-processing-x:collection1) [    x:collection1] o.a.s.h.c.SpellCheckComponent Loading spell index for spellchecker: default
   [junit4]   2> 897026 INFO  (searcherExecutor-2471-thread-1-processing-x:collection1) [    x:collection1] o.a.s.h.c.SpellCheckComponent Loading spell index for spellchecker: direct
   [junit4]   2> 897026 INFO  (searcherExecutor-2471-thread-1-processing-x:collection1) [    x:collection1] o.a.s.h.c.SpellCheckComponent Loading spell index for spellchecker: wordbreak
   [junit4]   2> 897026 INFO  (searcherExecutor-2471-thread-1-processing-x:collection1) [    x:collection1] o.a.s.h.c.SpellCheckComponent Loading spell index for spellchecker: multipleFields
   [junit4]   2> 897027 INFO  (searcherExecutor-2471-thread-1-processing-x:collection1) [    x:collection1] o.a.s.h.c.SpellCheckComponent Loading spell index for spellchecker: jarowinkler
   [junit4]   2> 897027 INFO  (searcherExecutor-2471-thread-1-processing-x:collection1) [    x:collection1] o.a.s.h.c.SpellCheckComponent Loading spell index for spellchecker: external
   [junit4]   2> 897027 INFO  (searcherExecutor-2471-thread-1-processing-x:collection1) [    x:collection1] o.a.s.h.c.SpellCheckComponent Loading spell index for spellchecker: freq
   [junit4]   2> 897028 INFO  (searcherExecutor-2471-thread-1-processing-x:collection1) [    x:collection1] o.a.s.h.c.SpellCheckComponent Loading spell index for spellchecker: fqcn
   [junit4]   2> 897028 INFO  (TEST-AutoCommitTest.testCommitWithin-seed#[99AD8954415D9E27]) [    x:collection1] o.a.s.u.RandomMergePolicy RandomMergePolicy wrapping class org.apache.lucene.index.LogByteSizeMergePolicy: [LogByteSizeMergePolicy: minMergeSize=1677721, mergeFactor=36, maxMergeSize=2147483648, maxMergeSizeForForcedMerge=9223372036854775807, calibrateSizeByDeletes=false, maxMergeDocs=2147483647, maxCFSSegmentSizeMB=8.796093022207999E12, noCFSRatio=0.5578842725192601]
   [junit4]   2> 897028 INFO  (searcherExecutor-2471-thread-1-processing-x:collection1) [    x:collection1] o.a.s.h.c.SpellCheckComponent Loading spell index for spellchecker: perDict
   [junit4]   2> 897031 INFO  (searcherExecutor-2471-thread-1-processing-x:collection1) [    x:collection1] o.a.s.c.SolrCore [collection1] Registered new searcher Searcher@5fb22217[collection1] main{ExitableDirectoryReader(UninvertingDirectoryReader())}
   [junit4]   2> 897031 INFO  (TEST-AutoCommitTest.testCommitWithin-seed#[99AD8954415D9E27]) [    x:collection1] o.a.s.u.DefaultSolrCoreState New IndexWriter is ready to be used.
   [junit4]   2> 897031 INFO  (TEST-AutoCommitTest.testCommitWithin-seed#[99AD8954415D9E27]) [    x:collection1] o.a.s.s.SolrIndexSearcher Opening [Searcher@1fcd3d4f[collection1] main]
   [junit4]   2> 897032 INFO  (TEST-AutoCommitTest.testCommitWithin-seed#[99AD8954415D9E27]) [    x:collection1] o.a.s.c.SolrCore [collection1]  CLOSING SolrCore org.apache.solr.core.SolrCore@5dfd9709
   [junit4]   2> 897033 INFO  (TEST-AutoCommitTest.testCommitWithin-seed#[99AD8954415D9E27]) [    x:collection1] o.a.s.m.SolrMetricManager Closing metric reporters for registry=solr.core.collection1, tag=1576900361
   [junit4]   2> 897037 INFO  (searcherExecutor-2471-thread-1-processing-x:collection1) [    x:collection1] o.a.s.c.SolrCore [collection1] Registered new searcher Searcher@1fcd3d4f[collection1] main{ExitableDirectoryReader(UninvertingDirectoryReader())}
   [junit4]   2> 897038 INFO  (TEST-AutoCommitTest.testCommitWithin-seed#[99AD8954415D9E27]) [    x:collection1] o.a.s.u.p.LogUpdateProcessorFactory [collection1] {add=[529 (1565061260219777024)]} 0 2
   [junit4]   2> 897038 INFO  (TEST-AutoCommitTest.testCommitWithin-seed#[99AD8954415D9E27]) [    x:collection1] o.a.s.c.S.Request [collection1]  webapp=null path=null params={q=id:529&qt=standard&start=0&rows=20&version=2.2} hits=0 status=0 QTime=0
   [junit4]   2> 897039 INFO  (TEST-AutoCommitTest.testCommitWithin-seed#[99AD8954415D9E27]) [    x:collection1] o.a.s.u.p.LogUpdateProcessorFactory [collection1] {add=[530 (1565061260223971328)]} 0 4
   [junit4]   2> 897039 INFO  (TEST-AutoCommitTest.testCommitWithin-seed#[99AD8954415D9E27]) [    x:collection1] o.a.s.c.S.Request [collection1]  webapp=null path=null params={q=id:530&qt=standard&start=0&rows=20&version=2.2} hits=0 status=0 QTime=0
   [junit4]   2> 897040 INFO  (TEST-AutoCommitTest.testCommitWithin-seed#[99AD8954415D9E27]) [    x:collection1] o.a.s.u.p.LogUpdateProcessorFactory [collection1] {delete=[529 (-1565061260225019904)]} 0 4
   [junit4]   2> 897040 INFO  (TEST-AutoCommitTest.testCommitWithin-seed#[99AD8954415D9E27]) [    x:collection1] o.a.s.c.S.Request [collection1]  webapp=null path=null params={q=id:529&qt=standard&start=0&rows=20&version=2.2} hits=0 status=0 QTime=0
   [junit4]   2> 897040 ERROR (TEST-AutoCommitTest.testCommitWithin-seed#[99AD8954415D9E27]) [    x:collection1] o.a.s.SolrTestCaseJ4 REQUEST FAILED: xpath=//result[@numFound=1]
   [junit4]   2> 	xml response was: <?xml version="1.0" encoding="UTF-8"?>
   [junit4]   2> <response>
   [junit4]   2> <lst name="responseHeader"><int name="status">0</int><int name="QTime">0</int></lst><result name="response" numFound="0" start="0"></result>
   [junit4]   2> </response>
   [junit4]   2> 
   [junit4]   2> 	request was:q=id:529&qt=standard&start=0&rows=20&version=2.2
   [junit4]   2> 897041 ERROR (TEST-AutoCommitTest.testCommitWithin-seed#[99AD8954415D9E27]) [    x:collection1] o.a.s.SolrTestCaseJ4 REQUEST FAILED: q=id:529&qt=standard&start=0&rows=20&version=2.2:java.lang.RuntimeException: REQUEST FAILED: xpath=//result[@numFound=1]
   [junit4]   2> 	xml response was: <?xml version="1.0" encoding="UTF-8"?>
   [junit4]   2> <response>
   [junit4]   2> <lst name="responseHeader"><int name="status">0</int><int name="QTime">0</int></lst><result name="response" numFound="0" start="0"></result>
   [junit4]   2> </response>
   [junit4]   2> 
   [junit4]   2> 	request was:q=id:529&qt=standard&start=0&rows=20&version=2.2
   [junit4]   2> 	at org.apache.solr.SolrTestCaseJ4.assertQ(SolrTestCaseJ4.java:889)
   [junit4]   2> 	at org.apache.solr.update.AutoCommitTest.testCommitWithin(AutoCommitTest.java:353)
   [junit4]   2> 	at sun.reflect.NativeMethodAccessorImpl.invoke0(Native Method)
   [junit4]   2> 	at sun.reflect.NativeMethodAccessorImpl.invoke(NativeMethodAccessorImpl.java:62)
   [junit4]   2> 	at sun.reflect.DelegatingMethodAccessorImpl.invoke(DelegatingMethodAccessorImpl.java:43)
   [junit4]   2> 	at java.lang.reflect.Method.invoke(Method.java:498)
   [junit4]   2> 	at com.carrotsearch.randomizedtesting.RandomizedRunner.invoke(RandomizedRunner.java:1713)
   [junit4]   2> 	at com.carrotsearch.randomizedtesting.RandomizedRunner$8.evaluate(RandomizedRunner.java:907)
   [junit4]   2> 	at com.carrotsearch.randomizedtesting.RandomizedRunner$9.evaluate(RandomizedRunner.java:943)
   [junit4]   2> 	at com.carrotsearch.randomizedtesting.RandomizedRunner$10.evaluate(RandomizedRunner.java:957)
   [junit4]   2> 	at com.carrotsearch.randomizedtesting.rules.SystemPropertiesRestoreRule$1.evaluate(SystemPropertiesRestoreRule.java:57)
   [junit4]   2> 	at org.apache.lucene.util.TestRuleSetupTeardownChained$1.evaluate(TestRuleSetupTeardownChained.java:49)
   [junit4]   2> 	at org.apache.lucene.util.AbstractBeforeAfterRule$1.evaluate(AbstractBeforeAfterRule.java:45)
   [junit4]   2> 	at org.apache.lucene.util.TestRuleThreadAndTestName$1.evaluate(TestRuleThreadAndTestName.java:48)
   [junit4]   2> 	at org.apache.lucene.util.TestRuleIgnoreAfterMaxFailures$1.evaluate(TestRuleIgnoreAfterMaxFailures.java:64)
   [junit4]   2> 	at org.apache.lucene.util.TestRuleMarkFailure$1.evaluate(TestRuleMarkFailure.java:47)
   [junit4]   2> 	at com.carrotsearch.randomizedtesting.rules.StatementAdapter.evaluate(StatementAdapter.java:36)
   [junit4]   2> 	at com.carrotsearch.randomizedtesting.ThreadLeakControl$StatementRunner.run(ThreadLeakControl.java:368)
   [junit4]   2> 	at com.carrotsearch.randomizedtesting.ThreadLeakControl.forkTimeoutingTask(ThreadLeakControl.java:817)
   [junit4]   2> 	at com.carrotsearch.randomizedtesting.ThreadLeakControl$3.evaluate(ThreadLeakControl.java:468)
   [junit4]   2> 	at com.carrotsearch.randomizedtesting.RandomizedRunner.runSingleTest(RandomizedRunner.java:916)
   [junit4]   2> 	at com.carrotsearch.randomizedtesting.RandomizedRunner$5.evaluate(RandomizedRunner.java:802)
   [junit4]   2> 	at com.carrotsearch.randomizedtesting.RandomizedRunner$6.evaluate(RandomizedRunner.java:852)
   [junit4]   2> 	at com.carrotsearch.randomizedtesting.RandomizedRunner$7.evaluate(RandomizedRunner.java:863)
   [junit4]   2> 	at com.carrotsearch.randomizedtesting.rules.StatementAdapter.evaluate(StatementAdapter.java:36)
   [junit4]   2> 	at com.carrotsearch.randomizedtesting.rules.SystemPropertiesRestoreRule$1.evaluate(SystemPropertiesRestoreRule.java:57)
   [junit4]   2> 	at org.apache.lucene.util.AbstractBeforeAfterRule$1.evaluate(AbstractBeforeAfterRule.java:45)
   [junit4]   2> 	at com.carrotsearch.randomizedtesting.rules.StatementAdapter.evaluate(StatementAdapter.java:36)
   [junit4]   2> 	at org.apache.lucene.util.TestRuleStoreClassName$1.evaluate(TestRuleStoreClassName.java:41)
   [junit4]   2> 	at com.carrotsearch.randomizedtesting.rules.NoShadowingOrOverridesOnMethodsRule$1.evaluate(NoShadowingOrOverridesOnMethodsRule.java:40)
   [junit4]   2> 	at com.carrotsearch.randomizedtesting.rules.NoShadowingOrOverridesOnMethodsRule$1.evaluate(NoShadowingOrOverridesOnMethodsRule.java:40)
   [junit4]   2> 	at com.carrotsearch.randomizedtesting.rules.StatementAdapter.evaluate(StatementAdapter.java:36)
   [junit4]   2> 	at com.carrotsearch.randomizedtesting.rules.StatementAdapter.evaluate(StatementAdapter.java:36)
   [junit4]   2> 	at com.carrotsearch.randomizedtesting.rules.StatementAdapter.evaluate(StatementAdapter.java:36)
   [junit4]   2> 	at org.apache.lucene.util.TestRuleAssertionsRequired$1.evaluate(TestRuleAssertionsRequired.java:53)
   [junit4]   2> 	at org.apache.lucene.util.TestRuleMarkFailure$1.evaluate(TestRuleMarkFailure.java:47)
   [junit4]   2> 	at org.apache.lucene.util.TestRuleIgnoreAfterMaxFailures$1.evaluate(TestRuleIgnoreAfterMaxFailures.java:64)
   [junit4]   2> 	at org.apache.lucene.util.TestRuleIgnoreTestSuites$1.evaluate(TestRuleIgnoreTestSuites.java:54)
   [junit4]   2> 	at com.carrotsearch.randomizedtesting.rules.StatementAdapter.evaluate(StatementAdapter.java:36)
   [junit4]   2> 	at com.carrotsearch.randomizedtesting.ThreadLeakControl$StatementRunner.run(ThreadLeakControl.java:368)
   [junit4]   2> 	at java.lang.Thread.run(Thread.java:745)
   [junit4]   2> 
   [junit4]   2> 897041 INFO  (TEST-AutoCommitTest.testCommitWithin-seed#[99AD8954415D9E27]) [    x:collection1] o.a.s.SolrTestCaseJ4 ###Ending testCommitWithin
   [junit4]   2> NOTE: reproduce with: ant test  -Dtestcase=AutoCommitTest -Dtests.method=testCommitWithin -Dtests.seed=99AD8954415D9E27 -Dtests.multiplier=2 -Dtests.slow=true -Dtests.locale=es-SV -Dtests.timezone=Pacific/Funafuti -Dtests.asserts=true -Dtests.file.encoding=UTF-8
   [junit4] ERROR   0.34s J2 | AutoCommitTest.testCommitWithin <<<
   [junit4]    > Throwable #1: java.lang.RuntimeException: Exception during query
   [junit4]    > 	at __randomizedtesting.SeedInfo.seed([99AD8954415D9E27:237FE62CC2737032]:0)
   [junit4]    > 	at org.apache.solr.SolrTestCaseJ4.assertQ(SolrTestCaseJ4.java:896)
   [junit4]    > 	at org.apache.solr.update.AutoCommitTest.testCommitWithin(AutoCommitTest.java:353)
   [junit4]    > 	at java.lang.Thread.run(Thread.java:745)
   [junit4]    > Caused by: java.lang.RuntimeException: REQUEST FAILED: xpath=//result[@numFound=1]
   [junit4]    > 	xml response was: <?xml version="1.0" encoding="UTF-8"?>
   [junit4]    > <response>
   [junit4]    > <lst name="responseHeader"><int name="status">0</int><int name="QTime">0</int></lst><result name="response" numFound="0" start="0"></result>
   [junit4]    > </response>
   [junit4]    > 	request was:q=id:529&qt=standard&start=0&rows=20&version=2.2
   [junit4]    > 	at org.apache.solr.SolrTestCaseJ4.assertQ(SolrTestCaseJ4.java:889)
   [junit4]    > 	... 40 more
   [junit4]   2> 897052 INFO  (TEST-AutoCommitTest.testMaxTime-seed#[99AD8954415D9E27]) [    x:collection1] o.a.s.SolrTestCaseJ4 ###Starting testMaxTime
   [junit4]   2> 897053 INFO  (TEST-AutoCommitTest.testMaxTime-seed#[99AD8954415D9E27]) [    x:collection1] o.a.s.u.DirectUpdateHandler2 [collection1] REMOVING ALL DOCUMENTS FROM INDEX
   [junit4]   2> 897053 INFO  (TEST-AutoCommitTest.testMaxTime-seed#[99AD8954415D9E27]) [    x:collection1] o.a.s.s.SolrIndexSearcher Opening [Searcher@41598836[collection1] realtime]
   [junit4]   2> 897053 INFO  (TEST-AutoCommitTest.testMaxTime-seed#[99AD8954415D9E27]) [    x:collection1] o.a.s.u.p.LogUpdateProcessorFactory [collection1]  webapp=null path=null params={_version_=-9223372036854775807&update.distrib=FROMLEADER&versions=true&wt=json&indent=true}{deleteByQuery=*:* (-9223372036854775807)} 0 0
   [junit4]   2> 897054 ERROR (TEST-AutoCommitTest.testMaxTime-seed#[99AD8954415D9E27]) [    x:collection1] o.a.s.c.CorePropertiesLocator Couldn't load core descriptor from /x1/jenkins/jenkins-slave/workspace/Lucene-Solr-Tests-master/solr/core/src/test-files/solr/collection1/conf/solrcore.properties:java.nio.file.NoSuchFileException: /x1/jenkins/jenkins-slave/workspace/Lucene-Solr-Tests-master/solr/core/src/test-files/solr/collection1/conf/solrcore.properties
   [junit4]   2> 897054 INFO  (TEST-AutoCommitTest.testMaxTime-seed#[99AD8954415D9E27]) [    x:collection1] o.a.s.c.SolrResourceLoader [null] Added 2 libs to classloader, from paths: [/x1/jenkins/jenkins-slave/workspace/Lucene-Solr-Tests-master/solr/core/src/test-files/solr/collection1/lib, /x1/jenkins/jenkins-slave/workspace/Lucene-Solr-Tests-master/solr/core/src/test-files/solr/collection1/lib/classes]
   [junit4]   2> 897086 WARN  (TEST-AutoCommitTest.testMaxTime-seed#[99AD8954415D9E27]) [    x:collection1] o.a.s.c.Config Beginning with Solr 5.5, <mergePolicy> is deprecated, use <mergePolicyFactory> instead.
   [junit4]   2> 897087 INFO  (TEST-AutoCommitTest.testMaxTime-seed#[99AD8954415D9E27]) [    x:collection1] o.a.s.c.SolrConfig Using Lucene MatchVersion: 7.0.0
   [junit4]   2> 897112 INFO  (TEST-AutoCommitTest.testMaxTime-seed#[99AD8954415D9E27]) [    x:collection1] o.a.s.s.IndexSchema [collection1] Schema name=test
   [junit4]   2> 897352 WARN  (TEST-AutoCommitTest.testMaxTime-seed#[99AD8954415D9E27]) [    x:collection1] o.a.s.s.IndexSchema [collection1] default search field in schema is text. WARNING: Deprecated, please use 'df' on request instead.
   [junit4]   2> 897354 INFO  (TEST-AutoCommitTest.testMaxTime-seed#[99AD8954415D9E27]) [    x:collection1] o.a.s.s.IndexSchema Loaded schema test/1.0 with uniqueid field id
   [junit4]   2> 897361 INFO  (TEST-AutoCommitTest.testMaxTime-seed#[99AD8954415D9E27]) [    x:collection1] o.a.s.c.CoreContainer Reloading SolrCore 'collection1' using configuration from instancedir /x1/jenkins/jenkins-slave/workspace/Lucene-Solr-Tests-master/solr/core/src/test-files/solr/collection1
   [junit4]   2> 897381 INFO  (TEST-AutoCommitTest.testMaxTime-seed#[99AD8954415D9E27]) [    x:collection1] o.a.s.m.r.SolrJmxReporter JMX monitoring for 'solr.core.collection1' (registry 'solr.core.collection1') enabled at server: com.sun.jmx.mbeanserver.JmxMBeanServer@5631b867
   [junit4]   2> 897381 INFO  (TEST-AutoCommitTest.testMaxTime-seed#[99AD8954415D9E27]) [    x:collection1] o.a.s.c.SolrCore [[collection1] ] Opening new SolrCore at [/x1/jenkins/jenkins-slave/workspace/Lucene-Solr-Tests-master/solr/core/src/test-files/solr/collection1], dataDir=[/x1/jenkins/jenkins-slave/workspace/Lucene-Solr-Tests-master/solr/build/solr-core/test/J2/temp/solr.update.AutoCommitTest_99AD8954415D9E27-001/init-core-data-001/]
   [junit4]   2> 897446 INFO  (TEST-AutoCommitTest.testMaxTime-seed#[99AD8954415D9E27]) [    x:collection1] o.a.s.u.CommitTracker Hard AutoCommit: disabled
   [junit4]   2> 897447 INFO  (TEST-AutoCommitTest.testMaxTime-seed#[99AD8954415D9E27]) [    x:collection1] o.a.s.u.CommitTracker Soft AutoCommit: disabled
   [junit4]   2> 897449 INFO  (TEST-AutoCommitTest.testMaxTime-seed#[99AD8954415D9E27]) [    x:collection1] o.a.s.s.SolrIndexSearcher Opening [Searcher@5580bf31[collection1] main]
   [junit4]   2> 897450 INFO  (TEST-AutoCommitTest.testMaxTime-seed#[99AD8954415D9E27]) [    x:collection1] o.a.s.h.c.SpellCheckComponent Initializing spell checkers
   [junit4]   2> 897450 INFO  (TEST-AutoCommitTest.testMaxTime-seed#[99AD8954415D9E27]) [    x:collection1] o.a.s.s.DirectSolrSpellChecker init: {name=direct,classname=DirectSolrSpellChecker,field=lowerfilt,minQueryLength=3}
   [junit4]   2> 897454 INFO  (TEST-AutoCommitTest.testMaxTime-seed#[99AD8954415D9E27]) [    x:collection1] o.a.s.h.ReplicationHandler Commits will be reserved for  10000
   [junit4]   2> 897456 INFO  (searcherExecutor-2475-thread-1-processing-x:collection1) [    x:collection1] o.a.s.h.c.SpellCheckComponent Loading spell index for spellchecker: default
   [junit4]   2> 897456 INFO  (searcherExecutor-2475-thread-1-processing-x:collection1) [    x:collection1] o.a.s.h.c.SpellCheckComponent Loading spell index for spellchecker: direct
   [junit4]   2> 897456 INFO  (searcherExecutor-2475-thread-1-processing-x:collection1) [    x:collection1] o.a.s.h.c.SpellCheckComponent Loading spell index for spellchecker: wordbreak
   [junit4]   2> 897457 INFO  (searcherExecutor-2475-thread-1-processing-x:collection1) [    x:collection1] o.a.s.h.c.SpellCheckComponent Loading spell index for spellchecker: multipleFields
   [junit4]   2> 897457 INFO  (searcherExecutor-2475-thread-1-processing-x:collection1) [    x:collection1] o.a.s.h.c.SpellCheckComponent Loading spell index for spellchecker: jarowinkler
   [junit4]   2> 897457 INFO  (searcherExecutor-2475-thread-1-processing-x:collection1) [    x:collection1] o.a.s.h.c.SpellCheckComponent Loading spell index for spellchecker: external
   [junit4]   2> 897457 INFO  (searcherExecutor-2475-thread-1-processing-x:collection1) [    x:collection1] o.a.s.h.c.SpellCheckComponent Loading spell index for spellchecker: freq
   [junit4]   2> 897457 INFO  (searcherExecutor-2475-thread-1-processing-x:collection1) [    x:collection1] o.a.s.h.c.SpellCheckComponent Loading spell index for spellchecker: fqcn
   [junit4]   2> 897458 INFO  (searcherExecutor-2475-thread-1-processing-x:collection1) [    x:collection1] o.a.s.h.c.SpellCheckComponent Loading spell index for spellchecker: perDict
   [junit4]   2> 897461 INFO  (searcherExecutor-2475-thread-1-processing-x:collection1) [    x:collection1] o.a.s.c.SolrCore [collection1] Registered new searcher Searcher@5580bf31[collection1] main{ExitableDirectoryReader(UninvertingDirectoryReader())}
   [junit4]   2> 897461 INFO  (TEST-AutoCommitTest.testMaxTime-seed#[99AD8954415D9E27]) [    x:collection1] o.a.s.u.RandomMergePolicy RandomMergePolicy wrapping class org.apache.lucene.index.TieredMergePolicy: [TieredMergePolicy: maxMergeAtOnce=32, maxMergeAtOnceExplicit=10, maxMergedSegmentMB=3.1552734375, floorSegmentMB=1.7099609375, forceMergeDeletesPctAllowed=27.773653136817696, segmentsPerTier=29.0, maxCFSSegmentSizeMB=8.796093022207999E12, noCFSRatio=0.0
   [junit4]   2> 897461 INFO  (TEST-AutoCommitTest.testMaxTime-seed#[99AD8954415D9E27]) [    x:collection1] o.a.s.u.DefaultSolrCoreState New IndexWriter is ready to be used.
   [junit4]   2> 897461 INFO  (TEST-AutoCommitTest.testMaxTime-seed#[99AD8954415D9E27]) [    x:collection1] o.a.s.s.SolrIndexSearcher Opening [Searcher@3b3a8657[collection1] main]
   [junit4]   2> 897462 INFO  (TEST-AutoCommitTest.testMaxTime-seed#[99AD8954415D9E27]) [    x:collection1] o.a.s.c.SolrCore [collection1]  CLOSING SolrCore org.apache.solr.core.SolrCore@44c1bfff
   [junit4]   2> 897462 INFO  (TEST-AutoCommitTest.testMaxTime-seed#[99AD8954415D9E27]) [    x:collection1] o.a.s.m.SolrMetricManager Closing metric reporters for registry=solr.core.collection1, tag=1153548287
   [junit4]   2> 897473 INFO  (searcherExecutor-2475-thread-1-processing-x:collection1) [    x:collection1] o.a.s.c.SolrCore [collection1] Registered new searcher Searcher@3b3a8657[collection1] main{ExitableDirectoryReader(UninvertingDirectoryReader())}
   [junit4]   2> 897477 INFO  (TEST-AutoCommitTest.testMaxTime-seed#[99AD8954415D9E27]) [    x:collection1] o.a.s.u.p.LogUpdateProcessorFactory [collection1] {add=[529 (1565061260682199040)]} 0 1
   [junit4]   2> 897478 INFO  (TEST-AutoCommitTest.testMaxTime-seed#[99AD8954415D9E27]) [    x:collection1] o.a.s.c.S.Request [collection1]  webapp=null path=null params={q=id:529&qt=standard&start=0&rows=20&version=2.2} hits=0 status=0 QTime=0
   [junit4]   2> 898978 INFO  (commitScheduler-2478-thread-1) [    x:collection1] o.a.s.u.DirectUpdateHandler2 start commit{,optimize=false,openSearcher=true,waitSearcher=true,expungeDeletes=false,softCommit=true,prepareCommit=false}
   [junit4]   2> 898982 INFO  (commitScheduler-2478-thread-1) [    x:collection1] o.a.s.s.SolrIndexSearcher Opening [Searcher@197957b6[collection1] main]
   [junit4]   2> 898984 INFO  (searcherExecutor-2475-thread-1-processing-x:collection1) [    x:collection1] o.a.s.c.SolrCore [collection1] Registered new searcher Searcher@197957b6[collection1] main{ExitableDirectoryReader(UninvertingDirectoryReader(Uninverting(_3(7.0.0):c1)))}
   [junit4]   2> 898985 INFO  (commitScheduler-2478-thread-1) [    x:collection1] o.a.s.u.DirectUpdateHandler2 end_commit_flush
   [junit4]   2> 899234 INFO  (TEST-AutoCommitTest.testMaxTime-seed#[99AD8954415D9E27]) [    x:collection1] o.a.s.u.p.LogUpdateProcessorFactory [collection1] {add=[530 (1565061262521401344)]} 0 1757
   [junit4]   2> 899234 INFO  (TEST-AutoCommitTest.testMaxTime-seed#[99AD8954415D9E27]) [    x:collection1] o.a.s.c.S.Request [collection1]  webapp=null path=null params={q=id:529&qt=standard&start=0&rows=20&version=2.2} hits=1 status=0 QTime=0
   [junit4]   2> 899235 INFO  (TEST-AutoCommitTest.testMaxTime-seed#[99AD8954415D9E27]) [    x:collection1] o.a.s.c.S.Request [collection1]  webapp=null path=null params={q=id:530&qt=standard&start=0&rows=20&version=2.2} hits=0 status=0 QTime=0
   [junit4]   2> 899240 INFO  (TEST-AutoCommitTest.testMaxTime-seed#[99AD8954415D9E27]) [    x:collection1] o.a.s.u.p.LogUpdateProcessorFactory [collection1]  webapp=null path=null params={}{delete=[529 (-1565061262527692800)]} 0 4
   [junit4]   2> 899241 INFO  (TEST-AutoCommitTest.testMaxTime-seed#[99AD8954415D9E27]) [    x:collection1] o.a.s.c.S.Request [collection1]  webapp=null path=null params={q=id:529&qt=standard&start=0&rows=20&version=2.2} hits=1 status=0 QTime=0
   [junit4]   2> 900734 INFO  (commitScheduler-2478-thread-1) [    x:collection1] o.a.s.u.DirectUpdateHandler2 start commit{,optimize=false,openSearcher=true,waitSearcher=true,expungeDeletes=false,softCommit=true,prepareCommit=false}
   [junit4]   2> 900740 INFO  (commitScheduler-2478-thread-1) [    x:collection1] o.a.s.s.SolrIndexSearcher Opening [Searcher@711bfd3d[collection1] main]
   [junit4]   2> 900742 INFO  (searcherExecutor-2475-thread-1-processing-x:collection1) [    x:collection1] o.a.s.c.SolrCore [collection1] Registered new searcher Searcher@711bfd3d[collection1] main{ExitableDirectoryReader(UninvertingDirectoryReader(Uninverting(_4(7.0.0):c1)))}
   [junit4]   2> 900743 INFO  (commitScheduler-2478-thread-1) [    x:collection1] o.a.s.u.DirectUpdateHandler2 end_commit_flush
   [junit4]   2> 900744 INFO  (TEST-AutoCommitTest.testMaxTime-seed#[99AD8954415D9E27]) [    x:collection1] o.a.s.u.p.LogUpdateProcessorFactory [collection1] {add=[550 (1565061264107896832)]} 0 3267
   [junit4]   2> 900744 INFO  (TEST-AutoCommitTest.testMaxTime-seed#[99AD8954415D9E27]) [    x:collection1] o.a.s.c.S.Request [collection1]  webapp=null path=null params={q=id:529&qt=standard&start=0&rows=20&version=2.2} hits=0 status=0 QTime=0
   [junit4]   2> 900745 INFO  (TEST-AutoCommitTest.testMaxTime-seed#[99AD8954415D9E27]) [    x:collection1] o.a.s.u.p.LogUpdateProcessorFactory [collection1] {add=[500 (1565061264108945408)]} 0 3268
   [junit4]   2> 900745 INFO  (TEST-AutoCommitTest.testMaxTime-seed#[99AD8954415D9E27]) [    x:collection1] o.a.s.u.p.LogUpdateProcessorFactory [collection1] {add=[500 (1565061264109993984)]} 0 3269
   [junit4]   2> 900745 INFO  (TEST-AutoCommitTest.testMaxTime-seed#[99AD8954415D9E27]) [    x:collection1] o.a.s.u.p.LogUpdateProcessorFactory [collection1] {add=[500 (1565061264109993985)]} 0 3269
   [junit4]   2> 900746 INFO  (TEST-AutoCommitTest.testMaxTime-seed#[99AD8954415D9E27]) [    x:collection1] o.a.s.u.p.LogUpdateProcessorFactory [collection1] {add=[500 (1565061264109993986)]} 0 3269
   [junit4]   2> 900746 INFO  (TEST-AutoCommitTest.testMaxTime-seed#[99AD8954415D9E27]) [    x:collection1] o.a.s.u.p.LogUpdateProcessorFactory [collection1] {add=[500 (1565061264111042560)]} 0 3269
   [junit4]   2> 900746 INFO  (TEST-AutoCommitTest.testMaxTime-seed#[99AD8954415D9E27]) [    x:collection1] o.a.s.u.p.LogUpdateProcessorFactory [collection1] {add=[500 (1565061264111042561)]} 0 3270
   [junit4]   2> 900746 INFO  (TEST-AutoCommitTest.testMaxTime-seed#[99AD8954415D9E27]) [    x:collection1] o.a.s.u.p.LogUpdateProcessorFactory [collection1] {add=[500 (1565061264111042562)]} 0 3270
   [junit4]   2> 900747 INFO  (TEST-AutoCommitTest.testMaxTime-seed#[99AD8954415D9E27]) [    x:collection1] o.a.s.u.p.LogUpdateProcessorFactory [collection1] {add=[500 (1565061264112091136)]} 0 3270
   [junit4]   2> 900747 INFO  (TEST-AutoCommitTest.testMaxTime-seed#[99AD8954415D9E27]) [    x:collection1] o.a.s.u.p.LogUpdateProcessorFactory [collection1] {add=[500 (1565061264112091137)]} 0 3271
   [junit4]   2> 900747 INFO  (TEST-AutoCommitTest.testMaxTime-seed#[99AD8954415D9E27]) [    x:collection1] o.a.s.u.p.LogUpdateProcessorFactory [collection1] {add=[500 (1565061264112091138)]} 0 3271
   [junit4]   2> 900748 INFO  (TEST-AutoCommitTest.testMaxTime-seed#[99AD8954415D9E27]) [    x:collection1] o.a.s.c.S.Request [collection1]  webapp=null path=null params={q=id:500&qt=standard&start=0&rows=20&version=2.2} hits=0 status=0 QTime=0
   [junit4]   2> 902244 INFO  (commitScheduler-2478-thread-1) [    x:collection1] o.a.s.u.DirectUpdateHandler2 start commit{,optimize=false,openSearcher=true,waitSearcher=true,expungeDeletes=false,softCommit=true,prepareCommit=false}
   [junit4]   2> 902247 INFO  (commitScheduler-2478-thread-1) [    x:collection1] o.a.s.s.SolrIndexSearcher Opening [Searcher@75b7c747[collection1] main]
   [junit4]   2> 902249 INFO  (searcherExecutor-2475-thread-1-processing-x:collection1) [    x:collection1] o.a.s.c.SolrCore [collection1] Registered new searcher Searcher@75b7c747[collection1] main{ExitableDirectoryReader(UninvertingDirectoryReader(Uninverting(_4(7.0.0):c1) Uninverting(_5(7.0.0):c11/9:delGen=1)))}
   [junit4]   2> 902250 INFO  (commitScheduler-2478-thread-1) [    x:collection1] o.a.s.u.DirectUpdateHandler2 end_commit_flush
   [junit4]   2> 902250 INFO  (TEST-AutoCommitTest.testMaxTime-seed#[99AD8954415D9E27]) [    x:collection1] o.a.s.u.p.LogUpdateProcessorFactory [collection1] {add=[531 (1565061265688100864)]} 0 4774
   [junit4]   2> 902251 INFO  (TEST-AutoCommitTest.testMaxTime-seed#[99AD8954415D9E27]) [    x:collection1] o.a.s.c.S.Request [collection1]  webapp=null path=null params={q=id:500&qt=standard&start=0&rows=20&version=2.2} hits=1 status=0 QTime=0
   [junit4]   2> 902251 INFO  (TEST-AutoCommitTest.testMaxTime-seed#[99AD8954415D9E27]) [    x:collection1] o.a.s.SolrTestCaseJ4 ###Ending testMaxTime
   [junit4]   2> 902252 INFO  (SUITE-AutoCommitTest-seed#[99AD8954415D9E27]-worker) [    x:collection1] o.a.s.SolrTestCaseJ4 ###deleteCore
   [junit4]   2> 902252 INFO  (SUITE-AutoCommitTest-seed#[99AD8954415D9E27]-worker) [    x:collection1] o.a.s.c.CoreContainer Shutting down CoreContainer instance=1146371260
   [junit4]   2> 902252 INFO  (SUITE-AutoCommitTest-seed#[99AD8954415D9E27]-worker) [    x:collection1] o.a.s.m.SolrMetricManager Closing metric reporters for registry=solr.node, tag=null
   [junit4]   2> 902253 INFO  (SUITE-AutoCommitTest-seed#[99AD8954415D9E27]-worker) [    x:collection1] o.a.s.m.SolrMetricManager Closing metric reporters for registry=solr.jvm, tag=null
   [junit4]   2> 902255 INFO  (SUITE-AutoCommitTest-seed#[99AD8954415D9E27]-worker) [    x:collection1] o.a.s.m.SolrMetricManager Closing metric reporters for registry=solr.jetty, tag=null
   [junit4]   2> 902255 INFO  (SUITE-AutoCommitTest-seed#[99AD8954415D9E27]-worker) [    x:collection1] o.a.s.c.TransientSolrCoreCacheDefault Allocating transient cache for 2147483647 transient cores
   [junit4]   2> 902255 INFO  (coreCloseExecutor-2479-thread-1-processing-x:collection1) [    x:collection1] o.a.s.c.SolrCore [collection1]  CLOSING SolrCore org.apache.solr.core.SolrCore@5d1d15cb
   [junit4]   2> 902256 INFO  (coreCloseExecutor-2479-thread-1-processing-x:collection1) [    x:collection1] o.a.s.u.DirectUpdateHandler2 Committing on IndexWriter close.
   [junit4]   2> 902256 INFO  (coreCloseExecutor-2479-thread-1-processing-x:collection1) [    x:collection1] o.a.s.u.SolrIndexWriter Calling setCommitData with IW:org.apache.solr.update.SolrIndexWriter@6017a9d1 commitCommandVersion:0
   [junit4]   2> 902291 INFO  (coreCloseExecutor-2479-thread-1-processing-x:collection1) [    x:collection1] o.a.s.m.SolrMetricManager Closing metric reporters for registry=solr.core.collection1, tag=1562187211
   [junit4]   2> NOTE: leaving temporary files on disk at: /x1/jenkins/jenkins-slave/workspace/Lucene-Solr-Tests-master/solr/build/solr-core/test/J2/temp/solr.update.AutoCommitTest_99AD8954415D9E27-001
   [junit4]   2> NOTE: test params are: codec=HighCompressionCompressingStoredFields(storedFieldsFormat=CompressingStoredFieldsFormat(compressionMode=HIGH_COMPRESSION, chunkSize=8, maxDocsPerChunk=947, blockSize=2), termVectorsFormat=CompressingTermVectorsFormat(compressionMode=HIGH_COMPRESSION, chunkSize=8, blockSize=2)), sim=RandomSimilarity(queryNorm=false): {}, locale=es-SV, timezone=Pacific/Funafuti
   [junit4]   2> NOTE: Linux 3.13.0-85-generic amd64/Oracle Corporation 1.8.0_121 (64-bit)/cpus=4,threads=1,free=235430288,total=513277952
   [junit4]   2> NOTE: All tests run in this JVM: [TestFieldCacheReopen, DistributedVersionInfoTest, SpatialHeatmapFacetsTest, TestOrdValues, DirectUpdateHandlerTest, TestCoreDiscovery, GraphQueryTest, AddBlockUpdateTest, TestClassNameShortening, TestPhraseSuggestions, MultiThreadedOCPTest, TestQuerySenderNoQuery, TestEmbeddedSolrServerSchemaAPI, TestTolerantSearch, RemoteQueryErrorTest, AnalyticsQueryTest, TestIndexingPerformance, TestDistribDocBasedVersion, DistributedFacetPivotSmallTest, BlockDirectoryTest, TestBinaryField, TestMissingGroups, SuggesterWFSTTest, JvmMetricsTest, ShowFileRequestHandlerTest, TestSolrQueryParserResource, TestOverriddenPrefixQueryForCustomFieldType, PrimitiveFieldTypeTest, TestDistribIDF, ParsingFieldUpdateProcessorsTest, VersionInfoTest, TestBinaryResponseWriter, CreateCollectionCleanupTest, TestIBSimilarityFactory, TestCollectionAPIs, TestConfig, SegmentsInfoRequestHandlerTest, TestSolrCoreSnapshots, QueryResultKeyTest, ChaosMonkeyNothingIsSafeTest, UUIDUpdateProcessorFallbackTest, CoreAdminHandlerTest, TestDocSet, OverseerModifyCollectionTest, DataDrivenBlockJoinTest, TestSmileRequest, DeleteLastCustomShardedReplicaTest, TestSchemaVersionResource, TestFieldResource, HardAutoCommitTest, CloneFieldUpdateProcessorFactoryTest, TestManagedSynonymFilterFactory, TestGeoJSONResponseWriter, ExternalFileFieldSortTest, RestartWhileUpdatingTest, TestConfigSetsAPIZkFailure, SolrTestCaseJ4Test, TestStressInPlaceUpdates, ClusterStateTest, TestReversedWildcardFilterFactory, EchoParamsTest, DirectUpdateHandlerOptimizeTest, TestClassicSimilarityFactory, TestCollectionAPI, TestUseDocValuesAsStored, ResponseHeaderTest, TestConfigReload, TestReloadDeadlock, TestNRTOpen, AutoCommitTest]
   [junit4] Completed [208/702 (1!)] on J2 in 7.28s, 3 tests, 1 error <<< FAILURES!

[...truncated 44974 lines...]

Mime
View raw message