lucene-dev mailing list archives

Site index · List index
Message view « Date » · « Thread »
Top « Date » · « Thread »
From Policeman Jenkins Server <jenk...@thetaphi.de>
Subject [JENKINS] Lucene-Solr-master-Linux (64bit/jdk1.8.0_121) - Build # 19425 - Still Unstable!
Date Tue, 18 Apr 2017 19:35:36 GMT
Build: https://jenkins.thetaphi.de/job/Lucene-Solr-master-Linux/19425/
Java: 64bit/jdk1.8.0_121 -XX:-UseCompressedOops -XX:+UseParallelGC

1 tests failed.
FAILED:  org.apache.solr.handler.admin.StatsReloadRaceTest.testParallelReloadAndStats

Error Message:
Key SEARCHER.searcher.indexVersion not found in registry solr.core.collection1

Stack Trace:
java.lang.AssertionError: Key SEARCHER.searcher.indexVersion not found in registry solr.core.collection1
	at __randomizedtesting.SeedInfo.seed([24ED6A41CE572906:EB730F7841A64159]:0)
	at org.junit.Assert.fail(Assert.java:93)
	at org.junit.Assert.assertTrue(Assert.java:43)
	at org.apache.solr.handler.admin.StatsReloadRaceTest.requestMetrics(StatsReloadRaceTest.java:132)
	at org.apache.solr.handler.admin.StatsReloadRaceTest.testParallelReloadAndStats(StatsReloadRaceTest.java:70)
	at sun.reflect.NativeMethodAccessorImpl.invoke0(Native Method)
	at sun.reflect.NativeMethodAccessorImpl.invoke(NativeMethodAccessorImpl.java:62)
	at sun.reflect.DelegatingMethodAccessorImpl.invoke(DelegatingMethodAccessorImpl.java:43)
	at java.lang.reflect.Method.invoke(Method.java:498)
	at com.carrotsearch.randomizedtesting.RandomizedRunner.invoke(RandomizedRunner.java:1713)
	at com.carrotsearch.randomizedtesting.RandomizedRunner$8.evaluate(RandomizedRunner.java:907)
	at com.carrotsearch.randomizedtesting.RandomizedRunner$9.evaluate(RandomizedRunner.java:943)
	at com.carrotsearch.randomizedtesting.RandomizedRunner$10.evaluate(RandomizedRunner.java:957)
	at com.carrotsearch.randomizedtesting.rules.SystemPropertiesRestoreRule$1.evaluate(SystemPropertiesRestoreRule.java:57)
	at org.apache.lucene.util.TestRuleSetupTeardownChained$1.evaluate(TestRuleSetupTeardownChained.java:49)
	at org.apache.lucene.util.AbstractBeforeAfterRule$1.evaluate(AbstractBeforeAfterRule.java:45)
	at org.apache.lucene.util.TestRuleThreadAndTestName$1.evaluate(TestRuleThreadAndTestName.java:48)
	at org.apache.lucene.util.TestRuleIgnoreAfterMaxFailures$1.evaluate(TestRuleIgnoreAfterMaxFailures.java:64)
	at org.apache.lucene.util.TestRuleMarkFailure$1.evaluate(TestRuleMarkFailure.java:47)
	at com.carrotsearch.randomizedtesting.rules.StatementAdapter.evaluate(StatementAdapter.java:36)
	at com.carrotsearch.randomizedtesting.ThreadLeakControl$StatementRunner.run(ThreadLeakControl.java:368)
	at com.carrotsearch.randomizedtesting.ThreadLeakControl.forkTimeoutingTask(ThreadLeakControl.java:817)
	at com.carrotsearch.randomizedtesting.ThreadLeakControl$3.evaluate(ThreadLeakControl.java:468)
	at com.carrotsearch.randomizedtesting.RandomizedRunner.runSingleTest(RandomizedRunner.java:916)
	at com.carrotsearch.randomizedtesting.RandomizedRunner$5.evaluate(RandomizedRunner.java:802)
	at com.carrotsearch.randomizedtesting.RandomizedRunner$6.evaluate(RandomizedRunner.java:852)
	at com.carrotsearch.randomizedtesting.RandomizedRunner$7.evaluate(RandomizedRunner.java:863)
	at com.carrotsearch.randomizedtesting.rules.StatementAdapter.evaluate(StatementAdapter.java:36)
	at com.carrotsearch.randomizedtesting.rules.SystemPropertiesRestoreRule$1.evaluate(SystemPropertiesRestoreRule.java:57)
	at org.apache.lucene.util.AbstractBeforeAfterRule$1.evaluate(AbstractBeforeAfterRule.java:45)
	at com.carrotsearch.randomizedtesting.rules.StatementAdapter.evaluate(StatementAdapter.java:36)
	at org.apache.lucene.util.TestRuleStoreClassName$1.evaluate(TestRuleStoreClassName.java:41)
	at com.carrotsearch.randomizedtesting.rules.NoShadowingOrOverridesOnMethodsRule$1.evaluate(NoShadowingOrOverridesOnMethodsRule.java:40)
	at com.carrotsearch.randomizedtesting.rules.NoShadowingOrOverridesOnMethodsRule$1.evaluate(NoShadowingOrOverridesOnMethodsRule.java:40)
	at com.carrotsearch.randomizedtesting.rules.StatementAdapter.evaluate(StatementAdapter.java:36)
	at com.carrotsearch.randomizedtesting.rules.StatementAdapter.evaluate(StatementAdapter.java:36)
	at com.carrotsearch.randomizedtesting.rules.StatementAdapter.evaluate(StatementAdapter.java:36)
	at org.apache.lucene.util.TestRuleAssertionsRequired$1.evaluate(TestRuleAssertionsRequired.java:53)
	at org.apache.lucene.util.TestRuleMarkFailure$1.evaluate(TestRuleMarkFailure.java:47)
	at org.apache.lucene.util.TestRuleIgnoreAfterMaxFailures$1.evaluate(TestRuleIgnoreAfterMaxFailures.java:64)
	at org.apache.lucene.util.TestRuleIgnoreTestSuites$1.evaluate(TestRuleIgnoreTestSuites.java:54)
	at com.carrotsearch.randomizedtesting.rules.StatementAdapter.evaluate(StatementAdapter.java:36)
	at com.carrotsearch.randomizedtesting.ThreadLeakControl$StatementRunner.run(ThreadLeakControl.java:368)
	at java.lang.Thread.run(Thread.java:745)




Build Log:
[...truncated 11898 lines...]
   [junit4] Suite: org.apache.solr.handler.admin.StatsReloadRaceTest
   [junit4]   2> Creating dataDir: /home/jenkins/workspace/Lucene-Solr-master-Linux/solr/build/solr-core/test/J0/temp/solr.handler.admin.StatsReloadRaceTest_24ED6A41CE572906-001/init-core-data-001
   [junit4]   2> 650758 WARN  (SUITE-StatsReloadRaceTest-seed#[24ED6A41CE572906]-worker) [    ] o.a.s.SolrTestCaseJ4 startTrackingSearchers: numOpens=1 numCloses=1
   [junit4]   2> 650758 INFO  (SUITE-StatsReloadRaceTest-seed#[24ED6A41CE572906]-worker) [    ] o.a.s.SolrTestCaseJ4 Using TrieFields
   [junit4]   2> 650759 INFO  (SUITE-StatsReloadRaceTest-seed#[24ED6A41CE572906]-worker) [    ] o.a.s.SolrTestCaseJ4 Randomized ssl (true) and clientAuth (true) via: @org.apache.solr.util.RandomizeSSL(reason=, ssl=NaN, value=NaN, clientAuth=NaN)
   [junit4]   2> 650760 INFO  (SUITE-StatsReloadRaceTest-seed#[24ED6A41CE572906]-worker) [    ] o.a.s.SolrTestCaseJ4 ####initCore
   [junit4]   2> 650760 INFO  (SUITE-StatsReloadRaceTest-seed#[24ED6A41CE572906]-worker) [    ] o.a.s.c.SolrResourceLoader [null] Added 2 libs to classloader, from paths: [/home/jenkins/workspace/Lucene-Solr-master-Linux/solr/core/src/test-files/solr/collection1/lib, /home/jenkins/workspace/Lucene-Solr-master-Linux/solr/core/src/test-files/solr/collection1/lib/classes]
   [junit4]   2> 650781 INFO  (SUITE-StatsReloadRaceTest-seed#[24ED6A41CE572906]-worker) [    ] o.a.s.c.SolrConfig Using Lucene MatchVersion: 7.0.0
   [junit4]   2> 650800 INFO  (SUITE-StatsReloadRaceTest-seed#[24ED6A41CE572906]-worker) [    ] o.a.s.s.IndexSchema [null] Schema name=test
   [junit4]   2> 650885 WARN  (SUITE-StatsReloadRaceTest-seed#[24ED6A41CE572906]-worker) [    ] o.a.s.s.IndexSchema [null] default search field in schema is text. WARNING: Deprecated, please use 'df' on request instead.
   [junit4]   2> 650887 INFO  (SUITE-StatsReloadRaceTest-seed#[24ED6A41CE572906]-worker) [    ] o.a.s.s.IndexSchema Loaded schema test/1.0 with uniqueid field id
   [junit4]   2> 650916 INFO  (SUITE-StatsReloadRaceTest-seed#[24ED6A41CE572906]-worker) [    ] o.a.s.m.r.SolrJmxReporter JMX monitoring for 'solr.node' (registry 'solr.node') enabled at server: com.sun.jmx.mbeanserver.JmxMBeanServer@68b28ead
   [junit4]   2> 650918 INFO  (SUITE-StatsReloadRaceTest-seed#[24ED6A41CE572906]-worker) [    ] o.a.s.m.r.SolrJmxReporter JMX monitoring for 'solr.jvm' (registry 'solr.jvm') enabled at server: com.sun.jmx.mbeanserver.JmxMBeanServer@68b28ead
   [junit4]   2> 650918 INFO  (SUITE-StatsReloadRaceTest-seed#[24ED6A41CE572906]-worker) [    ] o.a.s.m.r.SolrJmxReporter JMX monitoring for 'solr.jetty' (registry 'solr.jetty') enabled at server: com.sun.jmx.mbeanserver.JmxMBeanServer@68b28ead
   [junit4]   2> 650919 INFO  (coreLoadExecutor-3934-thread-1) [    x:collection1] o.a.s.c.SolrResourceLoader [null] Added 2 libs to classloader, from paths: [/home/jenkins/workspace/Lucene-Solr-master-Linux/solr/core/src/test-files/solr/collection1/lib, /home/jenkins/workspace/Lucene-Solr-master-Linux/solr/core/src/test-files/solr/collection1/lib/classes]
   [junit4]   2> 650940 INFO  (coreLoadExecutor-3934-thread-1) [    x:collection1] o.a.s.c.SolrConfig Using Lucene MatchVersion: 7.0.0
   [junit4]   2> 650959 INFO  (coreLoadExecutor-3934-thread-1) [    x:collection1] o.a.s.s.IndexSchema [collection1] Schema name=test
   [junit4]   2> 651043 WARN  (coreLoadExecutor-3934-thread-1) [    x:collection1] o.a.s.s.IndexSchema [collection1] default search field in schema is text. WARNING: Deprecated, please use 'df' on request instead.
   [junit4]   2> 651044 INFO  (coreLoadExecutor-3934-thread-1) [    x:collection1] o.a.s.s.IndexSchema Loaded schema test/1.0 with uniqueid field id
   [junit4]   2> 651048 INFO  (coreLoadExecutor-3934-thread-1) [    x:collection1] o.a.s.c.CoreContainer Creating SolrCore 'collection1' using configuration from instancedir /home/jenkins/workspace/Lucene-Solr-master-Linux/solr/core/src/test-files/solr/collection1, trusted=true
   [junit4]   2> 651048 INFO  (coreLoadExecutor-3934-thread-1) [    x:collection1] o.a.s.m.r.SolrJmxReporter JMX monitoring for 'solr.core.collection1' (registry 'solr.core.collection1') enabled at server: com.sun.jmx.mbeanserver.JmxMBeanServer@68b28ead
   [junit4]   2> 651048 INFO  (coreLoadExecutor-3934-thread-1) [    x:collection1] o.a.s.c.SolrCore solr.RecoveryStrategy.Builder
   [junit4]   2> 651048 INFO  (coreLoadExecutor-3934-thread-1) [    x:collection1] o.a.s.c.SolrCore [[collection1] ] Opening new SolrCore at [/home/jenkins/workspace/Lucene-Solr-master-Linux/solr/core/src/test-files/solr/collection1], dataDir=[/home/jenkins/workspace/Lucene-Solr-master-Linux/solr/build/solr-core/test/J0/temp/solr.handler.admin.StatsReloadRaceTest_24ED6A41CE572906-001/init-core-data-001/]
   [junit4]   2> 651050 INFO  (coreLoadExecutor-3934-thread-1) [    x:collection1] o.a.s.u.RandomMergePolicy RandomMergePolicy wrapping class org.apache.lucene.index.LogDocMergePolicy: [LogDocMergePolicy: minMergeSize=1000, mergeFactor=29, maxMergeSize=9223372036854775807, maxMergeSizeForForcedMerge=9223372036854775807, calibrateSizeByDeletes=true, maxMergeDocs=2147483647, maxCFSSegmentSizeMB=8.796093022207999E12, noCFSRatio=0.368271068665182]
   [junit4]   2> 651084 INFO  (coreLoadExecutor-3934-thread-1) [    x:collection1] o.a.s.u.UpdateHandler Using UpdateLog implementation: org.apache.solr.update.UpdateLog
   [junit4]   2> 651084 INFO  (coreLoadExecutor-3934-thread-1) [    x:collection1] o.a.s.u.UpdateLog Initializing UpdateLog: dataDir= defaultSyncLevel=FLUSH numRecordsToKeep=100 maxNumLogsToKeep=10 numVersionBuckets=65536
   [junit4]   2> 651085 INFO  (coreLoadExecutor-3934-thread-1) [    x:collection1] o.a.s.u.CommitTracker Hard AutoCommit: disabled
   [junit4]   2> 651085 INFO  (coreLoadExecutor-3934-thread-1) [    x:collection1] o.a.s.u.CommitTracker Soft AutoCommit: disabled
   [junit4]   2> 651085 INFO  (coreLoadExecutor-3934-thread-1) [    x:collection1] o.a.s.u.RandomMergePolicy RandomMergePolicy wrapping class org.apache.lucene.index.AlcoholicMergePolicy: [AlcoholicMergePolicy: minMergeSize=0, mergeFactor=10, maxMergeSize=1056395585, maxMergeSizeForForcedMerge=9223372036854775807, calibrateSizeByDeletes=true, maxMergeDocs=2147483647, maxCFSSegmentSizeMB=8.796093022207999E12, noCFSRatio=0.1]
   [junit4]   2> 651085 INFO  (coreLoadExecutor-3934-thread-1) [    x:collection1] o.a.s.s.SolrIndexSearcher Opening [Searcher@439de1ec[collection1] main]
   [junit4]   2> 651086 INFO  (coreLoadExecutor-3934-thread-1) [    x:collection1] o.a.s.h.c.SpellCheckComponent Initializing spell checkers
   [junit4]   2> 651117 INFO  (coreLoadExecutor-3934-thread-1) [    x:collection1] o.a.s.s.DirectSolrSpellChecker init: {name=direct,classname=DirectSolrSpellChecker,field=lowerfilt,minQueryLength=3}
   [junit4]   2> 651217 INFO  (coreLoadExecutor-3934-thread-1) [    x:collection1] o.a.s.h.ReplicationHandler Commits will be reserved for  10000
   [junit4]   2> 651217 INFO  (searcherExecutor-3935-thread-1-processing-x:collection1) [    x:collection1] o.a.s.h.c.SpellCheckComponent Loading spell index for spellchecker: default
   [junit4]   2> 651218 INFO  (coreLoadExecutor-3934-thread-1) [    x:collection1] o.a.s.u.UpdateLog Could not find max version in index or recent updates, using new clock 1565043895992057856
   [junit4]   2> 651218 INFO  (searcherExecutor-3935-thread-1-processing-x:collection1) [    x:collection1] o.a.s.h.c.SpellCheckComponent Loading spell index for spellchecker: direct
   [junit4]   2> 651218 INFO  (searcherExecutor-3935-thread-1-processing-x:collection1) [    x:collection1] o.a.s.h.c.SpellCheckComponent Loading spell index for spellchecker: wordbreak
   [junit4]   2> 651218 INFO  (searcherExecutor-3935-thread-1-processing-x:collection1) [    x:collection1] o.a.s.h.c.SpellCheckComponent Loading spell index for spellchecker: multipleFields
   [junit4]   2> 651218 INFO  (searcherExecutor-3935-thread-1-processing-x:collection1) [    x:collection1] o.a.s.h.c.SpellCheckComponent Loading spell index for spellchecker: jarowinkler
   [junit4]   2> 651218 INFO  (searcherExecutor-3935-thread-1-processing-x:collection1) [    x:collection1] o.a.s.h.c.SpellCheckComponent Loading spell index for spellchecker: external
   [junit4]   2> 651218 INFO  (searcherExecutor-3935-thread-1-processing-x:collection1) [    x:collection1] o.a.s.h.c.SpellCheckComponent Loading spell index for spellchecker: freq
   [junit4]   2> 651218 INFO  (searcherExecutor-3935-thread-1-processing-x:collection1) [    x:collection1] o.a.s.h.c.SpellCheckComponent Loading spell index for spellchecker: fqcn
   [junit4]   2> 651219 INFO  (searcherExecutor-3935-thread-1-processing-x:collection1) [    x:collection1] o.a.s.h.c.SpellCheckComponent Loading spell index for spellchecker: perDict
   [junit4]   2> 651220 INFO  (searcherExecutor-3935-thread-1-processing-x:collection1) [    x:collection1] o.a.s.c.SolrCore [collection1] Registered new searcher Searcher@439de1ec[collection1] main{ExitableDirectoryReader(UninvertingDirectoryReader())}
   [junit4]   2> 651221 INFO  (SUITE-StatsReloadRaceTest-seed#[24ED6A41CE572906]-worker) [    ] o.a.s.SolrTestCaseJ4 ####initCore end
   [junit4]   2> 651224 INFO  (SUITE-StatsReloadRaceTest-seed#[24ED6A41CE572906]-worker) [    ] o.a.s.u.p.LogUpdateProcessorFactory [collection1]  webapp=null path=null params={}{add=[0 (1565043895996252160), 1 (1565043895996252161), 2 (1565043895996252162), 3 (1565043895996252163), 4 (1565043895997300736), 5 (1565043895997300737), 6 (1565043895997300738), 7 (1565043895997300739), 8 (1565043895997300740), 9 (1565043895997300741), ... (32 adds)]} 0 2
   [junit4]   2> 651226 INFO  (SUITE-StatsReloadRaceTest-seed#[24ED6A41CE572906]-worker) [    ] o.a.s.u.DirectUpdateHandler2 start commit{,optimize=false,openSearcher=true,waitSearcher=true,expungeDeletes=false,softCommit=false,prepareCommit=false}
   [junit4]   2> 651226 INFO  (SUITE-StatsReloadRaceTest-seed#[24ED6A41CE572906]-worker) [    ] o.a.s.u.SolrIndexWriter Calling setCommitData with IW:org.apache.solr.update.SolrIndexWriter@7937b389 commitCommandVersion:0
   [junit4]   2> 651232 INFO  (SUITE-StatsReloadRaceTest-seed#[24ED6A41CE572906]-worker) [    ] o.a.s.s.SolrIndexSearcher Opening [Searcher@11879447[collection1] main]
   [junit4]   2> 651232 INFO  (SUITE-StatsReloadRaceTest-seed#[24ED6A41CE572906]-worker) [    ] o.a.s.u.DirectUpdateHandler2 end_commit_flush
   [junit4]   2> 651233 INFO  (searcherExecutor-3935-thread-1) [    ] o.a.s.c.SolrCore [collection1] Registered new searcher Searcher@11879447[collection1] main{ExitableDirectoryReader(UninvertingDirectoryReader(Uninverting(_0(7.0.0):c32)))}
   [junit4]   2> 651233 INFO  (SUITE-StatsReloadRaceTest-seed#[24ED6A41CE572906]-worker) [    ] o.a.s.u.p.LogUpdateProcessorFactory [collection1]  webapp=null path=null params={}{commit=} 0 7
   [junit4]   2> 651236 INFO  (TEST-StatsReloadRaceTest.testParallelReloadAndStats-seed#[24ED6A41CE572906]) [    ] o.a.s.SolrTestCaseJ4 ###Starting testParallelReloadAndStats
   [junit4]   2> 651236 ERROR (parallelCoreAdminExecutor-3933-thread-1-processing-1 RELOAD) [    ] o.a.s.c.CorePropertiesLocator Couldn't load core descriptor from /home/jenkins/workspace/Lucene-Solr-master-Linux/solr/core/src/test-files/solr/collection1/conf/solrcore.properties:java.nio.file.NoSuchFileException: /home/jenkins/workspace/Lucene-Solr-master-Linux/solr/core/src/test-files/solr/collection1/conf/solrcore.properties
   [junit4]   2> 651236 INFO  (TEST-StatsReloadRaceTest.testParallelReloadAndStats-seed#[24ED6A41CE572906]) [    ] o.a.s.h.a.CoreAdminOperation Checking request status for : 1
   [junit4]   2> 651236 INFO  (parallelCoreAdminExecutor-3933-thread-1-processing-1 RELOAD) [    ] o.a.s.c.SolrResourceLoader [null] Added 2 libs to classloader, from paths: [/home/jenkins/workspace/Lucene-Solr-master-Linux/solr/core/src/test-files/solr/collection1/lib, /home/jenkins/workspace/Lucene-Solr-master-Linux/solr/core/src/test-files/solr/collection1/lib/classes]
   [junit4]   2> 651238 INFO  (TEST-StatsReloadRaceTest.testParallelReloadAndStats-seed#[24ED6A41CE572906]) [    ] o.a.s.h.a.CoreAdminOperation Checking request status for : 1
   [junit4]   2> 651239 INFO  (TEST-StatsReloadRaceTest.testParallelReloadAndStats-seed#[24ED6A41CE572906]) [    ] o.a.s.h.a.CoreAdminOperation Checking request status for : 1
   [junit4]   2> 651240 INFO  (TEST-StatsReloadRaceTest.testParallelReloadAndStats-seed#[24ED6A41CE572906]) [    ] o.a.s.h.a.CoreAdminOperation Checking request status for : 1
   [junit4]   2> 651241 INFO  (TEST-StatsReloadRaceTest.testParallelReloadAndStats-seed#[24ED6A41CE572906]) [    ] o.a.s.h.a.CoreAdminOperation Checking request status for : 1
   [junit4]   2> 651242 INFO  (TEST-StatsReloadRaceTest.testParallelReloadAndStats-seed#[24ED6A41CE572906]) [    ] o.a.s.h.a.CoreAdminOperation Checking request status for : 1
   [junit4]   2> 651244 INFO  (TEST-StatsReloadRaceTest.testParallelReloadAndStats-seed#[24ED6A41CE572906]) [    ] o.a.s.h.a.CoreAdminOperation Checking request status for : 1
   [junit4]   2> 651244 INFO  (TEST-StatsReloadRaceTest.testParallelReloadAndStats-seed#[24ED6A41CE572906]) [    ] o.a.s.h.a.CoreAdminOperation Checking request status for : 1
   [junit4]   2> 651244 INFO  (TEST-StatsReloadRaceTest.testParallelReloadAndStats-seed#[24ED6A41CE572906]) [    ] o.a.s.h.a.CoreAdminOperation Checking request status for : 1
   [junit4]   2> 651245 INFO  (TEST-StatsReloadRaceTest.testParallelReloadAndStats-seed#[24ED6A41CE572906]) [    ] o.a.s.h.a.CoreAdminOperation Checking request status for : 1
   [junit4]   2> 651246 INFO  (TEST-StatsReloadRaceTest.testParallelReloadAndStats-seed#[24ED6A41CE572906]) [    ] o.a.s.h.a.CoreAdminOperation Checking request status for : 1
   [junit4]   2> 651246 INFO  (TEST-StatsReloadRaceTest.testParallelReloadAndStats-seed#[24ED6A41CE572906]) [    ] o.a.s.h.a.CoreAdminOperation Checking request status for : 1
   [junit4]   2> 651246 INFO  (TEST-StatsReloadRaceTest.testParallelReloadAndStats-seed#[24ED6A41CE572906]) [    ] o.a.s.h.a.CoreAdminOperation Checking request status for : 1
   [junit4]   2> 651246 INFO  (TEST-StatsReloadRaceTest.testParallelReloadAndStats-seed#[24ED6A41CE572906]) [    ] o.a.s.h.a.CoreAdminOperation Checking request status for : 1
   [junit4]   2> 651247 INFO  (TEST-StatsReloadRaceTest.testParallelReloadAndStats-seed#[24ED6A41CE572906]) [    ] o.a.s.h.a.CoreAdminOperation Checking request status for : 1
   [junit4]   2> 651248 INFO  (TEST-StatsReloadRaceTest.testParallelReloadAndStats-seed#[24ED6A41CE572906]) [    ] o.a.s.h.a.CoreAdminOperation Checking request status for : 1
   [junit4]   2> 651249 INFO  (TEST-StatsReloadRaceTest.testParallelReloadAndStats-seed#[24ED6A41CE572906]) [    ] o.a.s.h.a.CoreAdminOperation Checking request status for : 1
   [junit4]   2> 651250 INFO  (TEST-StatsReloadRaceTest.testParallelReloadAndStats-seed#[24ED6A41CE572906]) [    ] o.a.s.h.a.CoreAdminOperation Checking request status for : 1
   [junit4]   2> 651250 INFO  (TEST-StatsReloadRaceTest.testParallelReloadAndStats-seed#[24ED6A41CE572906]) [    ] o.a.s.h.a.CoreAdminOperation Checking request status for : 1
   [junit4]   2> 651251 INFO  (TEST-StatsReloadRaceTest.testParallelReloadAndStats-seed#[24ED6A41CE572906]) [    ] o.a.s.h.a.CoreAdminOperation Checking request status for : 1
   [junit4]   2> 651251 INFO  (TEST-StatsReloadRaceTest.testParallelReloadAndStats-seed#[24ED6A41CE572906]) [    ] o.a.s.h.a.CoreAdminOperation Checking request status for : 1
   [junit4]   2> 651251 INFO  (TEST-StatsReloadRaceTest.testParallelReloadAndStats-seed#[24ED6A41CE572906]) [    ] o.a.s.h.a.CoreAdminOperation Checking request status for : 1
   [junit4]   2> 651251 INFO  (TEST-StatsReloadRaceTest.testParallelReloadAndStats-seed#[24ED6A41CE572906]) [    ] o.a.s.h.a.CoreAdminOperation Checking request status for : 1
   [junit4]   2> 651252 INFO  (TEST-StatsReloadRaceTest.testParallelReloadAndStats-seed#[24ED6A41CE572906]) [    ] o.a.s.h.a.CoreAdminOperation Checking request status for : 1
   [junit4]   2> 651253 INFO  (TEST-StatsReloadRaceTest.testParallelReloadAndStats-seed#[24ED6A41CE572906]) [    ] o.a.s.h.a.CoreAdminOperation Checking request status for : 1
   [junit4]   2> 651253 INFO  (TEST-StatsReloadRaceTest.testParallelReloadAndStats-seed#[24ED6A41CE572906]) [    ] o.a.s.h.a.CoreAdminOperation Checking request status for : 1
   [junit4]   2> 651254 INFO  (TEST-StatsReloadRaceTest.testParallelReloadAndStats-seed#[24ED6A41CE572906]) [    ] o.a.s.h.a.CoreAdminOperation Checking request status for : 1
   [junit4]   2> 651254 INFO  (TEST-StatsReloadRaceTest.testParallelReloadAndStats-seed#[24ED6A41CE572906]) [    ] o.a.s.h.a.CoreAdminOperation Checking request status for : 1
   [junit4]   2> 651256 INFO  (TEST-StatsReloadRaceTest.testParallelReloadAndStats-seed#[24ED6A41CE572906]) [    ] o.a.s.h.a.CoreAdminOperation Checking request status for : 1
   [junit4]   2> 651257 INFO  (TEST-StatsReloadRaceTest.testParallelReloadAndStats-seed#[24ED6A41CE572906]) [    ] o.a.s.h.a.CoreAdminOperation Checking request status for : 1
   [junit4]   2> 651257 INFO  (TEST-StatsReloadRaceTest.testParallelReloadAndStats-seed#[24ED6A41CE572906]) [    ] o.a.s.h.a.CoreAdminOperation Checking request status for : 1
   [junit4]   2> 651258 INFO  (TEST-StatsReloadRaceTest.testParallelReloadAndStats-seed#[24ED6A41CE572906]) [    ] o.a.s.h.a.CoreAdminOperation Checking request status for : 1
   [junit4]   2> 651258 INFO  (TEST-StatsReloadRaceTest.testParallelReloadAndStats-seed#[24ED6A41CE572906]) [    ] o.a.s.h.a.CoreAdminOperation Checking request status for : 1
   [junit4]   2> 651259 INFO  (TEST-StatsReloadRaceTest.testParallelReloadAndStats-seed#[24ED6A41CE572906]) [    ] o.a.s.h.a.CoreAdminOperation Checking request status for : 1
   [junit4]   2> 651259 INFO  (TEST-StatsReloadRaceTest.testParallelReloadAndStats-seed#[24ED6A41CE572906]) [    ] o.a.s.h.a.CoreAdminOperation Checking request status for : 1
   [junit4]   2> 651260 INFO  (TEST-StatsReloadRaceTest.testParallelReloadAndStats-seed#[24ED6A41CE572906]) [    ] o.a.s.h.a.CoreAdminOperation Checking request status for : 1
   [junit4]   2> 651260 INFO  (TEST-StatsReloadRaceTest.testParallelReloadAndStats-seed#[24ED6A41CE572906]) [    ] o.a.s.h.a.CoreAdminOperation Checking request status for : 1
   [junit4]   2> 651260 INFO  (TEST-StatsReloadRaceTest.testParallelReloadAndStats-seed#[24ED6A41CE572906]) [    ] o.a.s.h.a.CoreAdminOperation Checking request status for : 1
   [junit4]   2> 651261 INFO  (TEST-StatsReloadRaceTest.testParallelReloadAndStats-seed#[24ED6A41CE572906]) [    ] o.a.s.h.a.CoreAdminOperation Checking request status for : 1
   [junit4]   2> 651261 INFO  (TEST-StatsReloadRaceTest.testParallelReloadAndStats-seed#[24ED6A41CE572906]) [    ] o.a.s.h.a.CoreAdminOperation Checking request status for : 1
   [junit4]   2> 651261 INFO  (parallelCoreAdminExecutor-3933-thread-1-processing-1 RELOAD) [    ] o.a.s.c.SolrConfig Using Lucene MatchVersion: 7.0.0
   [junit4]   2> 651261 INFO  (TEST-StatsReloadRaceTest.testParallelReloadAndStats-seed#[24ED6A41CE572906]) [    ] o.a.s.h.a.CoreAdminOperation Checking request status for : 1
   [junit4]   2> 651262 INFO  (TEST-StatsReloadRaceTest.testParallelReloadAndStats-seed#[24ED6A41CE572906]) [    ] o.a.s.h.a.CoreAdminOperation Checking request status for : 1
   [junit4]   2> 651263 INFO  (TEST-StatsReloadRaceTest.testParallelReloadAndStats-seed#[24ED6A41CE572906]) [    ] o.a.s.h.a.CoreAdminOperation Checking request status for : 1
   [junit4]   2> 651264 INFO  (TEST-StatsReloadRaceTest.testParallelReloadAndStats-seed#[24ED6A41CE572906]) [    ] o.a.s.h.a.CoreAdminOperation Checking request status for : 1
   [junit4]   2> 651264 INFO  (TEST-StatsReloadRaceTest.testParallelReloadAndStats-seed#[24ED6A41CE572906]) [    ] o.a.s.h.a.CoreAdminOperation Checking request status for : 1
   [junit4]   2> 651264 INFO  (TEST-StatsReloadRaceTest.testParallelReloadAndStats-seed#[24ED6A41CE572906]) [    ] o.a.s.h.a.CoreAdminOperation Checking request status for : 1
   [junit4]   2> 651264 INFO  (TEST-StatsReloadRaceTest.testParallelReloadAndStats-seed#[24ED6A41CE572906]) [    ] o.a.s.h.a.CoreAdminOperation Checking request status for : 1
   [junit4]   2> 651265 INFO  (TEST-StatsReloadRaceTest.testParallelReloadAndStats-seed#[24ED6A41CE572906]) [    ] o.a.s.h.a.CoreAdminOperation Checking request status for : 1
   [junit4]   2> 651265 INFO  (TEST-StatsReloadRaceTest.testParallelReloadAndStats-seed#[24ED6A41CE572906]) [    ] o.a.s.h.a.CoreAdminOperation Checking request status for : 1
   [junit4]   2> 651265 INFO  (TEST-StatsReloadRaceTest.testParallelReloadAndStats-seed#[24ED6A41CE572906]) [    ] o.a.s.h.a.CoreAdminOperation Checking request status for : 1
   [junit4]   2> 651266 INFO  (TEST-StatsReloadRaceTest.testParallelReloadAndStats-seed#[24ED6A41CE572906]) [    ] o.a.s.h.a.CoreAdminOperation Checking request status for : 1
   [junit4]   2> 651266 INFO  (TEST-StatsReloadRaceTest.testParallelReloadAndStats-seed#[24ED6A41CE572906]) [    ] o.a.s.h.a.CoreAdminOperation Checking request status for : 1
   [junit4]   2> 651266 INFO  (TEST-StatsReloadRaceTest.testParallelReloadAndStats-seed#[24ED6A41CE572906]) [    ] o.a.s.h.a.CoreAdminOperation Checking request status for : 1
   [junit4]   2> 651266 INFO  (TEST-StatsReloadRaceTest.testParallelReloadAndStats-seed#[24ED6A41CE572906]) [    ] o.a.s.h.a.CoreAdminOperation Checking request status for : 1
   [junit4]   2> 651268 INFO  (TEST-StatsReloadRaceTest.testParallelReloadAndStats-seed#[24ED6A41CE572906]) [    ] o.a.s.h.a.CoreAdminOperation Checking request status for : 1
   [junit4]   2> 651268 INFO  (TEST-StatsReloadRaceTest.testParallelReloadAndStats-seed#[24ED6A41CE572906]) [    ] o.a.s.h.a.CoreAdminOperation Checking request status for : 1
   [junit4]   2> 651268 INFO  (TEST-StatsReloadRaceTest.testParallelReloadAndStats-seed#[24ED6A41CE572906]) [    ] o.a.s.h.a.CoreAdminOperation Checking request status for : 1
   [junit4]   2> 651268 INFO  (TEST-StatsReloadRaceTest.testParallelReloadAndStats-seed#[24ED6A41CE572906]) [    ] o.a.s.h.a.CoreAdminOperation Checking request status for : 1
   [junit4]   2> 651269 INFO  (TEST-StatsReloadRaceTest.testParallelReloadAndStats-seed#[24ED6A41CE572906]) [    ] o.a.s.h.a.CoreAdminOperation Checking request status for : 1
   [junit4]   2> 651269 INFO  (TEST-StatsReloadRaceTest.testParallelReloadAndStats-seed#[24ED6A41CE572906]) [    ] o.a.s.h.a.CoreAdminOperation Checking request status for : 1
   [junit4]   2> 651270 INFO  (TEST-StatsReloadRaceTest.testParallelReloadAndStats-seed#[24ED6A41CE572906]) [    ] o.a.s.h.a.CoreAdminOperation Checking request status for : 1
   [junit4]   2> 651271 INFO  (TEST-StatsReloadRaceTest.testParallelReloadAndStats-seed#[24ED6A41CE572906]) [    ] o.a.s.h.a.CoreAdminOperation Checking request status for : 1
   [junit4]   2> 651272 INFO  (TEST-StatsReloadRaceTest.testParallelReloadAndStats-seed#[24ED6A41CE572906]) [    ] o.a.s.h.a.CoreAdminOperation Checking request status for : 1
   [junit4]   2> 651272 INFO  (TEST-StatsReloadRaceTest.testParallelReloadAndStats-seed#[24ED6A41CE572906]) [    ] o.a.s.h.a.CoreAdminOperation Checking request status for : 1
   [junit4]   2> 651272 INFO  (TEST-StatsReloadRaceTest.testParallelReloadAndStats-seed#[24ED6A41CE572906]) [    ] o.a.s.h.a.CoreAdminOperation Checking request status for : 1
   [junit4]   2> 651273 INFO  (TEST-StatsReloadRaceTest.testParallelReloadAndStats-seed#[24ED6A41CE572906]) [    ] o.a.s.h.a.CoreAdminOperation Checking request status for : 1
   [junit4]   2> 651273 INFO  (TEST-StatsReloadRaceTest.testParallelReloadAndStats-seed#[24ED6A41CE572906]) [    ] o.a.s.h.a.CoreAdminOperation Checking request status for : 1
   [junit4]   2> 651273 INFO  (TEST-StatsReloadRaceTest.testParallelReloadAndStats-seed#[24ED6A41CE572906]) [    ] o.a.s.h.a.CoreAdminOperation Checking request status for : 1
   [junit4]   2> 651274 INFO  (TEST-StatsReloadRaceTest.testParallelReloadAndStats-seed#[24ED6A41CE572906]) [    ] o.a.s.h.a.CoreAdminOperation Checking request status for : 1
   [junit4]   2> 651275 INFO  (TEST-StatsReloadRaceTest.testParallelReloadAndStats-seed#[24ED6A41CE572906]) [    ] o.a.s.h.a.CoreAdminOperation Checking request status for : 1
   [junit4]   2> 651275 INFO  (TEST-StatsReloadRaceTest.testParallelReloadAndStats-seed#[24ED6A41CE572906]) [    ] o.a.s.h.a.CoreAdminOperation Checking request status for : 1
   [junit4]   2> 651276 INFO  (TEST-StatsReloadRaceTest.testParallelReloadAndStats-seed#[24ED6A41CE572906]) [    ] o.a.s.h.a.CoreAdminOperation Checking request status for : 1
   [junit4]   2> 651276 INFO  (TEST-StatsReloadRaceTest.testParallelReloadAndStats-seed#[24ED6A41CE572906]) [    ] o.a.s.h.a.CoreAdminOperation Checking request status for : 1
   [junit4]   2> 651276 INFO  (TEST-StatsReloadRaceTest.testParallelReloadAndStats-seed#[24ED6A41CE572906]) [    ] o.a.s.h.a.CoreAdminOperation Checking request status for : 1
   [junit4]   2> 651277 INFO  (TEST-StatsReloadRaceTest.testParallelReloadAndStats-seed#[24ED6A41CE572906]) [    ] o.a.s.h.a.CoreAdminOperation Checking request status for : 1
   [junit4]   2> 651277 INFO  (TEST-StatsReloadRaceTest.testParallelReloadAndStats-seed#[24ED6A41CE572906]) [    ] o.a.s.h.a.CoreAdminOperation Checking request status for : 1
   [junit4]   2> 651278 INFO  (TEST-StatsReloadRaceTest.testParallelReloadAndStats-seed#[24ED6A41CE572906]) [    ] o.a.s.h.a.CoreAdminOperation Checking request status for : 1
   [junit4]   2> 651278 INFO  (TEST-StatsReloadRaceTest.testParallelReloadAndStats-seed#[24ED6A41CE572906]) [    ] o.a.s.h.a.CoreAdminOperation Checking request status for : 1
   [junit4]   2> 651279 INFO  (TEST-StatsReloadRaceTest.testParallelReloadAndStats-seed#[24ED6A41CE572906]) [    ] o.a.s.h.a.CoreAdminOperation Checking request status for : 1
   [junit4]   2> 651280 INFO  (TEST-StatsReloadRaceTest.testParallelReloadAndStats-seed#[24ED6A41CE572906]) [    ] o.a.s.h.a.CoreAdminOperation Checking request status for : 1
   [junit4]   2> 651280 INFO  (TEST-StatsReloadRaceTest.testParallelReloadAndStats-seed#[24ED6A41CE572906]) [    ] o.a.s.h.a.CoreAdminOperation Checking request status for : 1
   [junit4]   2> 651281 INFO  (parallelCoreAdminExecutor-3933-thread-1-processing-1 RELOAD) [    ] o.a.s.s.IndexSchema [collection1] Schema name=test
   [junit4]   2> 651281 INFO  (TEST-StatsReloadRaceTest.testParallelReloadAndStats-seed#[24ED6A41CE572906]) [    ] o.a.s.h.a.CoreAdminOperation Checking request status for : 1
   [junit4]   2> 651281 INFO  (TEST-StatsReloadRaceTest.testParallelReloadAndStats-seed#[24ED6A41CE572906]) [    ] o.a.s.h.a.CoreAdminOperation Checking request status for : 1
   [junit4]   2> 651281 INFO  (TEST-StatsReloadRaceTest.testParallelReloadAndStats-seed#[24ED6A41CE572906]) [    ] o.a.s.h.a.CoreAdminOperation Checking request status for : 1
   [junit4]   2> 651282 INFO  (TEST-StatsReloadRaceTest.testParallelReloadAndStats-seed#[24ED6A41CE572906]) [    ] o.a.s.h.a.CoreAdminOperation Checking request status for : 1
   [junit4]   2> 651282 INFO  (TEST-StatsReloadRaceTest.testParallelReloadAndStats-seed#[24ED6A41CE572906]) [    ] o.a.s.h.a.CoreAdminOperation Checking request status for : 1
   [junit4]   2> 651282 INFO  (TEST-StatsReloadRaceTest.testParallelReloadAndStats-seed#[24ED6A41CE572906]) [    ] o.a.s.h.a.CoreAdminOperation Checking request status for : 1
   [junit4]   2> 651283 INFO  (TEST-StatsReloadRaceTest.testParallelReloadAndStats-seed#[24ED6A41CE572906]) [    ] o.a.s.h.a.CoreAdminOperation Checking request status for : 1
   [junit4]   2> 651284 INFO  (TEST-StatsReloadRaceTest.testParallelReloadAndStats-seed#[24ED6A41CE572906]) [    ] o.a.s.h.a.CoreAdminOperation Checking request status for : 1
   [junit4]   2> 651285 INFO  (TEST-StatsReloadRaceTest.testParallelReloadAndStats-seed#[24ED6A41CE572906]) [    ] o.a.s.h.a.CoreAdminOperation Checking request status for : 1
   [junit4]   2> 651285 INFO  (TEST-StatsReloadRaceTest.testParallelReloadAndStats-seed#[24ED6A41CE572906]) [    ] o.a.s.h.a.CoreAdminOperation Checking request status for : 1
   [junit4]   2> 651286 INFO  (TEST-StatsReloadRaceTest.testParallelReloadAndStats-seed#[24ED6A41CE572906]) [    ] o.a.s.h.a.CoreAdminOperation Checking request status for : 1
   [junit4]   2> 651286 INFO  (TEST-StatsReloadRaceTest.testParallelReloadAndStats-seed#[24ED6A41CE572906]) [    ] o.a.s.h.a.CoreAdminOperation Checking request status for : 1
   [junit4]   2> 651287 INFO  (TEST-StatsReloadRaceTest.testParallelReloadAndStats-seed#[24ED6A41CE572906]) [    ] o.a.s.h.a.CoreAdminOperation Checking request status for : 1
   [junit4]   2> 651288 INFO  (TEST-StatsReloadRaceTest.testParallelReloadAndStats-seed#[24ED6A41CE572906]) [    ] o.a.s.h.a.CoreAdminOperation Checking request status for : 1
   [junit4]   2> 651288 INFO  (TEST-StatsReloadRaceTest.testParallelReloadAndStats-seed#[24ED6A41CE572906]) [    ] o.a.s.h.a.CoreAdminOperation Checking request status for : 1
   [junit4]   2> 651288 INFO  (TEST-StatsReloadRaceTest.testParallelReloadAndStats-seed#[24ED6A41CE572906]) [    ] o.a.s.h.a.CoreAdminOperation Checking request status for : 1
   [junit4]   2> 651288 INFO  (TEST-StatsReloadRaceTest.testParallelReloadAndStats-seed#[24ED6A41CE572906]) [    ] o.a.s.h.a.CoreAdminOperation Checking request status for : 1
   [junit4]   2> 651288 INFO  (TEST-StatsReloadRaceTest.testParallelReloadAndStats-seed#[24ED6A41CE572906]) [    ] o.a.s.h.a.CoreAdminOperation Checking request status for : 1
   [junit4]   2> 651289 INFO  (TEST-StatsReloadRaceTest.testParallelReloadAndStats-seed#[24ED6A41CE572906]) [    ] o.a.s.h.a.CoreAdminOperation Checking request status for : 1
   [junit4]   2> 651289 INFO  (TEST-StatsReloadRaceTest.testParallelReloadAndStats-seed#[24ED6A41CE572906]) [    ] o.a.s.h.a.CoreAdminOperation Checking request status for : 1
   [junit4]   2> 651289 INFO  (TEST-StatsReloadRaceTest.testParallelReloadAndStats-seed#[24ED6A41CE572906]) [    ] o.a.s.h.a.CoreAdminOperation Checking request status for : 1
   [junit4]   2> 651290 INFO  (TEST-StatsReloadRaceTest.testParallelReloadAndStats-seed#[24ED6A41CE572906]) [    ] o.a.s.h.a.CoreAdminOperation Checking request status for : 1
   [junit4]   2> 651290 INFO  (TEST-StatsReloadRaceTest.testParallelReloadAndStats-seed#[24ED6A41CE572906]) [    ] o.a.s.h.a.CoreAdminOperation Checking request status for : 1
   [junit4]   2> 651291 INFO  (TEST-StatsReloadRaceTest.testParallelReloadAndStats-seed#[24ED6A41CE572906]) [    ] o.a.s.h.a.CoreAdminOperation Checking request status for : 1
   [junit4]   2> 651292 INFO  (TEST-StatsReloadRaceTest.testParallelReloadAndStats-seed#[24ED6A41CE572906]) [    ] o.a.s.h.a.CoreAdminOperation Checking request status for : 1
   [junit4]   2> 651292 INFO  (TEST-StatsReloadRaceTest.testParallelReloadAndStats-seed#[24ED6A41CE572906]) [    ] o.a.s.h.a.CoreAdminOperation Checking request status for : 1
   [junit4]   2> 651293 INFO  (TEST-StatsReloadRaceTest.testParallelReloadAndStats-seed#[24ED6A41CE572906]) [    ] o.a.s.h.a.CoreAdminOperation Checking request status for : 1
   [junit4]   2> 651293 INFO  (TEST-StatsReloadRaceTest.testParallelReloadAndStats-seed#[24ED6A41CE572906]) [    ] o.a.s.h.a.CoreAdminOperation Checking request status for : 1
   [junit4]   2> 651293 INFO  (TEST-StatsReloadRaceTest.testParallelReloadAndStats-seed#[24ED6A41CE572906]) [    ] o.a.s.h.a.CoreAdminOperation Checking request status for : 1
   [junit4]   2> 651293 INFO  (TEST-StatsReloadRaceTest.testParallelReloadAndStats-seed#[24ED6A41CE572906]) [    ] o.a.s.h.a.CoreAdminOperation Checking request status for : 1
   [junit4]   2> 651294 INFO  (TEST-StatsReloadRaceTest.testParallelReloadAndStats-seed#[24ED6A41CE572906]) [    ] o.a.s.h.a.CoreAdminOperation Checking request status for : 1
   [junit4]   2> 651294 INFO  (TEST-StatsReloadRaceTest.testParallelReloadAndStats-seed#[24ED6A41CE572906]) [    ] o.a.s.h.a.CoreAdminOperation Checking request status for : 1
   [junit4]   2> 651295 INFO  (TEST-StatsReloadRaceTest.testParallelReloadAndStats-seed#[24ED6A41CE572906]) [    ] o.a.s.h.a.CoreAdminOperation Checking request status for : 1
   [junit4]   2> 651296 INFO  (TEST-StatsReloadRaceTest.testParallelReloadAndStats-seed#[24ED6A41CE572906]) [    ] o.a.s.h.a.CoreAdminOperation Checking request status for : 1
   [junit4]   2> 651296 INFO  (TEST-StatsReloadRaceTest.testParallelReloadAndStats-seed#[24ED6A41CE572906]) [    ] o.a.s.h.a.CoreAdminOperation Checking request status for : 1
   [junit4]   2> 651296 INFO  (TEST-StatsReloadRaceTest.testParallelReloadAndStats-seed#[24ED6A41CE572906]) [    ] o.a.s.h.a.CoreAdminOperation Checking request status for : 1
   [junit4]   2> 651297 INFO  (TEST-StatsReloadRaceTest.testParallelReloadAndStats-seed#[24ED6A41CE572906]) [    ] o.a.s.h.a.CoreAdminOperation Checking request status for : 1
   [junit4]   2> 651297 INFO  (TEST-StatsReloadRaceTest.testParallelReloadAndStats-seed#[24ED6A41CE572906]) [    ] o.a.s.h.a.CoreAdminOperation Checking request status for : 1
   [junit4]   2> 651298 INFO  (TEST-StatsReloadRaceTest.testParallelReloadAndStats-seed#[24ED6A41CE572906]) [    ] o.a.s.h.a.CoreAdminOperation Checking request status for : 1
   [junit4]   2> 651298 INFO  (TEST-StatsReloadRaceTest.testParallelReloadAndStats-seed#[24ED6A41CE572906]) [    ] o.a.s.h.a.CoreAdminOperation Checking request status for : 1
   [junit4]   2> 651298 INFO  (TEST-StatsReloadRaceTest.testParallelReloadAndStats-seed#[24ED6A41CE572906]) [    ] o.a.s.h.a.CoreAdminOperation Checking request status for : 1
   [junit4]   2> 651299 INFO  (TEST-StatsReloadRaceTest.testParallelReloadAndStats-seed#[24ED6A41CE572906]) [    ] o.a.s.h.a.CoreAdminOperation Checking request status for : 1
   [junit4]   2> 651299 INFO  (TEST-StatsReloadRaceTest.testParallelReloadAndStats-seed#[24ED6A41CE572906]) [    ] o.a.s.h.a.CoreAdminOperation Checking request status for : 1
   [junit4]   2> 651666 INFO  (TEST-StatsReloadRaceTest.testParallelReloadAndStats-seed#[24ED6A41CE572906]) [    ] o.a.s.h.a.CoreAdminOperation Checking request status for : 1
   [junit4]   2> 651667 INFO  (TEST-StatsReloadRaceTest.testParallelReloadAndStats-seed#[24ED6A41CE572906]) [    ] o.a.s.h.a.CoreAdminOperation Checking request status for : 1
   [junit4]   2> 651667 INFO  (TEST-StatsReloadRaceTest.testParallelReloadAndStats-seed#[24ED6A41CE572906]) [    ] o.a.s.h.a.CoreAdminOperation Checking request status for : 1
   [junit4]   2> 651668 INFO  (TEST-StatsReloadRaceTest.testParallelReloadAndStats-seed#[24ED6A41CE572906]) [    ] o.a.s.h.a.CoreAdminOperation Checking request status for : 1
   [junit4]   2> 651668 INFO  (TEST-StatsReloadRaceTest.testParallelReloadAndStats-seed#[24ED6A41CE572906]) [    ] o.a.s.h.a.CoreAdminOperation Checking request status for : 1
   [junit4]   2> 651668 INFO  (TEST-StatsReloadRaceTest.testParallelReloadAndStats-seed#[24ED6A41CE572906]) [    ] o.a.s.h.a.CoreAdminOperation Checking request status for : 1
   [junit4]   2> 651668 INFO  (TEST-StatsReloadRaceTest.testParallelReloadAndStats-seed#[24ED6A41CE572906]) [    ] o.a.s.h.a.CoreAdminOperation Checking request status for : 1
   [junit4]   2> 651669 INFO  (TEST-StatsReloadRaceTest.testParallelReloadAndStats-seed#[24ED6A41CE572906]) [    ] o.a.s.h.a.CoreAdminOperation Checking request status for : 1
   [junit4]   2> 651669 INFO  (TEST-StatsReloadRaceTest.testParallelReloadAndStats-seed#[24ED6A41CE572906]) [    ] o.a.s.h.a.CoreAdminOperation Checking request status for : 1
   [junit4]   2> 651669 INFO  (TEST-StatsReloadRaceTest.testParallelReloadAndStats-seed#[24ED6A41CE572906]) [    ] o.a.s.h.a.CoreAdminOperation Checking request status for : 1
   [junit4]   2> 651670 INFO  (TEST-StatsReloadRaceTest.testParallelReloadAndStats-seed#[24ED6A41CE572906]) [    ] o.a.s.h.a.CoreAdminOperation Checking request status for : 1
   [junit4]   2> 651670 INFO  (TEST-StatsReloadRaceTest.testParallelReloadAndStats-seed#[24ED6A41CE572906]) [    ] o.a.s.h.a.CoreAdminOperation Checking request status for : 1
   [junit4]   2> 651670 INFO  (TEST-StatsReloadRaceTest.testParallelReloadAndStats-seed#[24ED6A41CE572906]) [    ] o.a.s.h.a.CoreAdminOperation Checking request status for : 1
   [junit4]   2> 651670 INFO  (TEST-StatsReloadRaceTest.testParallelReloadAndStats-seed#[24ED6A41CE572906]) [    ] o.a.s.h.a.CoreAdminOperation Checking request status for : 1
   [junit4]   2> 651671 INFO  (TEST-StatsReloadRaceTest.testParallelReloadAndStats-seed#[24ED6A41CE572906]) [    ] o.a.s.h.a.CoreAdminOperation Checking request status for : 1
   [junit4]   2> 651671 INFO  (TEST-StatsReloadRaceTest.testParallelReloadAndStats-seed#[24ED6A41CE572906]) [    ] o.a.s.h.a.CoreAdminOperation Checking request status for : 1
   [junit4]   2> 651671 INFO  (TEST-StatsReloadRaceTest.testParallelReloadAndStats-seed#[24ED6A41CE572906]) [    ] o.a.s.h.a.CoreAdminOperation Checking request status for : 1
   [junit4]   2> 651671 INFO  (TEST-StatsReloadRaceTest.testParallelReloadAndStats-seed#[24ED6A41CE572906]) [    ] o.a.s.h.a.CoreAdminOperation Checking request status for : 1
   [junit4]   2> 651671 INFO  (TEST-StatsReloadRaceTest.testParallelReloadAndStats-seed#[24ED6A41CE572906]) [    ] o.a.s.h.a.CoreAdminOperation Checking request status for : 1
   [junit4]   2> 651672 INFO  (TEST-StatsReloadRaceTest.testParallelReloadAndStats-seed#[24ED6A41CE572906]) [    ] o.a.s.h.a.CoreAdminOperation Checking request status for : 1
   [junit4]   2> 651672 INFO  (TEST-StatsReloadRaceTest.testParallelReloadAndStats-seed#[24ED6A41CE572906]) [    ] o.a.s.h.a.CoreAdminOperation Checking request status for : 1
   [junit4]   2> 651672 INFO  (TEST-StatsReloadRaceTest.testParallelReloadAndStats-seed#[24ED6A41CE572906]) [    ] o.a.s.h.a.CoreAdminOperation Checking request status for : 1
   [junit4]   2> 651672 INFO  (TEST-StatsReloadRaceTest.testParallelReloadAndStats-seed#[24ED6A41CE572906]) [    ] o.a.s.h.a.CoreAdminOperation Checking request status for : 1
   [junit4]   2> 651672 INFO  (TEST-StatsReloadRaceTest.testParallelReloadAndStats-seed#[24ED6A41CE572906]) [    ] o.a.s.h.a.CoreAdminOperation Checking request status for : 1
   [junit4]   2> 651672 INFO  (TEST-StatsReloadRaceTest.testParallelReloadAndStats-seed#[24ED6A41CE572906]) [    ] o.a.s.h.a.CoreAdminOperation Checking request status for : 1
   [junit4]   2> 651673 INFO  (TEST-StatsReloadRaceTest.testParallelReloadAndStats-seed#[24ED6A41CE572906]) [    ] o.a.s.h.a.CoreAdminOperation Checking request status for : 1
   [junit4]   2> 651673 INFO  (TEST-StatsReloadRaceTest.testParallelReloadAndStats-seed#[24ED6A41CE572906]) [    ] o.a.s.h.a.CoreAdminOperation Checking request status for : 1
   [junit4]   2> 651673 INFO  (TEST-StatsReloadRaceTest.testParallelReloadAndStats-seed#[24ED6A41CE572906]) [    ] o.a.s.h.a.CoreAdminOperation Checking request status for : 1
   [junit4]   2> 651673 INFO  (TEST-StatsReloadRaceTest.testParallelReloadAndStats-seed#[24ED6A41CE572906]) [    ] o.a.s.h.a.CoreAdminOperation Checking request status for : 1
   [junit4]   2> 651674 INFO  (TEST-StatsReloadRaceTest.testParallelReloadAndStats-seed#[24ED6A41CE572906]) [    ] o.a.s.h.a.CoreAdminOperation Checking request status for : 1
   [junit4]   2> 651674 INFO  (TEST-StatsReloadRaceTest.testParallelReloadAndStats-seed#[24ED6A41CE572906]) [    ] o.a.s.h.a.CoreAdminOperation Checking request status for : 1
   [junit4]   2> 651674 INFO  (TEST-StatsReloadRaceTest.testParallelReloadAndStats-seed#[24ED6A41CE572906]) [    ] o.a.s.h.a.CoreAdminOperation Checking request status for : 1
   [junit4]   2> 651674 INFO  (TEST-StatsReloadRaceTest.testParallelReloadAndStats-seed#[24ED6A41CE572906]) [    ] o.a.s.h.a.CoreAdminOperation Checking request status for : 1
   [junit4]   2> 651674 INFO  (TEST-StatsReloadRaceTest.testParallelReloadAndStats-seed#[24ED6A41CE572906]) [    ] o.a.s.h.a.CoreAdminOperation Checking request status for : 1
   [junit4]   2> 651675 INFO  (TEST-StatsReloadRaceTest.testParallelReloadAndStats-seed#[24ED6A41CE572906]) [    ] o.a.s.h.a.CoreAdminOperation Checking request status for : 1
   [junit4]   2> 651675 INFO  (TEST-StatsReloadRaceTest.testParallelReloadAndStats-seed#[24ED6A41CE572906]) [    ] o.a.s.h.a.CoreAdminOperation Checking request status for : 1
   [junit4]   2> 651676 INFO  (TEST-StatsReloadRaceTest.testParallelReloadAndStats-seed#[24ED6A41CE572906]) [    ] o.a.s.h.a.CoreAdminOperation Checking request status for : 1
   [junit4]   2> 651676 INFO  (TEST-StatsReloadRaceTest.testParallelReloadAndStats-seed#[24ED6A41CE572906]) [    ] o.a.s.h.a.CoreAdminOperation Checking request status for : 1
   [junit4]   2> 651676 INFO  (TEST-StatsReloadRaceTest.testParallelReloadAndStats-seed#[24ED6A41CE572906]) [    ] o.a.s.h.a.CoreAdminOperation Checking request status for : 1
   [junit4]   2> 651676 INFO  (TEST-StatsReloadRaceTest.testParallelReloadAndStats-seed#[24ED6A41CE572906]) [    ] o.a.s.h.a.CoreAdminOperation Checking request status for : 1
   [junit4]   2> 651677 INFO  (TEST-StatsReloadRaceTest.testParallelReloadAndStats-seed#[24ED6A41CE572906]) [    ] o.a.s.h.a.CoreAdminOperation Checking request status for : 1
   [junit4]   2> 651677 INFO  (TEST-StatsReloadRaceTest.testParallelReloadAndStats-seed#[24ED6A41CE572906]) [    ] o.a.s.h.a.CoreAdminOperation Checking request status for : 1
   [junit4]   2> 651677 INFO  (TEST-StatsReloadRaceTest.testParallelReloadAndStats-seed#[24ED6A41CE572906]) [    ] o.a.s.h.a.CoreAdminOperation Checking request status for : 1
   [junit4]   2> 651677 INFO  (TEST-StatsReloadRaceTest.testParallelReloadAndStats-seed#[24ED6A41CE572906]) [    ] o.a.s.h.a.CoreAdminOperation Checking request status for : 1
   [junit4]   2> 651678 INFO  (TEST-StatsReloadRaceTest.testParallelReloadAndStats-seed#[24ED6A41CE572906]) [    ] o.a.s.h.a.CoreAdminOperation Checking request status for : 1
   [junit4]   2> 651678 INFO  (TEST-StatsReloadRaceTest.testParallelReloadAndStats-seed#[24ED6A41CE572906]) [    ] o.a.s.h.a.CoreAdminOperation Checking request status for : 1
   [junit4]   2> 651678 INFO  (TEST-StatsReloadRaceTest.testParallelReloadAndStats-seed#[24ED6A41CE572906]) [    ] o.a.s.h.a.CoreAdminOperation Checking request status for : 1
   [junit4]   2> 651678 INFO  (TEST-StatsReloadRaceTest.testParallelReloadAndStats-seed#[24ED6A41CE572906]) [    ] o.a.s.h.a.CoreAdminOperation Checking request status for : 1
   [junit4]   2> 651678 INFO  (TEST-StatsReloadRaceTest.testParallelReloadAndStats-seed#[24ED6A41CE572906]) [    ] o.a.s.h.a.CoreAdminOperation Checking request status for : 1
   [junit4]   2> 651678 INFO  (TEST-StatsReloadRaceTest.testParallelReloadAndStats-seed#[24ED6A41CE572906]) [    ] o.a.s.h.a.CoreAdminOperation Checking request status for : 1
   [junit4]   2> 651678 INFO  (TEST-StatsReloadRaceTest.testParallelReloadAndStats-seed#[24ED6A41CE572906]) [    ] o.a.s.h.a.CoreAdminOperation Checking request status for : 1
   [junit4]   2> 651678 INFO  (TEST-StatsReloadRaceTest.testParallelReloadAndStats-seed#[24ED6A41CE572906]) [    ] o.a.s.h.a.CoreAdminOperation Checking request status for : 1
   [junit4]   2> 651678 INFO  (TEST-StatsReloadRaceTest.testParallelReloadAndStats-seed#[24ED6A41CE572906]) [    ] o.a.s.h.a.CoreAdminOperation Checking request status for : 1
   [junit4]   2> 651679 INFO  (TEST-StatsReloadRaceTest.testParallelReloadAndStats-seed#[24ED6A41CE572906]) [    ] o.a.s.h.a.CoreAdminOperation Checking request status for : 1
   [junit4]   2> 651679 INFO  (TEST-StatsReloadRaceTest.testParallelReloadAndStats-seed#[24ED6A41CE572906]) [    ] o.a.s.h.a.CoreAdminOperation Checking request status for : 1
   [junit4]   2> 651679 INFO  (TEST-StatsReloadRaceTest.testParallelReloadAndStats-seed#[24ED6A41CE572906]) [    ] o.a.s.h.a.CoreAdminOperation Checking request status for : 1
   [junit4]   2> 651680 INFO  (TEST-StatsReloadRaceTest.testParallelReloadAndStats-seed#[24ED6A41CE572906]) [    ] o.a.s.h.a.CoreAdminOperation Checking request status for : 1
   [junit4]   2> 651680 INFO  (TEST-StatsReloadRaceTest.testParallelReloadAndStats-seed#[24ED6A41CE572906]) [    ] o.a.s.h.a.CoreAdminOperation Checking request status for : 1
   [junit4]   2> 651680 INFO  (TEST-StatsReloadRaceTest.testParallelReloadAndStats-seed#[24ED6A41CE572906]) [    ] o.a.s.h.a.CoreAdminOperation Checking request status for : 1
   [junit4]   2> 651681 INFO  (TEST-StatsReloadRaceTest.testParallelReloadAndStats-seed#[24ED6A41CE572906]) [    ] o.a.s.h.a.CoreAdminOperation Checking request status for : 1
   [junit4]   2> 651681 INFO  (TEST-StatsReloadRaceTest.testParallelReloadAndStats-seed#[24ED6A41CE572906]) [    ] o.a.s.h.a.CoreAdminOperation Checking request status for : 1
   [junit4]   2> 651681 INFO  (TEST-StatsReloadRaceTest.testParallelReloadAndStats-seed#[24ED6A41CE572906]) [    ] o.a.s.h.a.CoreAdminOperation Checking request status for : 1
   [junit4]   2> 651681 INFO  (TEST-StatsReloadRaceTest.testParallelReloadAndStats-seed#[24ED6A41CE572906]) [    ] o.a.s.h.a.CoreAdminOperation Checking request status for : 1
   [junit4]   2> 651682 INFO  (TEST-StatsReloadRaceTest.testParallelReloadAndStats-seed#[24ED6A41CE572906]) [    ] o.a.s.h.a.CoreAdminOperation Checking request status for : 1
   [junit4]   2> 651682 INFO  (TEST-StatsReloadRaceTest.testParallelReloadAndStats-seed#[24ED6A41CE572906]) [    ] o.a.s.h.a.CoreAdminOperation Checking request status for : 1
   [junit4]   2> 651682 INFO  (TEST-StatsReloadRaceTest.testParallelReloadAndStats-seed#[24ED6A41CE572906]) [    ] o.a.s.h.a.CoreAdminOperation Checking request status for : 1
   [junit4]   2> 651682 INFO  (TEST-StatsReloadRaceTest.testParallelReloadAndStats-seed#[24ED6A41CE572906]) [    ] o.a.s.h.a.CoreAdminOperation Checking request status for : 1
   [junit4]   2> 651682 INFO  (TEST-StatsReloadRaceTest.testParallelReloadAndStats-seed#[24ED6A41CE572906]) [    ] o.a.s.h.a.CoreAdminOperation Checking request status for : 1
   [junit4]   2> 651683 INFO  (TEST-StatsReloadRaceTest.testParallelReloadAndStats-seed#[24ED6A41CE572906]) [    ] o.a.s.h.a.CoreAdminOperation Checking request status for : 1
   [junit4]   2> 651683 INFO  (TEST-StatsReloadRaceTest.testParallelReloadAndStats-seed#[24ED6A41CE572906]) [    ] o.a.s.h.a.CoreAdminOperation Checking request status for : 1
   [junit4]   2> 651683 INFO  (TEST-StatsReloadRaceTest.testParallelReloadAndStats-seed#[24ED6A41CE572906]) [    ] o.a.s.h.a.CoreAdminOperation Checking request status for : 1
   [junit4]   2> 651683 INFO  (TEST-StatsReloadRaceTest.testParallelReloadAndStats-seed#[24ED6A41CE572906]) [    ] o.a.s.h.a.CoreAdminOperation Checking request status for : 1
   [junit4]   2> 651684 INFO  (TEST-StatsReloadRaceTest.testParallelReloadAndStats-seed#[24ED6A41CE572906]) [    ] o.a.s.h.a.CoreAdminOperation Checking request status for : 1
   [junit4]   2> 651684 INFO  (TEST-StatsReloadRaceTest.testParallelReloadAndStats-seed#[24ED6A41CE572906]) [    ] o.a.s.h.a.CoreAdminOperation Checking request status for : 1
   [junit4]   2> 651684 INFO  (TEST-StatsReloadRaceTest.testParallelReloadAndStats-seed#[24ED6A41CE572906]) [    ] o.a.s.h.a.CoreAdminOperation Checking request status for : 1
   [junit4]   2> 651684 INFO  (TEST-StatsReloadRaceTest.testParallelReloadAndStats-seed#[24ED6A41CE572906]) [    ] o.a.s.h.a.CoreAdminOperation Checking request status for : 1
   [junit4]   2> 651684 INFO  (TEST-StatsReloadRaceTest.testParallelReloadAndStats-seed#[24ED6A41CE572906]) [    ] o.a.s.h.a.CoreAdminOperation Checking request status for : 1
   [junit4]   2> 651684 INFO  (TEST-StatsReloadRaceTest.testParallelReloadAndStats-seed#[24ED6A41CE572906]) [    ] o.a.s.h.a.CoreAdminOperation Checking request status for : 1
   [junit4]   2> 651685 INFO  (TEST-StatsReloadRaceTest.testParallelReloadAndStats-seed#[24ED6A41CE572906]) [    ] o.a.s.h.a.CoreAdminOperation Checking request status for : 1
   [junit4]   2> 651685 INFO  (TEST-StatsReloadRaceTest.testParallelReloadAndStats-seed#[24ED6A41CE572906]) [    ] o.a.s.h.a.CoreAdminOperation Checking request status for : 1
   [junit4]   2> 651685 INFO  (TEST-StatsReloadRaceTest.testParallelReloadAndStats-seed#[24ED6A41CE572906]) [    ] o.a.s.h.a.CoreAdminOperation Checking request status for : 1
   [junit4]   2> 651685 INFO  (TEST-StatsReloadRaceTest.testParallelReloadAndStats-seed#[24ED6A41CE572906]) [    ] o.a.s.h.a.CoreAdminOperation Checking request status for : 1
   [junit4]   2> 651686 INFO  (TEST-StatsReloadRaceTest.testParallelReloadAndStats-seed#[24ED6A41CE572906]) [    ] o.a.s.h.a.CoreAdminOperation Checking request status for : 1
   [junit4]   2> 651686 INFO  (TEST-StatsReloadRaceTest.testParallelReloadAndStats-seed#[24ED6A41CE572906]) [    ] o.a.s.h.a.CoreAdminOperation Checking request status for : 1
   [junit4]   2> 651687 INFO  (TEST-StatsReloadRaceTest.testParallelReloadAndStats-seed#[24ED6A41CE572906]) [    ] o.a.s.h.a.CoreAdminOperation Checking request status for : 1
   [junit4]   2> 651687 INFO  (TEST-StatsReloadRaceTest.testParallelReloadAndStats-seed#[24ED6A41CE572906]) [    ] o.a.s.h.a.CoreAdminOperation Checking request status for : 1
   [junit4]   2> 651687 INFO  (TEST-StatsReloadRaceTest.testParallelReloadAndStats-seed#[24ED6A41CE572906]) [    ] o.a.s.h.a.CoreAdminOperation Checking request status for : 1
   [junit4]   2> 651687 INFO  (TEST-StatsReloadRaceTest.testParallelReloadAndStats-seed#[24ED6A41CE572906]) [    ] o.a.s.h.a.CoreAdminOperation Checking request status for : 1
   [junit4]   2> 651688 INFO  (TEST-StatsReloadRaceTest.testParallelReloadAndStats-seed#[24ED6A41CE572906]) [    ] o.a.s.h.a.CoreAdminOperation Checking request status for : 1
   [junit4]   2> 651688 INFO  (TEST-StatsReloadRaceTest.testParallelReloadAndStats-seed#[24ED6A41CE572906]) [    ] o.a.s.h.a.CoreAdminOperation Checking request status for : 1
   [junit4]   2> 651688 INFO  (TEST-StatsReloadRaceTest.testParallelReloadAndStats-seed#[24ED6A41CE572906]) [    ] o.a.s.h.a.CoreAdminOperation Checking request status for : 1
   [junit4]   2> 651688 INFO  (TEST-StatsReloadRaceTest.testParallelReloadAndStats-seed#[24ED6A41CE572906]) [    ] o.a.s.h.a.CoreAdminOperation Checking request status for : 1
   [junit4]   2> 651689 INFO  (TEST-StatsReloadRaceTest.testParallelReloadAndStats-seed#[24ED6A41CE572906]) [    ] o.a.s.h.a.CoreAdminOperation Checking request status for : 1
   [junit4]   2> 651689 INFO  (TEST-StatsReloadRaceTest.testParallelReloadAndStats-seed#[24ED6A41CE572906]) [    ] o.a.s.h.a.CoreAdminOperation Checking request status for : 1
   [junit4]   2> 651689 INFO  (TEST-StatsReloadRaceTest.testParallelReloadAndStats-seed#[24ED6A41CE572906]) [    ] o.a.s.h.a.CoreAdminOperation Checking request status for : 1
   [junit4]   2> 651690 INFO  (TEST-StatsReloadRaceTest.testParallelReloadAndStats-seed#[24ED6A41CE572906]) [    ] o.a.s.h.a.CoreAdminOperation Checking request status for : 1
   [junit4]   2> 651690 INFO  (TEST-StatsReloadRaceTest.testParallelReloadAndStats-seed#[24ED6A41CE572906]) [    ] o.a.s.h.a.CoreAdminOperation Checking request status for : 1
   [junit4]   2> 651690 INFO  (TEST-StatsReloadRaceTest.testParallelReloadAndStats-seed#[24ED6A41CE572906]) [    ] o.a.s.h.a.CoreAdminOperation Checking request status for : 1
   [junit4]   2> 651690 INFO  (TEST-StatsReloadRaceTest.testParallelReloadAndStats-seed#[24ED6A41CE572906]) [    ] o.a.s.h.a.CoreAdminOperation Checking request status for : 1
   [junit4]   2> 651691 INFO  (TEST-StatsReloadRaceTest.testParallelReloadAndStats-seed#[24ED6A41CE572906]) [    ] o.a.s.h.a.CoreAdminOperation Checking request status for : 1
   [junit4]   2> 651691 INFO  (TEST-StatsReloadRaceTest.testParallelReloadAndStats-seed#[24ED6A41CE572906]) [    ] o.a.s.h.a.CoreAdminOperation Checking request status for : 1
   [junit4]   2> 651691 INFO  (TEST-StatsReloadRaceTest.testParallelReloadAndStats-seed#[24ED6A41CE572906]) [    ] o.a.s.h.a.CoreAdminOperation Checking request status for : 1
   [junit4]   2> 651692 INFO  (TEST-StatsReloadRaceTest.testParallelReloadAndStats-seed#[24ED6A41CE572906]) [    ] o.a.s.h.a.CoreAdminOperation Checking request status for : 1
   [junit4]   2> 651692 INFO  (TEST-StatsReloadRaceTest.testParallelReloadAndStats-seed#[24ED6A41CE572906]) [    ] o.a.s.h.a.CoreAdminOperation Checking request status for : 1
   [junit4]   2> 651692 INFO  (TEST-StatsReloadRaceTest.testParallelReloadAndStats-seed#[24ED6A41CE572906]) [    ] o.a.s.h.a.CoreAdminOperation Checking request status for : 1
   [junit4]   2> 651692 INFO  (TEST-StatsReloadRaceTest.testParallelReloadAndStats-seed#[24ED6A41CE572906]) [    ] o.a.s.h.a.CoreAdminOperation Checking request status for : 1
   [junit4]   2> 651692 INFO  (TEST-StatsReloadRaceTest.testParallelReloadAndStats-seed#[24ED6A41CE572906]) [    ] o.a.s.h.a.CoreAdminOperation Checking request status for : 1
   [junit4]   2> 651692 INFO  (TEST-StatsReloadRaceTest.testParallelReloadAndStats-seed#[24ED6A41CE572906]) [    ] o.a.s.h.a.CoreAdminOperation Checking request status for : 1
   [junit4]   2> 651692 INFO  (TEST-StatsReloadRaceTest.testParallelReloadAndStats-seed#[24ED6A41CE572906]) [    ] o.a.s.h.a.CoreAdminOperation Checking request status for : 1
   [junit4]   2> 651693 INFO  (TEST-StatsReloadRaceTest.testParallelReloadAndStats-seed#[24ED6A41CE572906]) [    ] o.a.s.h.a.CoreAdminOperation Checking request status for : 1
   [junit4]   2> 651693 INFO  (TEST-StatsReloadRaceTest.testParallelReloadAndStats-seed#[24ED6A41CE572906]) [    ] o.a.s.h.a.CoreAdminOperation Checking request status for : 1
   [junit4]   2> 651693 INFO  (TEST-StatsReloadRaceTest.testParallelReloadAndStats-seed#[24ED6A41CE572906]) [    ] o.a.s.h.a.CoreAdminOperation Checking request status for : 1
   [junit4]   2> 651693 INFO  (TEST-StatsReloadRaceTest.testParallelReloadAndStats-seed#[24ED6A41CE572906]) [    ] o.a.s.h.a.CoreAdminOperation Checking request status for : 1
   [junit4]   2> 651694 INFO  (TEST-StatsReloadRaceTest.testParallelReloadAndStats-seed#[24ED6A41CE572906]) [    ] o.a.s.h.a.CoreAdminOperation Checking request status for : 1
   [junit4]   2> 651694 INFO  (TEST-StatsReloadRaceTest.testParallelReloadAndStats-seed#[24ED6A41CE572906]) [    ] o.a.s.h.a.CoreAdminOperation Checking request status for : 1
   [junit4]   2> 651694 INFO  (TEST-StatsReloadRaceTest.testParallelReloadAndStats-seed#[24ED6A41CE572906]) [    ] o.a.s.h.a.CoreAdminOperation Checking request status for : 1
   [junit4]   2> 651695 INFO  (TEST-StatsReloadRaceTest.testParallelReloadAndStats-seed#[24ED6A41CE572906]) [    ] o.a.s.h.a.CoreAdminOperation Checking request status for : 1
   [junit4]   2> 651695 INFO  (TEST-StatsReloadRaceTest.testParallelReloadAndStats-seed#[24ED6A41CE572906]) [    ] o.a.s.h.a.CoreAdminOperation Checking request status for : 1
   [junit4]   2> 651695 INFO  (TEST-StatsReloadRaceTest.testParallelReloadAndStats-seed#[24ED6A41CE572906]) [    ] o.a.s.h.a.CoreAdminOperation Checking request status for : 1
   [junit4]   2> 651695 INFO  (TEST-StatsReloadRaceTest.testParallelReloadAndStats-seed#[24ED6A41CE572906]) [    ] o.a.s.h.a.CoreAdminOperation Checking request status for : 1
   [junit4]   2> 651696 INFO  (TEST-StatsReloadRaceTest.testParallelReloadAndStats-seed#[24ED6A41CE572906]) [    ] o.a.s.h.a.CoreAdminOperation Checking request status for : 1
   [junit4]   2> 651696 INFO  (TEST-StatsReloadRaceTest.testParallelReloadAndStats-seed#[24ED6A41CE572906]) [    ] o.a.s.h.a.CoreAdminOperation Checking request status for : 1
   [junit4]   2> 651696 INFO  (TEST-StatsReloadRaceTest.testParallelReloadAndStats-seed#[24ED6A41CE572906]) [    ] o.a.s.h.a.CoreAdminOperation Checking request status for : 1
   [junit4]   2> 651696 INFO  (TEST-StatsReloadRaceTest.testParallelReloadAndStats-seed#[24ED6A41CE572906]) [    ] o.a.s.h.a.CoreAdminOperation Checking request status for : 1
   [junit4]   2> 651696 INFO  (TEST-StatsReloadRaceTest.testParallelReloadAndStats-seed#[24ED6A41CE572906]) [    ] o.a.s.h.a.CoreAdminOperation Checking request status for : 1
   [junit4]   2> 651697 INFO  (TEST-StatsReloadRaceTest.testParallelReloadAndStats-seed#[24ED6A41CE572906]) [    ] o.a.s.h.a.CoreAdminOperation Checking request status for : 1
   [junit4]   2> 651697 INFO  (TEST-StatsReloadRaceTest.testParallelReloadAndStats-seed#[24ED6A41CE572906]) [    ] o.a.s.h.a.CoreAdminOperation Checking request status for : 1
   [junit4]   2> 651697 INFO  (TEST-StatsReloadRaceTest.testParallelReloadAndStats-seed#[24ED6A41CE572906]) [    ] o.a.s.h.a.CoreAdminOperation Checking request status for : 1
   [junit4]   2> 651697 INFO  (TEST-StatsReloadRaceTest.testParallelReloadAndStats-seed#[24ED6A41CE572906]) [    ] o.a.s.h.a.CoreAdminOperation Checking request status for : 1
   [junit4]   2> 651697 INFO  (TEST-StatsReloadRaceTest.testParallelReloadAndStats-seed#[24ED6A41CE572906]) [    ] o.a.s.h.a.CoreAdminOperation Checking request status for : 1
   [junit4]   2> 651697 INFO  (TEST-StatsReloadRaceTest.testParallelReloadAndStats-seed#[24ED6A41CE572906]) [    ] o.a.s.h.a.CoreAdminOperation Checking request status for : 1
   [junit4]   2> 651698 INFO  (TEST-StatsReloadRaceTest.testParallelReloadAndStats-seed#[24ED6A41CE572906]) [    ] o.a.s.h.a.CoreAdminOperation Checking request status for : 1
   [junit4]   2> 651698 INFO  (TEST-StatsReloadRaceTest.testParallelReloadAndStats-seed#[24ED6A41CE572906]) [    ] o.a.s.h.a.CoreAdminOperation Checking request status for : 1
   [junit4]   2> 651698 INFO  (TEST-StatsReloadRaceTest.testParallelReloadAndStats-seed#[24ED6A41CE572906]) [    ] o.a.s.h.a.CoreAdminOperation Checking request status for : 1
   [junit4]   2> 651699 INFO  (TEST-StatsReloadRaceTest.testParallelReloadAndStats-seed#[24ED6A41CE572906]) [    ] o.a.s.h.a.CoreAdminOperation Checking request status for : 1
   [junit4]   2> 651699 INFO  (TEST-StatsReloadRaceTest.testParallelReloadAndStats-seed#[24ED6A41CE572906]) [    ] o.a.s.h.a.CoreAdminOperation Checking request status for : 1
   [junit4]   2> 651699 INFO  (TEST-StatsReloadRaceTest.testParallelReloadAndStats-seed#[24ED6A41CE572906]) [    ] o.a.s.h.a.CoreAdminOperation Checking request status for : 1
   [junit4]   2> 651700 INFO  (TEST-StatsReloadRaceTest.testParallelReloadAndStats-seed#[24ED6A41CE572906]) [    ] o.a.s.h.a.CoreAdminOperation Checking request status for : 1
   [junit4]   2> 651700 INFO  (TEST-StatsReloadRaceTest.testParallelReloadAndStats-seed#[24ED6A41CE572906]) [    ] o.a.s.h.a.CoreAdminOperation Checking request status for : 1
   [junit4]   2> 651700 INFO  (TEST-StatsReloadRaceTest.testParallelReloadAndStats-seed#[24ED6A41CE572906]) [    ] o.a.s.h.a.CoreAdminOperation Checking request status for : 1
   [junit4]   2> 651701 INFO  (TEST-StatsReloadRaceTest.testParallelReloadAndStats-seed#[24ED6A41CE572906]) [    ] o.a.s.h.a.CoreAdminOperation Checking request status for : 1
   [junit4]   2> 651701 INFO  (TEST-StatsReloadRaceTest.testParallelReloadAndStats-seed#[24ED6A41CE572906]) [    ] o.a.s.h.a.CoreAdminOperation Checking request status for : 1
   [junit4]   2> 651701 INFO  (TEST-StatsReloadRaceTest.testParallelReloadAndStats-seed#[24ED6A41CE572906]) [    ] o.a.s.h.a.CoreAdminOperation Checking request status for : 1
   [junit4]   2> 651701 INFO  (TEST-StatsReloadRaceTest.testParallelReloadAndStats-seed#[24ED6A41CE572906]) [    ] o.a.s.h.a.CoreAdminOperation Checking request status for : 1
   [junit4]   2> 651702 INFO  (TEST-StatsReloadRaceTest.testParallelReloadAndStats-seed#[24ED6A41CE572906]) [    ] o.a.s.h.a.CoreAdminOperation Checking request status for : 1
   [junit4]   2> 651702 INFO  (TEST-StatsReloadRaceTest.testParallelReloadAndStats-seed#[24ED6A41CE572906]) [    ] o.a.s.h.a.CoreAdminOperation Checking request status for : 1
   [junit4]   2> 651702 INFO  (TEST-StatsReloadRaceTest.testParallelReloadAndStats-seed#[24ED6A41CE572906]) [    ] o.a.s.h.a.CoreAdminOperation Checking request status for : 1
   [junit4]   2> 651702 INFO  (TEST-StatsReloadRaceTest.testParallelReloadAndStats-seed#[24ED6A41CE572906]) [    ] o.a.s.h.a.CoreAdminOperation Checking request status for : 1
   [junit4]   2> 651702 INFO  (TEST-StatsReloadRaceTest.testParallelReloadAndStats-seed#[24ED6A41CE572906]) [    ] o.a.s.h.a.CoreAdminOperation Checking request status for : 1
   [junit4]   2> 651703 INFO  (TEST-StatsReloadRaceTest.testParallelReloadAndStats-seed#[24ED6A41CE572906]) [    ] o.a.s.h.a.CoreAdminOperation Checking request status for : 1
   [junit4]   2> 651703 INFO  (TEST-StatsReloadRaceTest.testParallelReloadAndStats-seed#[24ED6A41CE572906]) [    ] o.a.s.h.a.CoreAdminOperation Checking request status for : 1
   [junit4]   2> 651704 INFO  (TEST-StatsReloadRaceTest.testParallelReloadAndStats-seed#[24ED6A41CE572906]) [    ] o.a.s.h.a.CoreAdminOperation Checking request status for : 1
   [junit4]   2> 651704 INFO  (TEST-StatsReloadRaceTest.testParallelReloadAndStats-seed#[24ED6A41CE572906]) [    ] o.a.s.h.a.CoreAdminOperation Checking request status for : 1
   [junit4]   2> 651704 INFO  (TEST-StatsReloadRaceTest.testParallelReloadAndStats-seed#[24ED6A41CE572906]) [    ] o.a.s.h.a.CoreAdminOperation Checking request status for : 1
   [junit4]   2> 651704 INFO  (TEST-StatsReloadRaceTest.testParallelReloadAndStats-seed#[24ED6A41CE572906]) [    ] o.a.s.h.a.CoreAdminOperation Checking request status for : 1
   [junit4]   2> 651704 INFO  (TEST-StatsReloadRaceTest.testParallelReloadAndStats-seed#[24ED6A41CE572906]) [    ] o.a.s.h.a.CoreAdminOperation Checking request status for : 1
   [junit4]   2> 651705 INFO  (TEST-StatsReloadRaceTest.testParallelReloadAndStats-seed#[24ED6A41CE572906]) [    ] o.a.s.h.a.CoreAdminOperation Checking request status for : 1
   [junit4]   2> 651705 INFO  (TEST-StatsReloadRaceTest.testParallelReloadAndStats-seed#[24ED6A41CE572906]) [    ] o.a.s.h.a.CoreAdminOperation Checking request status for : 1
   [junit4]   2> 651705 INFO  (TEST-StatsReloadRaceTest.testParallelReloadAndStats-seed#[24ED6A41CE572906]) [    ] o.a.s.h.a.CoreAdminOperation Checking request status for : 1
   [junit4]   2> 651705 INFO  (TEST-StatsReloadRaceTest.testParallelReloadAndStats-seed#[24ED6A41CE572906]) [    ] o.a.s.h.a.CoreAdminOperation Checking request status for : 1
   [junit4]   2> 651705 INFO  (TEST-StatsReloadRaceTest.testParallelReloadAndStats-seed#[24ED6A41CE572906]) [    ] o.a.s.h.a.CoreAdminOperation Checking request status for : 1
   [junit4]   2> 651706 INFO  (TEST-StatsReloadRaceTest.testParallelReloadAndStats-seed#[24ED6A41CE572906]) [    ] o.a.s.h.a.CoreAdminOperation Checking request status for : 1
   [junit4]   2> 651706 INFO  (TEST-StatsReloadRaceTest.testParallelReloadAndStats-seed#[24ED6A41CE572906]) [    ] o.a.s.h.a.CoreAdminOperation Checking request status for : 1
   [junit4]   2> 651706 INFO  (TEST-StatsReloadRaceTest.testParallelReloadAndStats-seed#[24ED6A41CE572906]) [    ] o.a.s.h.a.CoreAdminOperation Checking request status for : 1
   [junit4]   2> 651706 INFO  (TEST-StatsReloadRaceTest.testParallelReloadAndStats-seed#[24ED6A41CE572906]) [    ] o.a.s.h.a.CoreAdminOperation Checking request status for : 1
   [junit4]   2> 651707 INFO  (TEST-StatsReloadRaceTest.testParallelReloadAndStats-seed#[24ED6A41CE572906]) [    ] o.a.s.h.a.CoreAdminOperation Checking request status for : 1
   [junit4]   2> 651707 INFO  (TEST-StatsReloadRaceTest.testParallelReloadAndStats-seed#[24ED6A41CE572906]) [    ] o.a.s.h.a.CoreAdminOperation Checking request status for : 1
   [junit4]   2> 651707 INFO  (TEST-StatsReloadRaceTest.testParallelReloadAndStats-seed#[24ED6A41CE572906]) [    ] o.a.s.h.a.CoreAdminOperation Checking request status for : 1
   [junit4]   2> 651707 INFO  (TEST-StatsReloadRaceTest.testParallelReloadAndStats-seed#[24ED6A41CE572906]) [    ] o.a.s.h.a.CoreAdminOperation Checking request status for : 1
   [junit4]   2> 651707 INFO  (TEST-StatsReloadRaceTest.testParallelReloadAndStats-seed#[24ED6A41CE572906]) [    ] o.a.s.h.a.CoreAdminOperation Checking request status for : 1
   [junit4]   2> 651708 INFO  (TEST-StatsReloadRaceTest.testParallelReloadAndStats-seed#[24ED6A41CE572906]) [    ] o.a.s.h.a.CoreAdminOperation Checking request status for : 1
   [junit4]   2> 651708 INFO  (TEST-StatsReloadRaceTest.testParallelReloadAndStats-seed#[24ED6A41CE572906]) [    ] o.a.s.h.a.CoreAdminOperation Checking request status for : 1
   [junit4]   2> 651708 INFO  (TEST-StatsReloadRaceTest.testParallelReloadAndStats-seed#[24ED6A41CE572906]) [    ] o.a.s.h.a.CoreAdminOperation Checking request status for : 1
   [junit4]   2> 651709 INFO  (TEST-StatsReloadRaceTest.testParallelReloadAndStats-seed#[24ED6A41CE572906]) [    ] o.a.s.h.a.CoreAdminOperation Checking request status for : 1
   [junit4]   2> 651709 INFO  (TEST-StatsReloadRaceTest.testParallelReloadAndStats-seed#[24ED6A41CE572906]) [    ] o.a.s.h.a.CoreAdminOperation Checking request status for : 1
   [junit4]   2> 651709 INFO  (TEST-StatsReloadRaceTest.testParallelReloadAndStats-seed#[24ED6A41CE572906]) [    ] o.a.s.h.a.CoreAdminOperation Checking request status for : 1
   [junit4]   2> 651709 INFO  (TEST-StatsReloadRaceTest.testParallelReloadAndStats-seed#[24ED6A41CE572906]) [    ] o.a.s.h.a.CoreAdminOperation Checking request status for : 1
   [junit4]   2> 651710 INFO  (TEST-StatsReloadRaceTest.testParallelReloadAndStats-seed#[24ED6A41CE572906]) [    ] o.a.s.h.a.CoreAdminOperation Checking request status for : 1
   [junit4]   2> 651710 INFO  (TEST-StatsReloadRaceTest.testParallelReloadAndStats-seed#[24ED6A41CE572906]) [    ] o.a.s.h.a.CoreAdminOperation Checking request status for : 1
   [junit4]   2> 651710 INFO  (TEST-StatsReloadRaceTest.testParallelReloadAndStats-seed#[24ED6A41CE572906]) [    ] o.a.s.h.a.CoreAdminOperation Checking request status for : 1
   [junit4]   2> 651710 INFO  (TEST-StatsReloadRaceTest.testParallelReloadAndStats-seed#[24ED6A41CE572906]) [    ] o.a.s.h.a.CoreAdminOperation Checking request status for : 1
   [junit4]   2> 651711 INFO  (TEST-StatsReloadRaceTest.testParallelReloadAndStats-seed#[24ED6A41CE572906]) [    ] o.a.s.h.a.CoreAdminOperation Checking request status for : 1
   [junit4]   2> 651711 INFO  (TEST-StatsReloadRaceTest.testParallelReloadAndStats-seed#[24ED6A41CE572906]) [    ] o.a.s.h.a.CoreAdminOperation Checking request status for : 1
   [junit4]   2> 651711 INFO  (TEST-StatsReloadRaceTest.testParallelReloadAndStats-seed#[24ED6A41CE572906]) [    ] o.a.s.h.a.CoreAdminOperation Checking request status for : 1
   [junit4]   2> 651712 INFO  (TEST-StatsReloadRaceTest.testParallelReloadAndStats-seed#[24ED6A41CE572906]) [    ] o.a.s.h.a.CoreAdminOperation Checking request status for : 1
   [junit4]   2> 651712 INFO  (TEST-StatsReloadRaceTest.testParallelReloadAndStats-seed#[24ED6A41CE572906]) [    ] o.a.s.h.a.CoreAdminOperation Checking request status for : 1
   [junit4]   2> 651712 INFO  (TEST-StatsReloadRaceTest.testParallelReloadAndStats-seed#[24ED6A41CE572906]) [    ] o.a.s.h.a.CoreAdminOperation Checking request status for : 1
   [junit4]   2> 651713 INFO  (TEST-StatsReloadRaceTest.testParallelReloadAndStats-seed#[24ED6A41CE572906]) [    ] o.a.s.h.a.CoreAdminOperation Checking request status for : 1
   [junit4]   2> 651713 INFO  (TEST-StatsReloadRaceTest.testParallelReloadAndStats-seed#[24ED6A41CE572906]) [    ] o.a.s.h.a.CoreAdminOperation Checking request status for : 1
   [junit4]   2> 651713 INFO  (TEST-StatsReloadRaceTest.testParallelReloadAndStats-seed#[24ED6A41CE572906]) [    ] o.a.s.h.a.CoreAdminOperation Checking request status for : 1
   [junit4]   2> 651714 INFO  (TEST-StatsReloadRaceTest.testParallelReloadAndStats-seed#[24ED6A41CE572906]) [    ] o.a.s.h.a.CoreAdminOperation Checking request status for : 1
   [junit4]   2> 651714 INFO  (TEST-StatsReloadRaceTest.testParallelReloadAndStats-seed#[24ED6A41CE572906]) [    ] o.a.s.h.a.CoreAdminOperation Checking request status for : 1
   [junit4]   2> 651714 INFO  (TEST-StatsReloadRaceTest.testParallelReloadAndStats-seed#[24ED6A41CE572906]) [    ] o.a.s.h.a.CoreAdminOperation Checking request status for : 1
   [junit4]   2> 651714 INFO  (TEST-StatsReloadRaceTest.testParallelReloadAndStats-seed#[24ED6A41CE572906]) [    ] o.a.s.h.a.CoreAdminOperation Checking request status for : 1
   [junit4]   2> 651714 INFO  (TEST-StatsReloadRaceTest.testParallelReloadAndStats-seed#[24ED6A41CE572906]) [    ] o.a.s.h.a.CoreAdminOperation Checking request status for : 1
   [junit4]   2> 651714 INFO  (TEST-StatsReloadRaceTest.testParallelReloadAndStats-seed#[24ED6A41CE572906]) [    ] o.a.s.h.a.CoreAdminOperation Checking request status for : 1
   [junit4]   2> 651715 INFO  (TEST-StatsReloadRaceTest.testParallelReloadAndStats-seed#[24ED6A41CE572906]) [    ] o.a.s.h.a.CoreAdminOperation Checking request status for : 1
   [junit4]   2> 651715 INFO  (TEST-StatsReloadRaceTest.testParallelReloadAndStats-seed#[24ED6A41CE572906]) [    ] o.a.s.h.a.CoreAdminOperation Checking request status for : 1
   [junit4]   2> 651715 INFO  (TEST-StatsReloadRaceTest.testParallelReloadAndStats-seed#[24ED6A41CE572906]) [    ] o.a.s.h.a.CoreAdminOperation Checking request status for : 1
   [junit4]   2> 651715 INFO  (TEST-StatsReloadRaceTest.testParallelReloadAndStats-seed#[24ED6A41CE572906]) [    ] o.a.s.h.a.CoreAdminOperation Checking request status for : 1
   [junit4]   2> 651716 INFO  (TEST-StatsReloadRaceTest.testParallelReloadAndStats-seed#[24ED6A41CE572906]) [    ] o.a.s.h.a.CoreAdminOperation Checking request status for : 1
   [junit4]   2> 651716 INFO  (TEST-StatsReloadRaceTest.testParallelReloadAndStats-seed#[24ED6A41CE572906]) [    ] o.a.s.h.a.CoreAdminOperation Checking request status for : 1
   [junit4]   2> 651716 INFO  (TEST-StatsReloadRaceTest.testParallelReloadAndStats-seed#[24ED6A41CE572906]) [    ] o.a.s.h.a.CoreAdminOperation Checking request status for : 1
   [junit4]   2> 651716 INFO  (TEST-StatsReloadRaceTest.testParallelReloadAndStats-seed#[24ED6A41CE572906]) [    ] o.a.s.h.a.CoreAdminOperation Checking request status for : 1
   [junit4]   2> 651716 INFO  (TEST-StatsReloadRaceTest.testParallelReloadAndStats-seed#[24ED6A41CE572906]) [    ] o.a.s.h.a.CoreAdminOperation Checking request status for : 1
   [junit4]   2> 651717 INFO  (TEST-StatsReloadRaceTest.testParallelReloadAndStats-seed#[24ED6A41CE572906]) [    ] o.a.s.h.a.CoreAdminOperation Checking request status for : 1
   [junit4]   2> 651717 INFO  (TEST-StatsReloadRaceTest.testParallelReloadAndStats-seed#[24ED6A41CE572906]) [    ] o.a.s.h.a.CoreAdminOperation Checking request status for : 1
   [junit4]   2> 651717 INFO  (TEST-StatsReloadRaceTest.testParallelReloadAndStats-seed#[24ED6A41CE572906]) [    ] o.a.s.h.a.CoreAdminOperation Checking request status for : 1
   [junit4]   2> 651717 INFO  (TEST-StatsReloadRaceTest.testParallelReloadAndStats-seed#[24ED6A41CE572906]) [    ] o.a.s.h.a.CoreAdminOperation Checking request status for : 1
   [junit4]   2> 651718 INFO  (TEST-StatsReloadRaceTest.testParallelReloadAndStats-seed#[24ED6A41CE572906]) [    ] o.a.s.h.a.CoreAdminOperation Checking request status for : 1
   [junit4]   2> 651718 INFO  (TEST-StatsReloadRaceTest.testParallelReloadAndStats-seed#[24ED6A41CE572906]) [    ] o.a.s.h.a.CoreAdminOperation Checking request status for : 1
   [junit4]   2> 651718 INFO  (TEST-StatsReloadRaceTest.testParallelReloadAndStats-seed#[24ED6A41CE572906]) [    ] o.a.s.h.a.CoreAdminOperation Checking request status for : 1
   [junit4]   2> 651718 INFO  (TEST-StatsReloadRaceTest.testParallelReloadAndStats-seed#[24ED6A41CE572906]) [    ] o.a.s.h.a.CoreAdminOperation Checking request status for : 1
   [junit4]   2> 651718 INFO  (TEST-StatsReloadRaceTest.testParallelReloadAndStats-seed#[24ED6A41CE572906]) [    ] o.a.s.h.a.CoreAdminOperation Checking request status for : 1
   [junit4]   2> 651719 INFO  (TEST-StatsReloadRaceTest.testParallelReloadAndStats-seed#[24ED6A41CE572906]) [    ] o.a.s.h.a.CoreAdminOperation Checking request status for : 1
   [junit4]   2> 651719 INFO  (TEST-StatsReloadRaceTest.testParallelReloadAndStats-seed#[24ED6A41CE572906]) [    ] o.a.s.h.a.CoreAdminOperation Checking request status for : 1
   [junit4]   2> 651719 INFO  (TEST-StatsReloadRaceTest.testParallelReloadAndStats-seed#[24ED6A41CE572906]) [    ] o.a.s.h.a.CoreAdminOperation Checking request status for : 1
   [junit4]   2> 651719 INFO  (TEST-StatsReloadRaceTest.testParallelReloadAndStats-seed#[24ED6A41CE572906]) [    ] o.a.s.h.a.CoreAdminOperation Checking request status for : 1
   [junit4]   2> 651719 INFO  (TEST-StatsReloadRaceTest.testParallelReloadAndStats-seed#[24ED6A41CE572906]) [    ] o.a.s.h.a.CoreAdminOperation Checking request status for : 1
   [junit4]   2> 651719 INFO  (TEST-StatsReloadRaceTest.testParallelReloadAndStats-seed#[24ED6A41CE572906]) [    ] o.a.s.h.a.CoreAdminOperation Checking request status for : 1
   [junit4]   2> 651720 INFO  (TEST-StatsReloadRaceTest.testParallelReloadAndStats-seed#[24ED6A41CE572906]) [    ] o.a.s.h.a.CoreAdminOperation Checking request status for : 1
   [junit4]   2> 651720 INFO  (TEST-StatsReloadRaceTest.testParallelReloadAndStats-seed#[24ED6A41CE572906]) [    ] o.a.s.h.a.CoreAdminOperation Checking request status for : 1
   [junit4]   2> 651720 INFO  (TEST-StatsReloadRaceTest.testParallelReloadAndStats-seed#[24ED6A41CE572906]) [    ] o.a.s.h.a.CoreAdminOperation Checking request status for : 1
   [junit4]   2> 651720 INFO  (TEST-StatsReloadRaceTest.testParallelReloadAndStats-seed#[24ED6A41CE572906]) [    ] o.a.s.h.a.CoreAdminOperation Checking request status for : 1
   [junit4]   2> 651720 INFO  (TEST-StatsReloadRaceTest.testParallelReloadAndStats-seed#[24ED6A41CE572906]) [    ] o.a.s.h.a.CoreAdminOperation Checking request status for : 1
   [junit4]   2> 651720 INFO  (TEST-StatsReloadRaceTest.testParallelReloadAndStats-seed#[24ED6A41CE572906]) [    ] o.a.s.h.a.CoreAdminOperation Checking request status for : 1
   [junit4]   2> 651721 INFO  (TEST-StatsReloadRaceTest.testParallelReloadAndStats-seed#[24ED6A41CE572906]) [    ] o.a.s.h.a.CoreAdminOperation Checking request status for : 1
   [junit4]   2> 651721 INFO  (TEST-StatsReloadRaceTest.testParallelReloadAndStats-seed#[24ED6A41CE572906]) [    ] o.a.s.h.a.CoreAdminOperation Checking request status for : 1
   [junit4]   2> 651721 INFO  (TEST-StatsReloadRaceTest.testParallelReloadAndStats-seed#[24ED6A41CE572906]) [    ] o.a.s.h.a.CoreAdminOperation Checking request status for : 1
   [junit4]   2> 651721 INFO  (TEST-StatsReloadRaceTest.testParallelReloadAndStats-seed#[24ED6A41CE572906]) [    ] o.a.s.h.a.CoreAdminOperation Checking request status for : 1
   [junit4]   2> 651721 INFO  (TEST-StatsReloadRaceTest.testParallelReloadAndStats-seed#[24ED6A41CE572906]) [    ] o.a.s.h.a.CoreAdminOperation Checking request status for : 1
   [junit4]   2> 651722 INFO  (TEST-StatsReloadRaceTest.testParallelReloadAndStats-seed#[24ED6A41CE572906]) [    ] o.a.s.h.a.CoreAdminOperation Checking request status for : 1
   [junit4]   2> 651722 INFO  (TEST-StatsReloadRaceTest.testParallelReloadAndStats-seed#[24ED6A41CE572906]) [    ] o.a.s.h.a.CoreAdminOperation Checking request status for : 1
   [junit4]   2> 651722 INFO  (TEST-StatsReloadRaceTest.testParallelReloadAndStats-seed#[24ED6A41CE572906]) [    ] o.a.s.h.a.CoreAdminOperation Checking request status for : 1
   [junit4]   2> 651723 INFO  (TEST-StatsReloadRaceTest.testParallelReloadAndStats-seed#[24ED6A41CE572906]) [    ] o.a.s.h.a.CoreAdminOperation Checking request status for : 1
   [junit4]   2> 651723 INFO  (TEST-StatsReloadRaceTest.testParallelReloadAndStats-seed#[24ED6A41CE572906]) [    ] o.a.s.h.a.CoreAdminOperation Checking request status for : 1
   [junit4]   2> 651723 INFO  (TEST-StatsReloadRaceTest.testParallelReloadAndStats-seed#[24ED6A41CE572906]) [    ] o.a.s.h.a.CoreAdminOperation Checking request status for : 1
   [junit4]   2> 651724 INFO  (TEST-StatsReloadRaceTest.testParallelReloadAndStats-seed#[24ED6A41CE572906]) [    ] o.a.s.h.a.CoreAdminOperation Checking request status for : 1
   [junit4]   2> 651724 INFO  (TEST-StatsReloadRaceTest.testParallelReloadAndStats-seed#[24ED6A41CE572906]) [    ] o.a.s.h.a.CoreAdminOperation Checking request status for : 1
   [junit4]   2> 651724 INFO  (TEST-StatsReloadRaceTest.testParallelReloadAndStats-seed#[24ED6A41CE572906]) [    ] o.a.s.h.a.CoreAdminOperation Checking request status for : 1
   [junit4]   2> 651725 INFO  (TEST-StatsReloadRaceTest.testParallelReloadAndStats-seed#[24ED6A41CE572906]) [    ] o.a.s.h.a.CoreAdminOperation Checking request status for : 1
   [junit4]   2> 651725 INFO  (TEST-StatsReloadRaceTest.testParallelReloadAndStats-seed#[24ED6A41CE572906]) [    ] o.a.s.h.a.CoreAdminOperation Checking request status for : 1
   [junit4]   2> 651725 INFO  (TEST-StatsReloadRaceTest.testParallelReloadAndStats-seed#[24ED6A41CE572906]) [    ] o.a.s.h.a.CoreAdminOperation Checking request status for : 1
   [junit4]   2> 651725 INFO  (TEST-StatsReloadRaceTest.testParallelReloadAndStats-seed#[24ED6A41CE572906]) [    ] o.a.s.h.a.CoreAdminOperation Checking request status for : 1
   [junit4]   2> 651725 INFO  (TEST-StatsReloadRaceTest.testParallelReloadAndStats-seed#[24ED6A41CE572906]) [    ] o.a.s.h.a.CoreAdminOperation Checking request status for : 1
   [junit4]   2> 651726 INFO  (TEST-StatsReloadRaceTest.testParallelReloadAndStats-seed#[24ED6A41CE572906]) [    ] o.a.s.h.a.CoreAdminOperation Checking request status for : 1
   [junit4]   2> 651726 INFO  (TEST-StatsReloadRaceTest.testParallelReloadAndStats-seed#[24ED6A41CE572906]) [    ] o.a.s.h.a.CoreAdminOperation Checking request status for : 1
   [junit4]   2> 651726 INFO  (TEST-StatsReloadRaceTest.testParallelReloadAndStats-seed#[24ED6A41CE572906]) [    ] o.a.s.h.a.CoreAdminOperation Checking request status for : 1
   [junit4]   2> 651726 INFO  (TEST-StatsReloadRaceTest.testParallelReloadAndStats-seed#[24ED6A41CE572906]) [    ] o.a.s.h.a.CoreAdminOperation Checking request status for : 1
   [junit4]   2> 651726 INFO  (TEST-StatsReloadRaceTest.testParallelReloadAndStats-seed#[24ED6A41CE572906]) [    ] o.a.s.h.a.CoreAdminOperation Checking request status for : 1
   [junit4]   2> 651726 INFO  (TEST-StatsReloadRaceTest.testParallelReloadAndStats-seed#[24ED6A41CE572906]) [    ] o.a.s.h.a.CoreAdminOperation Checking request status for : 1
   [junit4]   2> 651726 INFO  (TEST-StatsReloadRaceTest.testParallelReloadAndStats-seed#[24ED6A41CE572906]) [    ] o.a.s.h.a.CoreAdminOperation Checking request status for : 1
   [junit4]   2> 651726 INFO  (TEST-StatsReloadRaceTest.testParallelReloadAndStats-seed#[24ED6A41CE572906]) [    ] o.a.s.h.a.CoreAdminOperation Checking request status for : 1
   [junit4]   2> 651727 INFO  (TEST-StatsReloadRaceTest.testParallelReloadAndStats-seed#[24ED6A41CE572906]) [    ] o.a.s.h.a.CoreAdminOperation Checking request status for : 1
   [junit4]   2> 651727 INFO  (TEST-StatsReloadRaceTest.testParallelReloadAndStats-seed#[24ED6A41CE572906]) [    ] o.a.s.h.a.CoreAdminOperation Checking request status for : 1
   [junit4]   2> 651727 INFO  (TEST-StatsReloadRaceTest.testParallelReloadAndStats-seed#[24ED6A41CE572906]) [    ] o.a.s.h.a.CoreAdminOperation Checking request status for : 1
   [junit4]   2> 651727 INFO  (TEST-StatsReloadRaceTest.testParallelReloadAndStats-seed#[24ED6A41CE572906]) [    ] o.a.s.h.a.CoreAdminOperation Checking request status for : 1
   [junit4]   2> 651740 INFO  (TEST-StatsReloadRaceTest.testParallelReloadAndStats-seed#[24ED6A41CE572906]) [    ] o.a.s.h.a.CoreAdminOperation Checking request status for : 1
   [junit4]   2> 651741 INFO  (TEST-StatsReloadRaceTest.testParallelReloadAndStats-seed#[24ED6A41CE572906]) [    ] o.a.s.h.a.CoreAdminOperation Checking request status for : 1
   [junit4]   2> 651741 INFO  (TEST-StatsReloadRaceTest.testParallelReloadAndStats-seed#[24ED6A41CE572906]) [    ] o.a.s.h.a.CoreAdminOperation Checking request status for : 1
   [junit4]   2> 651741 INFO  (TEST-StatsReloadRaceTest.testParallelReloadAndStats-seed#[24ED6A41CE572906]) [    ] o.a.s.h.a.CoreAdminOperation Checking request status for : 1
   [junit4]   2> 651741 INFO  (TEST-StatsReloadRaceTest.testParallelReloadAndStats-seed#[24ED6A41CE572906]) [    ] o.a.s.h.a.CoreAdminOperation Checking request status for : 1
   [junit4]   2> 651741 INFO  (TEST-StatsReloadRaceTest.testParallelReloadAndStats-seed#[24ED6A41CE572906]) [    ] o.a.s.h.a.CoreAdminOperation Checking request status for : 1
   [junit4]   2> 651742 INFO  (TEST-StatsReloadRaceTest.testParallelReloadAndStats-seed#[24ED6A41CE572906]) [    ] o.a.s.h.a.CoreAdminOperation Checking request status for : 1
   [junit4]   2> 651742 INFO  (TEST-StatsReloadRaceTest.testParallelReloadAndStats-seed#[24ED6A41CE572906]) [    ] o.a.s.h.a.CoreAdminOperation Checking request status for : 1
   [junit4]   2> 651742 INFO  (TEST-StatsReloadRaceTest.testParallelReloadAndStats-seed#[24ED6A41CE572906]) [    ] o.a.s.h.a.CoreAdminOperation Checking request status for : 1
   [junit4]   2> 651742 INFO  (TEST-StatsReloadRaceTest.testParallelReloadAndStats-seed#[24ED6A41CE572906]) [    ] o.a.s.h.a.CoreAdminOperation Checking request status for : 1
   [junit4]   2> 651743 INFO  (TEST-StatsReloadRaceTest.testParallelReloadAndStats-seed#[24ED6A41CE572906]) [    ] o.a.s.h.a.CoreAdminOperation Checking request status for : 1
   [junit4]   2> 651743 INFO  (TEST-StatsReloadRaceTest.testParallelReloadAndStats-seed#[24ED6A41CE572906]) [    ] o.a.s.h.a.CoreAdminOperation Checking request status for : 1
   [junit4]   2> 651743 INFO  (TEST-StatsReloadRaceTest.testParallelReloadAndStats-seed#[24ED6A41CE572906]) [    ] o.a.s.h.a.CoreAdminOperation Checking request status for : 1
   [junit4]   2> 651743 INFO  (TEST-StatsReloadRaceTest.testParallelReloadAndStats-seed#[24ED6A41CE572906]) [    ] o.a.s.h.a.CoreAdminOperation Checking request status for : 1
   [junit4]   2> 651743 INFO  (TEST-StatsReloadRaceTest.testParallelReloadAndStats-seed#[24ED6A41CE572906]) [    ] o.a.s.h.a.CoreAdminOperation Checking request status for : 1
   [junit4]   2> 651743 INFO  (TEST-StatsReloadRaceTest.testParallelReloadAndStats-seed#[24ED6A41CE572906]) [    ] o.a.s.h.a.CoreAdminOperation Checking request status for : 1
   [junit4]   2> 651744 INFO  (TEST-StatsReloadRaceTest.testParallelReloadAndStats-seed#[24ED6A41CE572906]) [    ] o.a.s.h.a.CoreAdminOperation Checking request status for : 1
   [junit4]   2> 651744 INFO  (TEST-StatsReloadRaceTest.testParallelReloadAndStats-seed#[24ED6A41CE572906]) [    ] o.a.s.h.a.CoreAdminOperation Checking request status for : 1
   [junit4]   2> 651744 INFO  (TEST-StatsReloadRaceTest.testParallelReloadAndStats-seed#[24ED6A41CE572906]) [    ] o.a.s.h.a.CoreAdminOperation Checking request status for : 1
   [junit4]   2> 651744 INFO  (TEST-StatsReloadRaceTest.testParallelReloadAndStats-seed#[24ED6A41CE572906]) [    ] o.a.s.h.a.CoreAdminOperation Checking request status for : 1
   [junit4]   2> 651744 INFO  (TEST-StatsReloadRaceTest.testParallelReloadAndStats-seed#[24ED6A41CE572906]) [    ] o.a.s.h.a.CoreAdminOperation Checking request status for : 1
   [junit4]   2> 651744 INFO  (TEST-StatsReloadRaceTest.testParallelReloadAndStats-seed#[24ED6A41CE572906]) [    ] o.a.s.h.a.CoreAdminOperation Checking request status for : 1
   [junit4]   2> 651744 INFO  (TEST-StatsReloadRaceTest.testParallelReloadAndStats-seed#[24ED6A41CE572906]) [    ] o.a.s.h.a.CoreAdminOperation Checking request status for : 1
   [junit4]   2> 651745 INFO  (TEST-StatsReloadRaceTest.testParallelReloadAndStats-seed#[24ED6A41CE572906]) [    ] o.a.s.h.a.CoreAdminOperation Checking request status for : 1
   [junit4]   2> 651745 INFO  (TEST-StatsReloadRaceTest.testParallelReloadAndStats-seed#[24ED6A41CE572906]) [    ] o.a.s.h.a.CoreAdminOperation Checking request status for : 1
   [junit4]   2> 651745 INFO  (TEST-StatsReloadRaceTest.testParallelReloadAndStats-seed#[24ED6A41CE572906]) [    ] o.a.s.h.a.CoreAdminOperation Checking request status for : 1
   [junit4]   2> 651745 INFO  (TEST-StatsReloadRaceTest.testParallelReloadAndStats-seed#[24ED6A41CE572906]) [    ] o.a.s.h.a.CoreAdminOperation Checking request status for : 1
   [junit4]   2> 651745 INFO  (TEST-StatsReloadRaceTest.testParallelReloadAndStats-seed#[24ED6A41CE572906]) [    ] o.a.s.h.a.CoreAdminOperation Checking request status for : 1
   [junit4]   2> 651745 INFO  (TEST-StatsReloadRaceTest.testParallelReloadAndStats-seed#[24ED6A41CE572906]) [    ] o.a.s.h.a.CoreAdminOperation Checking request status for : 1
   [junit4]   2> 651746 INFO  (TEST-StatsReloadRaceTest.testParallelReloadAndStats-seed#[24ED6A41CE572906]) [    ] o.a.s.h.a.CoreAdminOperation Checking request status for : 1
   [junit4]   2> 651746 INFO  (TEST-StatsReloadRaceTest.testParallelReloadAndStats-seed#[24ED6A41CE572906]) [    ] o.a.s.h.a.CoreAdminOperation Checking request status for : 1
   [junit4]   2> 651746 INFO  (TEST-StatsReloadRaceTest.testParallelReloadAndStats-seed#[24ED6A41CE572906]) [    ] o.a.s.h.a.CoreAdminOperation Checking request status for : 1
   [junit4]   2> 651746 INFO  (TEST-StatsReloadRaceTest.testParallelReloadAndStats-seed#[24ED6A41CE572906]) [    ] o.a.s.h.a.CoreAdminOperation Checking request status for : 1
   [junit4]   2> 651747 INFO  (TEST-StatsReloadRaceTest.testParallelReloadAndStats-seed#[24ED6A41CE572906]) [    ] o.a.s.h.a.CoreAdminOperation Checking request status for : 1
   [junit4]   2> 651747 WARN  (parallelCoreAdminExecutor-3933-thread-1-processing-1 RELOAD) [    ] o.a.s.s.IndexSchema [collection1] default search field in schema is text. W

[...truncated too long message...]

arallelCoreAdminExecutor-3933-thread-3-processing-3 RELOAD) [    x:collection1] o.a.s.u.RandomMergePolicy RandomMergePolicy wrapping class org.apache.lucene.index.TieredMergePolicy: [TieredMergePolicy: maxMergeAtOnce=38, maxMergeAtOnceExplicit=21, maxMergedSegmentMB=6.751953125, floorSegmentMB=0.990234375, forceMergeDeletesPctAllowed=9.314218663919714, segmentsPerTier=34.0, maxCFSSegmentSizeMB=8.796093022207999E12, noCFSRatio=0.3460760107584909
   [junit4]   2> 652263 INFO  (TEST-StatsReloadRaceTest.testParallelReloadAndStats-seed#[24ED6A41CE572906]) [    ] o.a.s.h.a.CoreAdminOperation Checking request status for : 3
   [junit4]   2> 652264 INFO  (parallelCoreAdminExecutor-3933-thread-3-processing-3 RELOAD) [    x:collection1] o.a.s.u.DefaultSolrCoreState New IndexWriter is ready to be used.
   [junit4]   2> 652264 INFO  (TEST-StatsReloadRaceTest.testParallelReloadAndStats-seed#[24ED6A41CE572906]) [    ] o.a.s.h.a.CoreAdminOperation Checking request status for : 3
   [junit4]   2> 652264 INFO  (TEST-StatsReloadRaceTest.testParallelReloadAndStats-seed#[24ED6A41CE572906]) [    ] o.a.s.h.a.CoreAdminOperation Checking request status for : 3
   [junit4]   2> 652264 INFO  (TEST-StatsReloadRaceTest.testParallelReloadAndStats-seed#[24ED6A41CE572906]) [    ] o.a.s.h.a.CoreAdminOperation Checking request status for : 3
   [junit4]   2> 652264 INFO  (TEST-StatsReloadRaceTest.testParallelReloadAndStats-seed#[24ED6A41CE572906]) [    ] o.a.s.h.a.CoreAdminOperation Checking request status for : 3
   [junit4]   2> 652264 INFO  (TEST-StatsReloadRaceTest.testParallelReloadAndStats-seed#[24ED6A41CE572906]) [    ] o.a.s.h.a.CoreAdminOperation Checking request status for : 3
   [junit4]   2> 652264 INFO  (TEST-StatsReloadRaceTest.testParallelReloadAndStats-seed#[24ED6A41CE572906]) [    ] o.a.s.h.a.CoreAdminOperation Checking request status for : 3
   [junit4]   2> 652265 INFO  (TEST-StatsReloadRaceTest.testParallelReloadAndStats-seed#[24ED6A41CE572906]) [    ] o.a.s.h.a.CoreAdminOperation Checking request status for : 3
   [junit4]   2> 652265 INFO  (TEST-StatsReloadRaceTest.testParallelReloadAndStats-seed#[24ED6A41CE572906]) [    ] o.a.s.h.a.CoreAdminOperation Checking request status for : 3
   [junit4]   2> 652265 INFO  (TEST-StatsReloadRaceTest.testParallelReloadAndStats-seed#[24ED6A41CE572906]) [    ] o.a.s.h.a.CoreAdminOperation Checking request status for : 3
   [junit4]   2> 652265 INFO  (TEST-StatsReloadRaceTest.testParallelReloadAndStats-seed#[24ED6A41CE572906]) [    ] o.a.s.h.a.CoreAdminOperation Checking request status for : 3
   [junit4]   2> 652265 INFO  (searcherExecutor-3948-thread-1-processing-x:collection1 3 RELOAD) [    x:collection1] o.a.s.c.SolrCore [collection1] Registered new searcher Searcher@6789b954[collection1] main{ExitableDirectoryReader(UninvertingDirectoryReader(Uninverting(_0(7.0.0):c32)))}
   [junit4]   2> 652266 INFO  (parallelCoreAdminExecutor-3933-thread-3-processing-3 RELOAD) [    x:collection1] o.a.s.s.SolrIndexSearcher Opening [Searcher@67ad0e09[collection1] main]
   [junit4]   2> 652266 INFO  (parallelCoreAdminExecutor-3933-thread-3-processing-3 RELOAD) [    x:collection1] o.a.s.c.SolrCore [collection1]  CLOSING SolrCore org.apache.solr.core.SolrCore@7ee79d9c
   [junit4]   2> 652266 INFO  (parallelCoreAdminExecutor-3933-thread-3-processing-3 RELOAD) [    x:collection1] o.a.s.m.SolrMetricManager Closing metric reporters for registry=solr.core.collection1, tag=2129108380
   [junit4]   2> 652269 INFO  (searcherExecutor-3948-thread-1-processing-x:collection1 3 RELOAD) [    x:collection1] o.a.s.c.SolrCore [collection1] Registered new searcher Searcher@67ad0e09[collection1] main{ExitableDirectoryReader(UninvertingDirectoryReader(Uninverting(_0(7.0.0):c32)))}
   [junit4]   2> 662271 INFO  (TEST-StatsReloadRaceTest.testParallelReloadAndStats-seed#[24ED6A41CE572906]) [    ] o.a.s.SolrTestCaseJ4 ###Ending testParallelReloadAndStats
   [junit4]   2> NOTE: reproduce with: ant test  -Dtestcase=StatsReloadRaceTest -Dtests.method=testParallelReloadAndStats -Dtests.seed=24ED6A41CE572906 -Dtests.multiplier=3 -Dtests.slow=true -Dtests.locale=id -Dtests.timezone=Asia/Jakarta -Dtests.asserts=true -Dtests.file.encoding=UTF-8
   [junit4] FAILURE 11.0s J0 | StatsReloadRaceTest.testParallelReloadAndStats <<<
   [junit4]    > Throwable #1: java.lang.AssertionError: Key SEARCHER.searcher.indexVersion not found in registry solr.core.collection1
   [junit4]    > 	at __randomizedtesting.SeedInfo.seed([24ED6A41CE572906:EB730F7841A64159]:0)
   [junit4]    > 	at org.apache.solr.handler.admin.StatsReloadRaceTest.requestMetrics(StatsReloadRaceTest.java:132)
   [junit4]    > 	at org.apache.solr.handler.admin.StatsReloadRaceTest.testParallelReloadAndStats(StatsReloadRaceTest.java:70)
   [junit4]    > 	at java.lang.Thread.run(Thread.java:745)
   [junit4]   2> 662273 INFO  (SUITE-StatsReloadRaceTest-seed#[24ED6A41CE572906]-worker) [    ] o.a.s.SolrTestCaseJ4 ###deleteCore
   [junit4]   2> 662273 INFO  (SUITE-StatsReloadRaceTest-seed#[24ED6A41CE572906]-worker) [    ] o.a.s.c.CoreContainer Shutting down CoreContainer instance=2072598483
   [junit4]   2> 662273 INFO  (SUITE-StatsReloadRaceTest-seed#[24ED6A41CE572906]-worker) [    ] o.a.s.m.SolrMetricManager Closing metric reporters for registry=solr.node, tag=null
   [junit4]   2> 662274 INFO  (SUITE-StatsReloadRaceTest-seed#[24ED6A41CE572906]-worker) [    ] o.a.s.m.SolrMetricManager Closing metric reporters for registry=solr.jvm, tag=null
   [junit4]   2> 662274 INFO  (SUITE-StatsReloadRaceTest-seed#[24ED6A41CE572906]-worker) [    ] o.a.s.m.SolrMetricManager Closing metric reporters for registry=solr.jetty, tag=null
   [junit4]   2> 662275 INFO  (SUITE-StatsReloadRaceTest-seed#[24ED6A41CE572906]-worker) [    ] o.a.s.c.TransientSolrCoreCacheDefault Allocating transient cache for 2147483647 transient cores
   [junit4]   2> 662275 INFO  (coreCloseExecutor-3952-thread-1) [    x:collection1] o.a.s.c.SolrCore [collection1]  CLOSING SolrCore org.apache.solr.core.SolrCore@3b1b61af
   [junit4]   2> 662276 INFO  (coreCloseExecutor-3952-thread-1) [    x:collection1] o.a.s.m.SolrMetricManager Closing metric reporters for registry=solr.core.collection1, tag=991650223
   [junit4]   2> NOTE: leaving temporary files on disk at: /home/jenkins/workspace/Lucene-Solr-master-Linux/solr/build/solr-core/test/J0/temp/solr.handler.admin.StatsReloadRaceTest_24ED6A41CE572906-001
   [junit4]   2> NOTE: test params are: codec=Asserting(Lucene70): {name_s=BlockTreeOrds(blocksize=128), range_facet_l_dv=PostingsFormat(name=Memory), multiDefault=FST50, intDefault=PostingsFormat(name=Asserting), id=PostingsFormat(name=Memory), range_facet_i_dv=PostingsFormat(name=Asserting), range_facet_l=PostingsFormat(name=Asserting), timestamp=PostingsFormat(name=Asserting)}, docValues:{range_facet_l_dv=DocValuesFormat(name=Lucene70), _version_=DocValuesFormat(name=Direct), range_facet_i_dv=DocValuesFormat(name=Direct), intDvoDefault=DocValuesFormat(name=Memory), timestamp=DocValuesFormat(name=Direct)}, maxPointsInLeafNode=929, maxMBSortInHeap=5.922785040344341, sim=RandomSimilarity(queryNorm=false): {}, locale=id, timezone=Asia/Jakarta
   [junit4]   2> NOTE: Linux 4.4.0-72-generic amd64/Oracle Corporation 1.8.0_121 (64-bit)/cpus=12,threads=1,free=255100872,total=531628032
   [junit4]   2> NOTE: All tests run in this JVM: [TestSolr4Spatial2, TimeZoneUtilsTest, BadCopyFieldTest, TestCodecSupport, NotRequiredUniqueKeyTest, TestSSLRandomization, RequiredFieldsTest, TestFaceting, ExitableDirectoryReaderTest, TestPseudoReturnFields, TestRandomFlRTGCloud, ConjunctionSolrSpellCheckerTest, TestSha256AuthenticationProvider, TestDownShardTolerantSearch, TestSolrCloudWithHadoopAuthPlugin, TestGraphMLResponseWriter, TestSchemaResource, UtilsToolTest, SolrXmlInZkTest, TestRTimerTree, TestDocTermOrds, TestSolrCloudWithSecureImpersonation, TestSortByMinMaxFunction, TestGraphTermsQParserPlugin, CurrencyFieldOpenExchangeTest, DistributedFacetPivotWhiteBoxTest, SolrJmxReporterTest, TestMultiWordSynonyms, TestStressLiveNodes, DocumentAnalysisRequestHandlerTest, TestStressLucene, SignatureUpdateProcessorFactoryTest, TlogReplayBufferedWhileIndexingTest, TestCryptoKeys, TestSolrXml, SpellPossibilityIteratorTest, ReturnFieldsTest, TestUniqueKeyFieldResource, TestQueryWrapperFilter, DeleteNodeTest, TestCloudSchemaless, RankQueryTest, MetricUtilsTest, RAMDirectoryFactoryTest, TestHighFrequencyDictionaryFactory, TestCustomSort, TestSolrConfigHandlerCloud, PreAnalyzedFieldTest, TestInfoStreamLogging, OverseerRolesTest, TestJsonFacets, FastVectorHighlighterTest, TestDFRSimilarityFactory, TestDistributedSearch, BlobRepositoryCloudTest, TestCollapseQParserPlugin, TestFoldingMultitermQuery, TestInPlaceUpdatesStandalone, HdfsRecoverLeaseTest, LeaderElectionContextKeyTest, DistributedQueryElevationComponentTest, TestFieldCacheWithThreads, ReplaceNodeTest, URLClassifyProcessorTest, FileBasedSpellCheckerTest, SolrCoreTest, CollectionReloadTest, SolrRequestParserTest, HdfsUnloadDistributedZkTest, CursorPagingTest, ConfigureRecoveryStrategyTest, TestFieldTypeCollectionResource, AddSchemaFieldsUpdateProcessorFactoryTest, CloudMLTQParserTest, BasicDistributedZkTest, DateRangeFieldTest, AnalysisAfterCoreReloadTest, CheckHdfsIndexTest, TestValueSourceCache, UUIDFieldTest, UniqFieldsUpdateProcessorFactoryTest, TestSchemaManager, DistributedSpellCheckComponentTest, TestJoin, TestJmxIntegration, PreAnalyzedUpdateProcessorTest, TestChildDocTransformer, TestSubQueryTransformerDistrib, PeerSyncReplicationTest, RequestLoggingTest, DocValuesNotIndexedTest, ResponseLogComponentTest, TestRandomFaceting, XsltUpdateRequestHandlerTest, PolyFieldTest, TestFieldCacheSort, TestLegacyNumericRangeQueryBuilder, DistanceUnitsTest, TestNamedUpdateProcessors, SolrMetricsIntegrationTest, DateMathParserTest, TestBackupRepositoryFactory, JavabinLoaderTest, StatsReloadRaceTest]
   [junit4] Completed [295/702 (1!)] on J0 in 11.53s, 1 test, 1 failure <<< FAILURES!

[...truncated 44646 lines...]


Mime
View raw message