lucene-dev mailing list archives

Site index · List index
Message view « Date » · « Thread »
Top « Date » · « Thread »
From Policeman Jenkins Server <jenk...@thetaphi.de>
Subject [JENKINS] Lucene-Solr-6.x-Windows (32bit/jdk1.8.0_121) - Build # 827 - Unstable!
Date Tue, 04 Apr 2017 06:34:58 GMT
Build: https://jenkins.thetaphi.de/job/Lucene-Solr-6.x-Windows/827/
Java: 32bit/jdk1.8.0_121 -client -XX:+UseConcMarkSweepGC

2 tests failed.
FAILED:  org.apache.solr.util.TestSolrCLIRunExample.testSchemalessExample

Error Message:
Test abandoned because suite timeout was reached.

Stack Trace:
java.lang.Exception: Test abandoned because suite timeout was reached.
	at __randomizedtesting.SeedInfo.seed([CA53DE291ED2AC46]:0)


FAILED:  junit.framework.TestSuite.org.apache.solr.util.TestSolrCLIRunExample

Error Message:
Suite timeout exceeded (>= 7200000 msec).

Stack Trace:
java.lang.Exception: Suite timeout exceeded (>= 7200000 msec).
	at __randomizedtesting.SeedInfo.seed([CA53DE291ED2AC46]:0)




Build Log:
[...truncated 12883 lines...]
   [junit4] Suite: org.apache.solr.util.TestSolrCLIRunExample
   [junit4]   2> Creating dataDir: C:\Users\jenkins\workspace\Lucene-Solr-6.x-Windows\solr\build\solr-core\test\J1\temp\solr.util.TestSolrCLIRunExample_CA53DE291ED2AC46-001\init-core-data-001
   [junit4]   2> 28129 WARN  (SUITE-TestSolrCLIRunExample-seed#[CA53DE291ED2AC46]-worker) [    ] o.a.s.SolrTestCaseJ4 startTrackingSearchers: numOpens=6 numCloses=6
   [junit4]   2> 28130 INFO  (SUITE-TestSolrCLIRunExample-seed#[CA53DE291ED2AC46]-worker) [    ] o.a.s.SolrTestCaseJ4 Using TrieFields
   [junit4]   2> 28143 INFO  (SUITE-TestSolrCLIRunExample-seed#[CA53DE291ED2AC46]-worker) [    ] o.a.s.SolrTestCaseJ4 Randomized ssl (false) and clientAuth (false) via: @org.apache.solr.SolrTestCaseJ4$SuppressSSL(bugUrl=https://issues.apache.org/jira/browse/SOLR-5776)
   [junit4]   2> 28149 INFO  (TEST-TestSolrCLIRunExample.testSchemalessExample-seed#[CA53DE291ED2AC46]) [    ] o.a.s.SolrTestCaseJ4 ###Starting testSchemalessExample
   [junit4]   2> 28151 INFO  (TEST-TestSolrCLIRunExample.testSchemalessExample-seed#[CA53DE291ED2AC46]) [    ] o.a.s.u.TestSolrCLIRunExample Selected port 50974 to start schemaless example Solr instance on ...
   [junit4]   2> 29350 INFO  (Thread-34) [    ] o.e.j.s.Server jetty-9.3.14.v20161028
   [junit4]   2> 29353 INFO  (Thread-34) [    ] o.e.j.s.h.ContextHandler Started o.e.j.s.ServletContextHandler@1cd1cc0{/solr,null,AVAILABLE}
   [junit4]   2> 29356 INFO  (Thread-34) [    ] o.e.j.s.AbstractConnector Started ServerConnector@17534ae{HTTP/1.1,[http/1.1]}{127.0.0.1:50974}
   [junit4]   2> 29356 INFO  (Thread-34) [    ] o.e.j.s.Server Started @34104ms
   [junit4]   2> 29356 INFO  (Thread-34) [    ] o.a.s.c.s.e.JettySolrRunner Jetty properties: {hostContext=/solr, hostPort=50974}
   [junit4]   2> 29356 ERROR (Thread-34) [    ] o.a.s.s.StartupLoggingUtils Missing Java Option solr.log.dir. Logging may be missing or incomplete.
   [junit4]   2> 29357 INFO  (Thread-34) [    ] o.a.s.s.SolrDispatchFilter  ___      _       Welcome to Apache Solr™ version 6.6.0
   [junit4]   2> 29357 INFO  (Thread-34) [    ] o.a.s.s.SolrDispatchFilter / __| ___| |_ _   Starting in standalone mode on port 50974
   [junit4]   2> 29357 INFO  (Thread-34) [    ] o.a.s.s.SolrDispatchFilter \__ \/ _ \ | '_|  Install dir: null
   [junit4]   2> 29357 INFO  (Thread-34) [    ] o.a.s.s.SolrDispatchFilter |___/\___/_|_|    Start time: 2017-04-04T03:46:10.617Z
   [junit4]   2> 29358 INFO  (Thread-34) [    ] o.a.s.c.SolrXmlConfig Loading container configuration from C:\Users\jenkins\workspace\Lucene-Solr-6.x-Windows\solr\build\solr-core\test\J1\temp\solr.util.TestSolrCLIRunExample_CA53DE291ED2AC46-001\tempDir-001\schemaless\solr\solr.xml
   [junit4]   2> 29386 INFO  (Thread-34) [    ] o.a.s.u.UpdateShardHandler Creating UpdateShardHandler HTTP client with params: socketTimeout=600000&connTimeout=60000&retry=true
   [junit4]   2> 29518 INFO  (Thread-34) [    ] o.a.s.c.CorePropertiesLocator Found 0 core definitions underneath C:\Users\jenkins\workspace\Lucene-Solr-6.x-Windows\solr\build\solr-core\test\J1\temp\solr.util.TestSolrCLIRunExample_CA53DE291ED2AC46-001\tempDir-001\schemaless\solr
   [junit4]   2> huhtikuuta 04, 2017 5:46:09 AP. com.carrotsearch.randomizedtesting.ThreadLeakControl$2 evaluate
   [junit4]   2> WARNING: Suite execution timed out: org.apache.solr.util.TestSolrCLIRunExample
   [junit4]   2> ==== jstack at approximately timeout time ====
   [junit4]   2> "Thread-43" ID=175 WAITING on java.lang.Object@1df0a43
   [junit4]   2> 	at java.lang.Object.wait(Native Method)
   [junit4]   2> 	- waiting on java.lang.Object@1df0a43
   [junit4]   2> 	at java.lang.Object.wait(Object.java:502)
   [junit4]   2> 	at org.apache.solr.core.CloserThread.run(CoreContainer.java:1471)
   [junit4]   2> 
   [junit4]   2> "solr-idle-connections-evictor" ID=174 TIMED_WAITING
   [junit4]   2> 	at java.lang.Thread.sleep(Native Method)
   [junit4]   2> 	at org.apache.solr.update.UpdateShardHandler$IdleConnectionsEvictor$1.run(UpdateShardHandler.java:258)
   [junit4]   2> 	at java.lang.Thread.run(Thread.java:745)
   [junit4]   2> 
   [junit4]   2> "solr-idle-connections-evictor" ID=173 TIMED_WAITING
   [junit4]   2> 	at java.lang.Thread.sleep(Native Method)
   [junit4]   2> 	at org.apache.solr.update.UpdateShardHandler$IdleConnectionsEvictor$1.run(UpdateShardHandler.java:258)
   [junit4]   2> 	at java.lang.Thread.run(Thread.java:745)
   [junit4]   2> 
   [junit4]   2> "org.eclipse.jetty.server.session.HashSessionManager@9742bdTimer" ID=172 TIMED_WAITING on java.util.concurrent.locks.AbstractQueuedSynchronizer$ConditionObject@157d19a
   [junit4]   2> 	at sun.misc.Unsafe.park(Native Method)
   [junit4]   2> 	- timed waiting on java.util.concurrent.locks.AbstractQueuedSynchronizer$ConditionObject@157d19a
   [junit4]   2> 	at java.util.concurrent.locks.LockSupport.parkNanos(LockSupport.java:215)
   [junit4]   2> 	at java.util.concurrent.locks.AbstractQueuedSynchronizer$ConditionObject.awaitNanos(AbstractQueuedSynchronizer.java:2078)
   [junit4]   2> 	at java.util.concurrent.ScheduledThreadPoolExecutor$DelayedWorkQueue.take(ScheduledThreadPoolExecutor.java:1093)
   [junit4]   2> 	at java.util.concurrent.ScheduledThreadPoolExecutor$DelayedWorkQueue.take(ScheduledThreadPoolExecutor.java:809)
   [junit4]   2> 	at java.util.concurrent.ThreadPoolExecutor.getTask(ThreadPoolExecutor.java:1067)
   [junit4]   2> 	at java.util.concurrent.ThreadPoolExecutor.runWorker(ThreadPoolExecutor.java:1127)
   [junit4]   2> 	at java.util.concurrent.ThreadPoolExecutor$Worker.run(ThreadPoolExecutor.java:617)
   [junit4]   2> 	at java.lang.Thread.run(Thread.java:745)
   [junit4]   2> 
   [junit4]   2> "Scheduler-8612730" ID=171 TIMED_WAITING on java.util.concurrent.locks.AbstractQueuedSynchronizer$ConditionObject@1f33eca
   [junit4]   2> 	at sun.misc.Unsafe.park(Native Method)
   [junit4]   2> 	- timed waiting on java.util.concurrent.locks.AbstractQueuedSynchronizer$ConditionObject@1f33eca
   [junit4]   2> 	at java.util.concurrent.locks.LockSupport.parkNanos(LockSupport.java:215)
   [junit4]   2> 	at java.util.concurrent.locks.AbstractQueuedSynchronizer$ConditionObject.awaitNanos(AbstractQueuedSynchronizer.java:2078)
   [junit4]   2> 	at java.util.concurrent.ScheduledThreadPoolExecutor$DelayedWorkQueue.take(ScheduledThreadPoolExecutor.java:1093)
   [junit4]   2> 	at java.util.concurrent.ScheduledThreadPoolExecutor$DelayedWorkQueue.take(ScheduledThreadPoolExecutor.java:809)
   [junit4]   2> 	at java.util.concurrent.ThreadPoolExecutor.getTask(ThreadPoolExecutor.java:1067)
   [junit4]   2> 	at java.util.concurrent.ThreadPoolExecutor.runWorker(ThreadPoolExecutor.java:1127)
   [junit4]   2> 	at java.util.concurrent.ThreadPoolExecutor$Worker.run(ThreadPoolExecutor.java:617)
   [junit4]   2> 	at java.lang.Thread.run(Thread.java:745)
   [junit4]   2> 
   [junit4]   2> "qtp20868346-170" ID=170 TIMED_WAITING on java.util.concurrent.locks.AbstractQueuedSynchronizer$ConditionObject@be44ff
   [junit4]   2> 	at sun.misc.Unsafe.park(Native Method)
   [junit4]   2> 	- timed waiting on java.util.concurrent.locks.AbstractQueuedSynchronizer$ConditionObject@be44ff
   [junit4]   2> 	at java.util.concurrent.locks.LockSupport.parkNanos(LockSupport.java:215)
   [junit4]   2> 	at java.util.concurrent.locks.AbstractQueuedSynchronizer$ConditionObject.awaitNanos(AbstractQueuedSynchronizer.java:2078)
   [junit4]   2> 	at org.eclipse.jetty.util.BlockingArrayQueue.poll(BlockingArrayQueue.java:392)
   [junit4]   2> 	at org.eclipse.jetty.util.thread.QueuedThreadPool.idleJobPoll(QueuedThreadPool.java:563)
   [junit4]   2> 	at org.eclipse.jetty.util.thread.QueuedThreadPool.access$800(QueuedThreadPool.java:48)
   [junit4]   2> 	at org.eclipse.jetty.util.thread.QueuedThreadPool$2.run(QueuedThreadPool.java:626)
   [junit4]   2> 	at java.lang.Thread.run(Thread.java:745)
   [junit4]   2> 
   [junit4]   2> "qtp20868346-169" ID=169 TIMED_WAITING on java.util.concurrent.locks.AbstractQueuedSynchronizer$ConditionObject@be44ff
   [junit4]   2> 	at sun.misc.Unsafe.park(Native Method)
   [junit4]   2> 	- timed waiting on java.util.concurrent.locks.AbstractQueuedSynchronizer$ConditionObject@be44ff
   [junit4]   2> 	at java.util.concurrent.locks.LockSupport.parkNanos(LockSupport.java:215)
   [junit4]   2> 	at java.util.concurrent.locks.AbstractQueuedSynchronizer$ConditionObject.awaitNanos(AbstractQueuedSynchronizer.java:2078)
   [junit4]   2> 	at org.eclipse.jetty.util.BlockingArrayQueue.poll(BlockingArrayQueue.java:392)
   [junit4]   2> 	at org.eclipse.jetty.util.thread.QueuedThreadPool.idleJobPoll(QueuedThreadPool.java:563)
   [junit4]   2> 	at org.eclipse.jetty.util.thread.QueuedThreadPool.access$800(QueuedThreadPool.java:48)
   [junit4]   2> 	at org.eclipse.jetty.util.thread.QueuedThreadPool$2.run(QueuedThreadPool.java:626)
   [junit4]   2> 	at java.lang.Thread.run(Thread.java:745)
   [junit4]   2> 
   [junit4]   2> "qtp20868346-168" ID=168 TIMED_WAITING on java.util.concurrent.locks.AbstractQueuedSynchronizer$ConditionObject@be44ff
   [junit4]   2> 	at sun.misc.Unsafe.park(Native Method)
   [junit4]   2> 	- timed waiting on java.util.concurrent.locks.AbstractQueuedSynchronizer$ConditionObject@be44ff
   [junit4]   2> 	at java.util.concurrent.locks.LockSupport.parkNanos(LockSupport.java:215)
   [junit4]   2> 	at java.util.concurrent.locks.AbstractQueuedSynchronizer$ConditionObject.awaitNanos(AbstractQueuedSynchronizer.java:2078)
   [junit4]   2> 	at org.eclipse.jetty.util.BlockingArrayQueue.poll(BlockingArrayQueue.java:392)
   [junit4]   2> 	at org.eclipse.jetty.util.thread.QueuedThreadPool.idleJobPoll(QueuedThreadPool.java:563)
   [junit4]   2> 	at org.eclipse.jetty.util.thread.QueuedThreadPool.access$800(QueuedThreadPool.java:48)
   [junit4]   2> 	at org.eclipse.jetty.util.thread.QueuedThreadPool$2.run(QueuedThreadPool.java:626)
   [junit4]   2> 	at java.lang.Thread.run(Thread.java:745)
   [junit4]   2> 
   [junit4]   2> "qtp20868346-167" ID=167 TIMED_WAITING on java.util.concurrent.locks.AbstractQueuedSynchronizer$ConditionObject@be44ff
   [junit4]   2> 	at sun.misc.Unsafe.park(Native Method)
   [junit4]   2> 	- timed waiting on java.util.concurrent.locks.AbstractQueuedSynchronizer$ConditionObject@be44ff
   [junit4]   2> 	at java.util.concurrent.locks.LockSupport.parkNanos(LockSupport.java:215)
   [junit4]   2> 	at java.util.concurrent.locks.AbstractQueuedSynchronizer$ConditionObject.awaitNanos(AbstractQueuedSynchronizer.java:2078)
   [junit4]   2> 	at org.eclipse.jetty.util.BlockingArrayQueue.poll(BlockingArrayQueue.java:392)
   [junit4]   2> 	at org.eclipse.jetty.util.thread.QueuedThreadPool.idleJobPoll(QueuedThreadPool.java:563)
   [junit4]   2> 	at org.eclipse.jetty.util.thread.QueuedThreadPool.access$800(QueuedThreadPool.java:48)
   [junit4]   2> 	at org.eclipse.jetty.util.thread.QueuedThreadPool$2.run(QueuedThreadPool.java:626)
   [junit4]   2> 	at java.lang.Thread.run(Thread.java:745)
   [junit4]   2> 
   [junit4]   2> "qtp20868346-166" ID=166 TIMED_WAITING on java.util.concurrent.locks.AbstractQueuedSynchronizer$ConditionObject@be44ff
   [junit4]   2> 	at sun.misc.Unsafe.park(Native Method)
   [junit4]   2> 	- timed waiting on java.util.concurrent.locks.AbstractQueuedSynchronizer$ConditionObject@be44ff
   [junit4]   2> 	at java.util.concurrent.locks.LockSupport.parkNanos(LockSupport.java:215)
   [junit4]   2> 	at java.util.concurrent.locks.AbstractQueuedSynchronizer$ConditionObject.awaitNanos(AbstractQueuedSynchronizer.java:2078)
   [junit4]   2> 	at org.eclipse.jetty.util.BlockingArrayQueue.poll(BlockingArrayQueue.java:392)
   [junit4]   2> 	at org.eclipse.jetty.util.thread.QueuedThreadPool.idleJobPoll(QueuedThreadPool.java:563)
   [junit4]   2> 	at org.eclipse.jetty.util.thread.QueuedThreadPool.access$800(QueuedThreadPool.java:48)
   [junit4]   2> 	at org.eclipse.jetty.util.thread.QueuedThreadPool$2.run(QueuedThreadPool.java:626)
   [junit4]   2> 	at java.lang.Thread.run(Thread.java:745)
   [junit4]   2> 
   [junit4]   2> "qtp20868346-165" ID=165 TIMED_WAITING on java.util.concurrent.locks.AbstractQueuedSynchronizer$ConditionObject@be44ff
   [junit4]   2> 	at sun.misc.Unsafe.park(Native Method)
   [junit4]   2> 	- timed waiting on java.util.concurrent.locks.AbstractQueuedSynchronizer$ConditionObject@be44ff
   [junit4]   2> 	at java.util.concurrent.locks.LockSupport.parkNanos(LockSupport.java:215)
   [junit4]   2> 	at java.util.concurrent.locks.AbstractQueuedSynchronizer$ConditionObject.awaitNanos(AbstractQueuedSynchronizer.java:2078)
   [junit4]   2> 	at org.eclipse.jetty.util.BlockingArrayQueue.poll(BlockingArrayQueue.java:392)
   [junit4]   2> 	at org.eclipse.jetty.util.thread.QueuedThreadPool.idleJobPoll(QueuedThreadPool.java:563)
   [junit4]   2> 	at org.eclipse.jetty.util.thread.QueuedThreadPool.access$800(QueuedThreadPool.java:48)
   [junit4]   2> 	at org.eclipse.jetty.util.thread.QueuedThreadPool$2.run(QueuedThreadPool.java:626)
   [junit4]   2> 	at java.lang.Thread.run(Thread.java:745)
   [junit4]   2> 
   [junit4]   2> "qtp20868346-164-acceptor-0@fc29a0-ServerConnector@17534ae{HTTP/1.1,[http/1.1]}{127.0.0.1:50974}" ID=164 RUNNABLE (in native code)
   [junit4]   2> 	at sun.nio.ch.ServerSocketChannelImpl.accept0(Native Method)
   [junit4]   2> 	at sun.nio.ch.ServerSocketChannelImpl.accept(ServerSocketChannelImpl.java:422)
   [junit4]   2> 	at sun.nio.ch.ServerSocketChannelImpl.accept(ServerSocketChannelImpl.java:250)
   [junit4]   2> 	- locked java.lang.Object@15ed639
   [junit4]   2> 	at org.eclipse.jetty.server.ServerConnector.accept(ServerConnector.java:373)
   [junit4]   2> 	at org.eclipse.jetty.server.AbstractConnector$Acceptor.run(AbstractConnector.java:601)
   [junit4]   2> 	at org.eclipse.jetty.util.thread.QueuedThreadPool.runJob(QueuedThreadPool.java:671)
   [junit4]   2> 	at org.eclipse.jetty.util.thread.QueuedThreadPool$2.run(QueuedThreadPool.java:589)
   [junit4]   2> 	at java.lang.Thread.run(Thread.java:745)
   [junit4]   2> 
   [junit4]   2> "qtp20868346-163" ID=163 RUNNABLE (in native code)
   [junit4]   2> 	at sun.nio.ch.WindowsSelectorImpl$SubSelector.poll0(Native Method)
   [junit4]   2> 	at sun.nio.ch.WindowsSelectorImpl$SubSelector.poll(WindowsSelectorImpl.java:296)
   [junit4]   2> 	at sun.nio.ch.WindowsSelectorImpl$SubSelector.access$400(WindowsSelectorImpl.java:278)
   [junit4]   2> 	at sun.nio.ch.WindowsSelectorImpl.doSelect(WindowsSelectorImpl.java:159)
   [junit4]   2> 	at sun.nio.ch.SelectorImpl.lockAndDoSelect(SelectorImpl.java:86)
   [junit4]   2> 	- locked sun.nio.ch.Util$3@60c89
   [junit4]   2> 	- locked java.util.Collections$UnmodifiableSet@f7776d
   [junit4]   2> 	- locked sun.nio.ch.WindowsSelectorImpl@f05cf0
   [junit4]   2> 	at sun.nio.ch.SelectorImpl.select(SelectorImpl.java:97)
   [junit4]   2> 	at sun.nio.ch.SelectorImpl.select(SelectorImpl.java:101)
   [junit4]   2> 	at org.eclipse.jetty.io.ManagedSelector$SelectorProducer.select(ManagedSelector.java:243)
   [junit4]   2> 	at org.eclipse.jetty.io.ManagedSelector$SelectorProducer.produce(ManagedSelector.java:191)
   [junit4]   2> 	at org.eclipse.jetty.util.thread.strategy.ExecuteProduceConsume.executeProduceConsume(ExecuteProduceConsume.java:249)
   [junit4]   2> 	at org.eclipse.jetty.util.thread.strategy.ExecuteProduceConsume.produceConsume(ExecuteProduceConsume.java:148)
   [junit4]   2> 	at org.eclipse.jetty.util.thread.strategy.ExecuteProduceConsume.execute(ExecuteProduceConsume.java:100)
   [junit4]   2> 	at org.eclipse.jetty.io.ManagedSelector.run(ManagedSelector.java:147)
   [junit4]   2> 	at org.eclipse.jetty.util.thread.QueuedThreadPool.runJob(QueuedThreadPool.java:671)
   [junit4]   2> 	at org.eclipse.jetty.util.thread.QueuedThreadPool$2.run(QueuedThreadPool.java:589)
   [junit4]   2> 	at java.lang.Thread.run(Thread.java:745)
   [junit4]   2> 
   [junit4]   2> "TEST-TestSolrCLIRunExample.testSchemalessExample-seed#[CA53DE291ED2AC46]" ID=161 TIMED_WAITING
   [junit4]   2> 	at java.lang.Thread.sleep(Native Method)
   [junit4]   2> 	at org.apache.commons.exec.DefaultExecuteResultHandler.waitFor(DefaultExecuteResultHandler.java:121)
   [junit4]   2> 	at org.apache.solr.util.SolrCLI$RunExampleTool.startSolr(SolrCLI.java:2938)
   [junit4]   2> 	at org.apache.solr.util.SolrCLI$RunExampleTool.runExample(SolrCLI.java:2650)
   [junit4]   2> 	at org.apache.solr.util.SolrCLI$RunExampleTool.runImpl(SolrCLI.java:2616)
   [junit4]   2> 	at org.apache.solr.util.SolrCLI$ToolBase.runTool(SolrCLI.java:154)
   [junit4]   2> 	at org.apache.solr.util.TestSolrCLIRunExample.testExample(TestSolrCLIRunExample.java:336)
   [junit4]   2> 	at org.apache.solr.util.TestSolrCLIRunExample.testSchemalessExample(TestSolrCLIRunExample.java:300)
   [junit4]   2> 	at sun.reflect.NativeMethodAccessorImpl.invoke0(Native Method)
   [junit4]   2> 	at sun.reflect.NativeMethodAccessorImpl.invoke(NativeMethodAccessorImpl.java:62)
   [junit4]   2> 	at sun.reflect.DelegatingMethodAccessorImpl.invoke(DelegatingMethodAccessorImpl.java:43)
   [junit4]   2> 	at java.lang.reflect.Method.invoke(Method.java:498)
   [junit4]   2> 	at com.carrotsearch.randomizedtesting.RandomizedRunner.invoke(RandomizedRunner.java:1713)
   [junit4]   2> 	at com.carrotsearch.randomizedtesting.RandomizedRunner$8.evaluate(RandomizedRunner.java:907)
   [junit4]   2> 	at com.carrotsearch.randomizedtesting.RandomizedRunner$9.evaluate(RandomizedRunner.java:943)
   [junit4]   2> 	at com.carrotsearch.randomizedtesting.RandomizedRunner$10.evaluate(RandomizedRunner.java:957)
   [junit4]   2> 	at com.carrotsearch.randomizedtesting.rules.SystemPropertiesRestoreRule$1.evaluate(SystemPropertiesRestoreRule.java:57)
   [junit4]   2> 	at org.apache.lucene.util.TestRuleSetupTeardownChained$1.evaluate(TestRuleSetupTeardownChained.java:49)
   [junit4]   2> 	at org.apache.lucene.util.AbstractBeforeAfterRule$1.evaluate(AbstractBeforeAfterRule.java:45)
   [junit4]   2> 	at org.apache.lucene.util.TestRuleThreadAndTestName$1.evaluate(TestRuleThreadAndTestName.java:48)
   [junit4]   2> 	at org.apache.lucene.util.TestRuleIgnoreAfterMaxFailures$1.evaluate(TestRuleIgnoreAfterMaxFailures.java:64)
   [junit4]   2> 	at org.apache.lucene.util.TestRuleMarkFailure$1.evaluate(TestRuleMarkFailure.java:47)
   [junit4]   2> 	at com.carrotsearch.randomizedtesting.rules.StatementAdapter.evaluate(StatementAdapter.java:36)
   [junit4]   2> 	at com.carrotsearch.randomizedtesting.ThreadLeakControl$StatementRunner.run(ThreadLeakControl.java:368)
   [junit4]   2> 	at com.carrotsearch.randomizedtesting.ThreadLeakControl.forkTimeoutingTask(ThreadLeakControl.java:817)
   [junit4]   2> 	at com.carrotsearch.randomizedtesting.ThreadLeakControl$3.evaluate(ThreadLeakControl.java:468)
   [junit4]   2> 	at com.carrotsearch.randomizedtesting.RandomizedRunner.runSingleTest(RandomizedRunner.java:916)
   [junit4]   2> 	at com.carrotsearch.randomizedtesting.RandomizedRunner$5.evaluate(RandomizedRunner.java:802)
   [junit4]   2> 	at com.carrotsearch.randomizedtesting.RandomizedRunner$6.evaluate(RandomizedRunner.java:852)
   [junit4]   2> 	at com.carrotsearch.randomizedtesting.RandomizedRunner$7.evaluate(RandomizedRunner.java:863)
   [junit4]   2> 	at com.carrotsearch.randomizedtesting.rules.StatementAdapter.evaluate(StatementAdapter.java:36)
   [junit4]   2> 	at com.carrotsearch.randomizedtesting.rules.SystemPropertiesRestoreRule$1.evaluate(SystemPropertiesRestoreRule.java:57)
   [junit4]   2> 	at org.apache.lucene.util.AbstractBeforeAfterRule$1.evaluate(AbstractBeforeAfterRule.java:45)
   [junit4]   2> 	at com.carrotsearch.randomizedtesting.rules.StatementAdapter.evaluate(StatementAdapter.java:36)
   [junit4]   2> 	at org.apache.lucene.util.TestRuleStoreClassName$1.evaluate(TestRuleStoreClassName.java:41)
   [junit4]   2> 	at com.carrotsearch.randomizedtesting.rules.NoShadowingOrOverridesOnMethodsRule$1.evaluate(NoShadowingOrOverridesOnMethodsRule.java:40)
   [junit4]   2> 	at com.carrotsearch.randomizedtesting.rules.NoShadowingOrOverridesOnMethodsRule$1.evaluate(NoShadowingOrOverridesOnMethodsRule.java:40)
   [junit4]   2> 	at com.carrotsearch.randomizedtesting.rules.StatementAdapter.evaluate(StatementAdapter.java:36)
   [junit4]   2> 	at com.carrotsearch.randomizedtesting.rules.StatementAdapter.evaluate(StatementAdapter.java:36)
   [junit4]   2> 	at com.carrotsearch.randomizedtesting.rules.StatementAdapter.evaluate(StatementAdapter.java:36)
   [junit4]   2> 	at org.apache.lucene.util.TestRuleAssertionsRequired$1.evaluate(TestRuleAssertionsRequired.java:53)
   [junit4]   2> 	at org.apache.lucene.util.TestRuleMarkFailure$1.evaluate(TestRuleMarkFailure.java:47)
   [junit4]   2> 	at org.apache.lucene.util.TestRuleIgnoreAfterMaxFailures$1.evaluate(TestRuleIgnoreAfterMaxFailures.java:64)
   [junit4]   2> 	at org.apache.lucene.util.TestRuleIgnoreTestSuites$1.evaluate(TestRuleIgnoreTestSuites.java:54)
   [junit4]   2> 	at com.carrotsearch.randomizedtesting.rules.StatementAdapter.evaluate(StatementAdapter.java:36)
   [junit4]   2> 	at com.carrotsearch.randomizedtesting.ThreadLeakControl$StatementRunner.run(ThreadLeakControl.java:368)
   [junit4]   2> 	at java.lang.Thread.run(Thread.java:745)
   [junit4]   2> 
   [junit4]   2> "SUITE-TestSolrCLIRunExample-seed#[CA53DE291ED2AC46]" ID=160 RUNNABLE
   [junit4]   2> 	at sun.management.ThreadImpl.dumpThreads0(Native Method)
   [junit4]   2> 	at sun.management.ThreadImpl.dumpAllThreads(ThreadImpl.java:454)
   [junit4]   2> 	at com.carrotsearch.randomizedtesting.ThreadLeakControl.formatThreadStacksFull(ThreadLeakControl.java:681)
   [junit4]   2> 	at com.carrotsearch.randomizedtesting.ThreadLeakControl.access$1000(ThreadLeakControl.java:65)
   [junit4]   2> 	at com.carrotsearch.randomizedtesting.ThreadLeakControl$2.evaluate(ThreadLeakControl.java:415)
   [junit4]   2> 	- locked java.lang.Object@1e8b0c9
   [junit4]   2> 	at com.carrotsearch.randomizedtesting.RandomizedRunner.runSuite(RandomizedRunner.java:678)
   [junit4]   2> 	at com.carrotsearch.randomizedtesting.RandomizedRunner.access$200(RandomizedRunner.java:140)
   [junit4]   2> 	at com.carrotsearch.randomizedtesting.RandomizedRunner$2.run(RandomizedRunner.java:598)
   [junit4]   2> 
   [junit4]   2> "JUnit4-serializer-daemon" ID=9 TIMED_WAITING
   [junit4]   2> 	at java.lang.Thread.sleep(Native Method)
   [junit4]   2> 	at com.carrotsearch.ant.tasks.junit4.events.Serializer$1.run(Serializer.java:50)
   [junit4]   2> 
   [junit4]   2> "Attach Listener" ID=6 RUNNABLE
   [junit4]   2> 
   [junit4]   2> "Signal Dispatcher" ID=5 RUNNABLE
   [junit4]   2> 
   [junit4]   2> "Finalizer" ID=3 WAITING on java.lang.ref.ReferenceQueue$Lock@13895f9
   [junit4]   2> 	at java.lang.Object.wait(Native Method)
   [junit4]   2> 	- waiting on java.lang.ref.ReferenceQueue$Lock@13895f9
   [junit4]   2> 	at java.lang.ref.ReferenceQueue.remove(ReferenceQueue.java:143)
   [junit4]   2> 	at java.lang.ref.ReferenceQueue.remove(ReferenceQueue.java:164)
   [junit4]   2> 	at java.lang.ref.Finalizer$FinalizerThread.run(Finalizer.java:209)
   [junit4]   2> 
   [junit4]   2> "Reference Handler" ID=2 WAITING on java.lang.ref.Reference$Lock@b9d32c
   [junit4]   2> 	at java.lang.Object.wait(Native Method)
   [junit4]   2> 	- waiting on java.lang.ref.Reference$Lock@b9d32c
   [junit4]   2> 	at java.lang.Object.wait(Object.java:502)
   [junit4]   2> 	at java.lang.ref.Reference.tryHandlePending(Reference.java:191)
   [junit4]   2> 	at java.lang.ref.Reference$ReferenceHandler.run(Reference.java:153)
   [junit4]   2> 
   [junit4]   2> "main" ID=1 WAITING on com.carrotsearch.randomizedtesting.RandomizedRunner$2@1acb18b
   [junit4]   2> 	at java.lang.Object.wait(Native Method)
   [junit4]   2> 	- waiting on com.carrotsearch.randomizedtesting.RandomizedRunner$2@1acb18b
   [junit4]   2> 	at java.lang.Thread.join(Thread.java:1249)
   [junit4]   2> 	at java.lang.Thread.join(Thread.java:1323)
   [junit4]   2> 	at com.carrotsearch.randomizedtesting.RandomizedRunner.runSuite(RandomizedRunner.java:608)
   [junit4]   2> 	at com.carrotsearch.randomizedtesting.RandomizedRunner.run(RandomizedRunner.java:457)
   [junit4]   2> 	at com.carrotsearch.ant.tasks.junit4.slave.SlaveMain.execute(SlaveMain.java:244)
   [junit4]   2> 	at com.carrotsearch.ant.tasks.junit4.slave.SlaveMain.main(SlaveMain.java:355)
   [junit4]   2> 	at com.carrotsearch.ant.tasks.junit4.slave.SlaveMainSafe.main(SlaveMainSafe.java:13)
   [junit4]   2> 
   [junit4]   2> ^^==============================================
   [junit4]   2> 
   [junit4]   2> NOTE: reproduce with: ant test  -Dtestcase=TestSolrCLIRunExample -Dtests.method=testSchemalessExample -Dtests.seed=CA53DE291ED2AC46 -Dtests.slow=true -Dtests.locale=fi -Dtests.timezone=Africa/Conakry -Dtests.asserts=true -Dtests.file.encoding=UTF-8
   [junit4] ERROR   7200s J1 | TestSolrCLIRunExample.testSchemalessExample <<<
   [junit4]    > Throwable #1: java.lang.Exception: Test abandoned because suite timeout was reached.
   [junit4]    > 	at __randomizedtesting.SeedInfo.seed([CA53DE291ED2AC46]:0)
   [junit4]   2> huhtikuuta 04, 2017 5:46:09 AP. com.carrotsearch.randomizedtesting.ThreadLeakControl checkThreadLeaks
   [junit4]   2> WARNING: Will linger awaiting termination of 14 leaked thread(s).
   [junit4]   2> huhtikuuta 04, 2017 5:46:29 AP. com.carrotsearch.randomizedtesting.ThreadLeakControl checkThreadLeaks
   [junit4]   2> SEVERE: 14 threads leaked from SUITE scope at org.apache.solr.util.TestSolrCLIRunExample: 
   [junit4]   2>    1) Thread[id=161, name=TEST-TestSolrCLIRunExample.testSchemalessExample-seed#[CA53DE291ED2AC46], state=TIMED_WAITING, group=TGRP-TestSolrCLIRunExample]
   [junit4]   2>         at java.lang.Thread.sleep(Native Method)
   [junit4]   2>         at org.apache.commons.exec.DefaultExecuteResultHandler.waitFor(DefaultExecuteResultHandler.java:121)
   [junit4]   2>         at org.apache.solr.util.SolrCLI$RunExampleTool.startSolr(SolrCLI.java:2938)
   [junit4]   2>         at org.apache.solr.util.SolrCLI$RunExampleTool.runExample(SolrCLI.java:2650)
   [junit4]   2>         at org.apache.solr.util.SolrCLI$RunExampleTool.runImpl(SolrCLI.java:2616)
   [junit4]   2>         at org.apache.solr.util.SolrCLI$ToolBase.runTool(SolrCLI.java:154)
   [junit4]   2>         at org.apache.solr.util.TestSolrCLIRunExample.testExample(TestSolrCLIRunExample.java:336)
   [junit4]   2>         at org.apache.solr.util.TestSolrCLIRunExample.testSchemalessExample(TestSolrCLIRunExample.java:300)
   [junit4]   2>         at sun.reflect.NativeMethodAccessorImpl.invoke0(Native Method)
   [junit4]   2>         at sun.reflect.NativeMethodAccessorImpl.invoke(NativeMethodAccessorImpl.java:62)
   [junit4]   2>         at sun.reflect.DelegatingMethodAccessorImpl.invoke(DelegatingMethodAccessorImpl.java:43)
   [junit4]   2>         at java.lang.reflect.Method.invoke(Method.java:498)
   [junit4]   2>         at com.carrotsearch.randomizedtesting.RandomizedRunner.invoke(RandomizedRunner.java:1713)
   [junit4]   2>         at com.carrotsearch.randomizedtesting.RandomizedRunner$8.evaluate(RandomizedRunner.java:907)
   [junit4]   2>         at com.carrotsearch.randomizedtesting.RandomizedRunner$9.evaluate(RandomizedRunner.java:943)
   [junit4]   2>         at com.carrotsearch.randomizedtesting.RandomizedRunner$10.evaluate(RandomizedRunner.java:957)
   [junit4]   2>         at com.carrotsearch.randomizedtesting.rules.SystemPropertiesRestoreRule$1.evaluate(SystemPropertiesRestoreRule.java:57)
   [junit4]   2>         at org.apache.lucene.util.TestRuleSetupTeardownChained$1.evaluate(TestRuleSetupTeardownChained.java:49)
   [junit4]   2>         at org.apache.lucene.util.AbstractBeforeAfterRule$1.evaluate(AbstractBeforeAfterRule.java:45)
   [junit4]   2>         at org.apache.lucene.util.TestRuleThreadAndTestName$1.evaluate(TestRuleThreadAndTestName.java:48)
   [junit4]   2>         at org.apache.lucene.util.TestRuleIgnoreAfterMaxFailures$1.evaluate(TestRuleIgnoreAfterMaxFailures.java:64)
   [junit4]   2>         at org.apache.lucene.util.TestRuleMarkFailure$1.evaluate(TestRuleMarkFailure.java:47)
   [junit4]   2>         at com.carrotsearch.randomizedtesting.rules.StatementAdapter.evaluate(StatementAdapter.java:36)
   [junit4]   2>         at com.carrotsearch.randomizedtesting.ThreadLeakControl$StatementRunner.run(ThreadLeakControl.java:368)
   [junit4]   2>         at com.carrotsearch.randomizedtesting.ThreadLeakControl.forkTimeoutingTask(ThreadLeakControl.java:817)
   [junit4]   2>         at com.carrotsearch.randomizedtesting.ThreadLeakControl$3.evaluate(ThreadLeakControl.java:468)
   [junit4]   2>         at com.carrotsearch.randomizedtesting.RandomizedRunner.runSingleTest(RandomizedRunner.java:916)
   [junit4]   2>         at com.carrotsearch.randomizedtesting.RandomizedRunner$5.evaluate(RandomizedRunner.java:802)
   [junit4]   2>         at com.carrotsearch.randomizedtesting.RandomizedRunner$6.evaluate(RandomizedRunner.java:852)
   [junit4]   2>         at com.carrotsearch.randomizedtesting.RandomizedRunner$7.evaluate(RandomizedRunner.java:863)
   [junit4]   2>         at com.carrotsearch.randomizedtesting.rules.StatementAdapter.evaluate(StatementAdapter.java:36)
   [junit4]   2>         at com.carrotsearch.randomizedtesting.rules.SystemPropertiesRestoreRule$1.evaluate(SystemPropertiesRestoreRule.java:57)
   [junit4]   2>         at org.apache.lucene.util.AbstractBeforeAfterRule$1.evaluate(AbstractBeforeAfterRule.java:45)
   [junit4]   2>         at com.carrotsearch.randomizedtesting.rules.StatementAdapter.evaluate(StatementAdapter.java:36)
   [junit4]   2>         at org.apache.lucene.util.TestRuleStoreClassName$1.evaluate(TestRuleStoreClassName.java:41)
   [junit4]   2>         at com.carrotsearch.randomizedtesting.rules.NoShadowingOrOverridesOnMethodsRule$1.evaluate(NoShadowingOrOverridesOnMethodsRule.java:40)
   [junit4]   2>         at com.carrotsearch.randomizedtesting.rules.NoShadowingOrOverridesOnMethodsRule$1.evaluate(NoShadowingOrOverridesOnMethodsRule.java:40)
   [junit4]   2>         at com.carrotsearch.randomizedtesting.rules.StatementAdapter.evaluate(StatementAdapter.java:36)
   [junit4]   2>         at com.carrotsearch.randomizedtesting.rules.StatementAdapter.evaluate(StatementAdapter.java:36)
   [junit4]   2>         at com.carrotsearch.randomizedtesting.rules.StatementAdapter.evaluate(StatementAdapter.java:36)
   [junit4]   2>         at org.apache.lucene.util.TestRuleAssertionsRequired$1.evaluate(TestRuleAssertionsRequired.java:53)
   [junit4]   2>         at org.apache.lucene.util.TestRuleMarkFailure$1.evaluate(TestRuleMarkFailure.java:47)
   [junit4]   2>         at org.apache.lucene.util.TestRuleIgnoreAfterMaxFailures$1.evaluate(TestRuleIgnoreAfterMaxFailures.java:64)
   [junit4]   2>         at org.apache.lucene.util.TestRuleIgnoreTestSuites$1.evaluate(TestRuleIgnoreTestSuites.java:54)
   [junit4]   2>         at com.carrotsearch.randomizedtesting.rules.StatementAdapter.evaluate(StatementAdapter.java:36)
   [junit4]   2>         at com.carrotsearch.randomizedtesting.ThreadLeakControl$StatementRunner.run(ThreadLeakControl.java:368)
   [junit4]   2>         at java.lang.Thread.run(Thread.java:745)
   [junit4]   2>    2) Thread[id=173, name=solr-idle-connections-evictor, state=TIMED_WAITING, group=TGRP-TestSolrCLIRunExample]
   [junit4]   2>         at java.lang.Thread.sleep(Native Method)
   [junit4]   2>         at org.apache.solr.update.UpdateShardHandler$IdleConnectionsEvictor$1.run(UpdateShardHandler.java:258)
   [junit4]   2>         at java.lang.Thread.run(Thread.java:745)
   [junit4]   2>    3) Thread[id=168, name=qtp20868346-168, state=TIMED_WAITING, group=TGRP-TestSolrCLIRunExample]
   [junit4]   2>         at sun.misc.Unsafe.park(Native Method)
   [junit4]   2>         at java.util.concurrent.locks.LockSupport.parkNanos(LockSupport.java:215)
   [junit4]   2>         at java.util.concurrent.locks.AbstractQueuedSynchronizer$ConditionObject.awaitNanos(AbstractQueuedSynchronizer.java:2078)
   [junit4]   2>         at org.eclipse.jetty.util.BlockingArrayQueue.poll(BlockingArrayQueue.java:392)
   [junit4]   2>         at org.eclipse.jetty.util.thread.QueuedThreadPool.idleJobPoll(QueuedThreadPool.java:563)
   [junit4]   2>         at org.eclipse.jetty.util.thread.QueuedThreadPool.access$800(QueuedThreadPool.java:48)
   [junit4]   2>         at org.eclipse.jetty.util.thread.QueuedThreadPool$2.run(QueuedThreadPool.java:626)
   [junit4]   2>         at java.lang.Thread.run(Thread.java:745)
   [junit4]   2>    4) Thread[id=163, name=qtp20868346-163, state=RUNNABLE, group=TGRP-TestSolrCLIRunExample]
   [junit4]   2>         at sun.nio.ch.WindowsSelectorImpl$SubSelector.poll0(Native Method)
   [junit4]   2>         at sun.nio.ch.WindowsSelectorImpl$SubSelector.poll(WindowsSelectorImpl.java:296)
   [junit4]   2>         at sun.nio.ch.WindowsSelectorImpl$SubSelector.access$400(WindowsSelectorImpl.java:278)
   [junit4]   2>         at sun.nio.ch.WindowsSelectorImpl.doSelect(WindowsSelectorImpl.java:159)
   [junit4]   2>         at sun.nio.ch.SelectorImpl.lockAndDoSelect(SelectorImpl.java:86)
   [junit4]   2>         at sun.nio.ch.SelectorImpl.select(SelectorImpl.java:97)
   [junit4]   2>         at sun.nio.ch.SelectorImpl.select(SelectorImpl.java:101)
   [junit4]   2>         at org.eclipse.jetty.io.ManagedSelector$SelectorProducer.select(ManagedSelector.java:243)
   [junit4]   2>         at org.eclipse.jetty.io.ManagedSelector$SelectorProducer.produce(ManagedSelector.java:191)
   [junit4]   2>         at org.eclipse.jetty.util.thread.strategy.ExecuteProduceConsume.executeProduceConsume(ExecuteProduceConsume.java:249)
   [junit4]   2>         at org.eclipse.jetty.util.thread.strategy.ExecuteProduceConsume.produceConsume(ExecuteProduceConsume.java:148)
   [junit4]   2>         at org.eclipse.jetty.util.thread.strategy.ExecuteProduceConsume.execute(ExecuteProduceConsume.java:100)
   [junit4]   2>         at org.eclipse.jetty.io.ManagedSelector.run(ManagedSelector.java:147)
   [junit4]   2>         at org.eclipse.jetty.util.thread.QueuedThreadPool.runJob(QueuedThreadPool.java:671)
   [junit4]   2>         at org.eclipse.jetty.util.thread.QueuedThreadPool$2.run(QueuedThreadPool.java:589)
   [junit4]   2>         at java.lang.Thread.run(Thread.java:745)
   [junit4]   2>    5) Thread[id=164, name=qtp20868346-164-acceptor-0@fc29a0-ServerConnector@17534ae{HTTP/1.1,[http/1.1]}{127.0.0.1:50974}, state=RUNNABLE, group=TGRP-TestSolrCLIRunExample]
   [junit4]   2>         at sun.nio.ch.ServerSocketChannelImpl.accept0(Native Method)
   [junit4]   2>         at sun.nio.ch.ServerSocketChannelImpl.accept(ServerSocketChannelImpl.java:422)
   [junit4]   2>         at sun.nio.ch.ServerSocketChannelImpl.accept(ServerSocketChannelImpl.java:250)
   [junit4]   2>         at org.eclipse.jetty.server.ServerConnector.accept(ServerConnector.java:373)
   [junit4]   2>         at org.eclipse.jetty.server.AbstractConnector$Acceptor.run(AbstractConnector.java:601)
   [junit4]   2>         at org.eclipse.jetty.util.thread.QueuedThreadPool.runJob(QueuedThreadPool.java:671)
   [junit4]   2>         at org.eclipse.jetty.util.thread.QueuedThreadPool$2.run(QueuedThreadPool.java:589)
   [junit4]   2>         at java.lang.Thread.run(Thread.java:745)
   [junit4]   2>    6) Thread[id=170, name=qtp20868346-170, state=TIMED_WAITING, group=TGRP-TestSolrCLIRunExample]
   [junit4]   2>         at sun.misc.Unsafe.park(Native Method)
   [junit4]   2>         at java.util.concurrent.locks.LockSupport.parkNanos(LockSupport.java:215)
   [junit4]   2>         at java.util.concurrent.locks.AbstractQueuedSynchronizer$ConditionObject.awaitNanos(AbstractQueuedSynchronizer.java:2078)
   [junit4]   2>         at org.eclipse.jetty.util.BlockingArrayQueue.poll(BlockingArrayQueue.java:392)
   [junit4]   2>         at org.eclipse.jetty.util.thread.QueuedThreadPool.idleJobPoll(QueuedThreadPool.java:563)
   [junit4]   2>         at org.eclipse.jetty.util.thread.QueuedThreadPool.access$800(QueuedThreadPool.java:48)
   [junit4]   2>         at org.eclipse.jetty.util.thread.QueuedThreadPool$2.run(QueuedThreadPool.java:626)
   [junit4]   2>         at java.lang.Thread.run(Thread.java:745)
   [junit4]   2>    7) Thread[id=165, name=qtp20868346-165, state=TIMED_WAITING, group=TGRP-TestSolrCLIRunExample]
   [junit4]   2>         at sun.misc.Unsafe.park(Native Method)
   [junit4]   2>         at java.util.concurrent.locks.LockSupport.parkNanos(LockSupport.java:215)
   [junit4]   2>         at java.util.concurrent.locks.AbstractQueuedSynchronizer$ConditionObject.awaitNanos(AbstractQueuedSynchronizer.java:2078)
   [junit4]   2>         at org.eclipse.jetty.util.BlockingArrayQueue.poll(BlockingArrayQueue.java:392)
   [junit4]   2>         at org.eclipse.jetty.util.thread.QueuedThreadPool.idleJobPoll(QueuedThreadPool.java:563)
   [junit4]   2>         at org.eclipse.jetty.util.thread.QueuedThreadPool.access$800(QueuedThreadPool.java:48)
   [junit4]   2>         at org.eclipse.jetty.util.thread.QueuedThreadPool$2.run(QueuedThreadPool.java:626)
   [junit4]   2>         at java.lang.Thread.run(Thread.java:745)
   [junit4]   2>    8) Thread[id=169, name=qtp20868346-169, state=TIMED_WAITING, group=TGRP-TestSolrCLIRunExample]
   [junit4]   2>         at sun.misc.Unsafe.park(Native Method)
   [junit4]   2>         at java.util.concurrent.locks.LockSupport.parkNanos(LockSupport.java:215)
   [junit4]   2>         at java.util.concurrent.locks.AbstractQueuedSynchronizer$ConditionObject.awaitNanos(AbstractQueuedSynchronizer.java:2078)
   [junit4]   2>         at org.eclipse.jetty.util.BlockingArrayQueue.poll(BlockingArrayQueue.java:392)
   [junit4]   2>         at org.eclipse.jetty.util.thread.QueuedThreadPool.idleJobPoll(QueuedThreadPool.java:563)
   [junit4]   2>         at org.eclipse.jetty.util.thread.QueuedThreadPool.access$800(QueuedThreadPool.java:48)
   [junit4]   2>         at org.eclipse.jetty.util.thread.QueuedThreadPool$2.run(QueuedThreadPool.java:626)
   [junit4]   2>         at java.lang.Thread.run(Thread.java:745)
   [junit4]   2>    9) Thread[id=171, name=Scheduler-8612730, state=TIMED_WAITING, group=TGRP-TestSolrCLIRunExample]
   [junit4]   2>         at sun.misc.Unsafe.park(Native Method)
   [junit4]   2>         at java.util.concurrent.locks.LockSupport.parkNanos(LockSupport.java:215)
   [junit4]   2>         at java.util.concurrent.locks.AbstractQueuedSynchronizer$ConditionObject.awaitNanos(AbstractQueuedSynchronizer.java:2078)
   [junit4]   2>         at java.util.concurrent.ScheduledThreadPoolExecutor$DelayedWorkQueue.take(ScheduledThreadPoolExecutor.java:1093)
   [junit4]   2>         at java.util.concurrent.ScheduledThreadPoolExecutor$DelayedWorkQueue.take(ScheduledThreadPoolExecutor.java:809)
   [junit4]   2>         at java.util.concurrent.ThreadPoolExecutor.getTask(ThreadPoolExecutor.java:1067)
   [junit4]   2>         at java.util.concurrent.ThreadPoolExecutor.runWorker(ThreadPoolExecutor.java:1127)
   [junit4]   2>         at java.util.concurrent.ThreadPoolExecutor$Worker.run(ThreadPoolExecutor.java:617)
   [junit4]   2>         at java.lang.Thread.run(Thread.java:745)
   [junit4]   2>   10) Thread[id=175, name=Thread-43, state=WAITING, group=TGRP-TestSolrCLIRunExample]
   [junit4]   2>         at java.lang.Object.wait(Native Method)
   [junit4]   2>         at java.lang.Object.wait(Object.java:502)
   [junit4]   2>         at org.apache.solr.core.CloserThread.run(CoreContainer.java:1471)
   [junit4]   2>   11) Thread[id=167, name=qtp20868346-167, state=TIMED_WAITING, group=TGRP-TestSolrCLIRunExample]
   [junit4]   2>         at sun.misc.Unsafe.park(Native Method)
   [junit4]   2>         at java.util.concurrent.locks.LockSupport.parkNanos(LockSupport.java:215)
   [junit4]   2>         at java.util.concurrent.locks.AbstractQueuedSynchronizer$ConditionObject.awaitNanos(AbstractQueuedSynchronizer.java:2078)
   [junit4]   2>         at org.eclipse.jetty.util.BlockingArrayQueue.poll(BlockingArrayQueue.java:392)
   [junit4]   2>         at org.eclipse.jetty.util.thread.QueuedThreadPool.idleJobPoll(QueuedThreadPool.java:563)
   [junit4]   2>         at org.eclipse.jetty.util.thread.QueuedThreadPool.access$800(QueuedThreadPool.java:48)
   [junit4]   2>         at org.eclipse.jetty.util.thread.QueuedThreadPool$2.run(QueuedThreadPool.java:626)
   [junit4]   2>         at java.lang.Thread.run(Thread.java:745)
   [junit4]   2>   12) Thread[id=166, name=qtp20868346-166, state=TIMED_WAITING, group=TGRP-TestSolrCLIRunExample]
   [junit4]   2>         at sun.misc.Unsafe.park(Native Method)
   [junit4]   2>         at java.util.concurrent.locks.LockSupport.parkNanos(LockSupport.java:215)
   [junit4]   2>         at java.util.concurrent.locks.AbstractQueuedSynchronizer$ConditionObject.awaitNanos(AbstractQueuedSynchronizer.java:2078)
   [junit4]   2>         at org.eclipse.jetty.util.BlockingArrayQueue.poll(BlockingArrayQueue.java:392)
   [junit4]   2>         at org.eclipse.jetty.util.thread.QueuedThreadPool.idleJobPoll(QueuedThreadPool.java:563)
   [junit4]   2>         at org.eclipse.jetty.util.thread.QueuedThreadPool.access$800(QueuedThreadPool.java:48)
   [junit4]   2>         at org.eclipse.jetty.util.thread.QueuedThreadPool$2.run(QueuedThreadPool.java:626)
   [junit4]   2>         at java.lang.Thread.run(Thread.java:745)
   [junit4]   2>   13) Thread[id=174, name=solr-idle-connections-evictor, state=TIMED_WAITING, group=TGRP-TestSolrCLIRunExample]
   [junit4]   2>         at java.lang.Thread.sleep(Native Method)
   [junit4]   2>         at org.apache.solr.update.UpdateShardHandler$IdleConnectionsEvictor$1.run(UpdateShardHandler.java:258)
   [junit4]   2>         at java.lang.Thread.run(Thread.java:745)
   [junit4]   2>   14) Thread[id=172, name=org.eclipse.jetty.server.session.HashSessionManager@9742bdTimer, state=TIMED_WAITING, group=TGRP-TestSolrCLIRunExample]
   [junit4]   2>         at sun.misc.Unsafe.park(Native Method)
   [junit4]   2>         at java.util.concurrent.locks.LockSupport.parkNanos(LockSupport.java:215)
   [junit4]   2>         at java.util.concurrent.locks.AbstractQueuedSynchronizer$ConditionObject.awaitNanos(AbstractQueuedSynchronizer.java:2078)
   [junit4]   2>         at java.util.concurrent.ScheduledThreadPoolExecutor$DelayedWorkQueue.take(ScheduledThreadPoolExecutor.java:1093)
   [junit4]   2>         at java.util.concurrent.ScheduledThreadPoolExecutor$DelayedWorkQueue.take(ScheduledThreadPoolExecutor.java:809)
   [junit4]   2>         at java.util.concurrent.ThreadPoolExecutor.getTask(ThreadPoolExecutor.java:1067)
   [junit4]   2>         at java.util.concurrent.ThreadPoolExecutor.runWorker(ThreadPoolExecutor.java:1127)
   [junit4]   2>         at java.util.concurrent.ThreadPoolExecutor$Worker.run(ThreadPoolExecutor.java:617)
   [junit4]   2>         at java.lang.Thread.run(Thread.java:745)
   [junit4]   2> huhtikuuta 04, 2017 5:46:29 AP. com.carrotsearch.randomizedtesting.ThreadLeakControl tryToInterruptAll
   [junit4]   2> INFO: Starting to interrupt leaked threads:
   [junit4]   2>    1) Thread[id=161, name=TEST-TestSolrCLIRunExample.testSchemalessExample-seed#[CA53DE291ED2AC46], state=TIMED_WAITING, group=TGRP-TestSolrCLIRunExample]
   [junit4]   2>    2) Thread[id=173, name=solr-idle-connections-evictor, state=TIMED_WAITING, group=TGRP-TestSolrCLIRunExample]
   [junit4]   2>    3) Thread[id=168, name=qtp20868346-168, state=TIMED_WAITING, group=TGRP-TestSolrCLIRunExample]
   [junit4]   2>    4) Thread[id=163, name=qtp20868346-163, state=RUNNABLE, group=TGRP-TestSolrCLIRunExample]
   [junit4]   2>    5) Thread[id=164, name=qtp20868346-164-acceptor-0@fc29a0-ServerConnector@17534ae{HTTP/1.1,[http/1.1]}{127.0.0.1:50974}, state=RUNNABLE, group=TGRP-TestSolrCLIRunExample]
   [junit4]   2>    6) Thread[id=170, name=qtp20868346-170, state=TIMED_WAITING, group=TGRP-TestSolrCLIRunExample]
   [junit4]   2>    7) Thread[id=165, name=qtp20868346-165, state=TIMED_WAITING, group=TGRP-TestSolrCLIRunExample]
   [junit4]   2>    8) Thread[id=169, name=qtp20868346-169, state=TIMED_WAITING, group=TGRP-TestSolrCLIRunExample]
   [junit4]   2>    9) Thread[id=171, name=Scheduler-8612730, state=TIMED_WAITING, group=TGRP-TestSolrCLIRunExample]
   [junit4]   2>   10) Thread[id=175, name=Thread-43, state=WAITING, group=TGRP-TestSolrCLIRunExample]
   [junit4]   2>   11) Thread[id=167, name=qtp20868346-167, state=TIMED_WAITING, group=TGRP-TestSolrCLIRunExample]
   [junit4]   2>   12) Thread[id=166, name=qtp20868346-166, state=TIMED_WAITING, group=TGRP-TestSolrCLIRunExample]
   [junit4]   2>   13) Thread[id=174, name=solr-idle-connections-evictor, state=TIMED_WAITING, group=TGRP-TestSolrCLIRunExample]
   [junit4]   2>   14) Thread[id=172, name=org.eclipse.jetty.server.session.HashSessionManager@9742bdTimer, state=TIMED_WAITING, group=TGRP-TestSolrCLIRunExample]
   [junit4]   2> 
   [junit4]   2> ERROR: The process has not exited yet therefore no result is available ...
   [junit4]   2> 
   [junit4]   2> 7248171 INFO  (TEST-TestSolrCLIRunExample.testSchemalessExample-seed#[CA53DE291ED2AC46]) [    ] o.e.j.s.AbstractConnector Stopped ServerConnector@17534ae{HTTP/1.1,[http/1.1]}{127.0.0.1:50974}
   [junit4]   2> 7248172 INFO  (TEST-TestSolrCLIRunExample.testSchemalessExample-seed#[CA53DE291ED2AC46]) [    ] o.a.s.c.CoreContainer Shutting down CoreContainer instance=9201617
   [junit4]   2> 7248173 INFO  (TEST-TestSolrCLIRunExample.testSchemalessExample-seed#[CA53DE291ED2AC46]) [    ] o.a.s.c.TransientSolrCoreCacheDefault Allocating transient cache for 2147483647 transient cores
   [junit4]   2> 7248173 INFO  (TEST-TestSolrCLIRunExample.testSchemalessExample-seed#[CA53DE291ED2AC46]) [    ] o.a.s.m.SolrMetricManager Closing metric reporters for: solr.node
   [junit4]   2> 7248174 INFO  (TEST-TestSolrCLIRunExample.testSchemalessExample-seed#[CA53DE291ED2AC46]) [    ] o.e.j.s.h.ContextHandler Stopped o.e.j.s.ServletContextHandler@1cd1cc0{/solr,null,UNAVAILABLE}
   [junit4]   2> 7248175 INFO  (TEST-TestSolrCLIRunExample.testSchemalessExample-seed#[CA53DE291ED2AC46]) [    ] o.a.s.u.TestSolrCLIRunExample Stopped standalone Solr instance running on port 50974
   [junit4]   2> 7248175 INFO  (TEST-TestSolrCLIRunExample.testSchemalessExample-seed#[CA53DE291ED2AC46]) [    ] o.a.s.SolrTestCaseJ4 ###Ending testSchemalessExample
   [junit4]   2> 7248177 INFO  (SUITE-TestSolrCLIRunExample-seed#[CA53DE291ED2AC46]-worker) [    ] o.a.s.SolrTestCaseJ4 ###deleteCore
   [junit4]   2> 7248177 INFO  (SUITE-TestSolrCLIRunExample-seed#[CA53DE291ED2AC46]-worker) [    ] o.a.s.SolrTestCaseJ4 ------------------------------------------------------- Done waiting for tracked resources to be released
   [junit4]   2> Apr 04, 2017 5:46:29 AM com.carrotsearch.randomizedtesting.ThreadLeakControl tryToInterruptAll
   [junit4]   2> INFO: All leaked threads terminated.
   [junit4]   2> NOTE: test params are: codec=Asserting(Lucene62): {}, docValues:{}, maxPointsInLeafNode=1217, maxMBSortInHeap=5.056511371504881, sim=RandomSimilarity(queryNorm=false,coord=no): {}, locale=fi, timezone=Africa/Conakry
   [junit4]   2> NOTE: Windows 10 10.0 x86/Oracle Corporation 1.8.0_121 (32-bit)/cpus=3,threads=1,free=23496288,total=55046144
   [junit4]   2> NOTE: All tests run in this JVM: [TermVectorComponentTest, MissingSegmentRecoveryTest, TestStandardQParsers, TestSolrCLIRunExample]
   [junit4]   2> NOTE: reproduce with: ant test  -Dtestcase=TestSolrCLIRunExample -Dtests.seed=CA53DE291ED2AC46 -Dtests.slow=true -Dtests.locale=fi -Dtests.timezone=Africa/Conakry -Dtests.asserts=true -Dtests.file.encoding=UTF-8
   [junit4] ERROR   0.00s J1 | TestSolrCLIRunExample (suite) <<<
   [junit4]    > Throwable #1: java.lang.Exception: Suite timeout exceeded (>= 7200000 msec).
   [junit4]    > 	at __randomizedtesting.SeedInfo.seed([CA53DE291ED2AC46]:0)
   [junit4] Completed [530/701 (1!)] on J1 in 7220.14s, 1 test, 2 errors <<< FAILURES!

[...truncated 39920 lines...]


Mime
View raw message