lucene-dev mailing list archives

Site index · List index
Message view « Date » · « Thread »
Top « Date » · « Thread »
From Policeman Jenkins Server <jenk...@thetaphi.de>
Subject [JENKINS-EA] Lucene-Solr-master-Linux (32bit/jdk-9-ea+164) - Build # 19372 - Still Unstable!
Date Wed, 12 Apr 2017 06:01:03 GMT
Build: https://jenkins.thetaphi.de/job/Lucene-Solr-master-Linux/19372/
Java: 32bit/jdk-9-ea+164 -server -XX:+UseSerialGC

3 tests failed.
FAILED:  org.apache.solr.handler.admin.StatsReloadRaceTest.testParallelReloadAndStats

Error Message:
Key SEARCHER.searcher.indexVersion not found in registry solr.core.collection1

Stack Trace:
java.lang.AssertionError: Key SEARCHER.searcher.indexVersion not found in registry solr.core.collection1
	at __randomizedtesting.SeedInfo.seed([819E30883BAEDC76:4E0055B1B45FB429]:0)
	at org.junit.Assert.fail(Assert.java:93)
	at org.junit.Assert.assertTrue(Assert.java:43)
	at org.apache.solr.handler.admin.StatsReloadRaceTest.requestMetrics(StatsReloadRaceTest.java:132)
	at org.apache.solr.handler.admin.StatsReloadRaceTest.testParallelReloadAndStats(StatsReloadRaceTest.java:70)
	at java.base/jdk.internal.reflect.NativeMethodAccessorImpl.invoke0(Native Method)
	at java.base/jdk.internal.reflect.NativeMethodAccessorImpl.invoke(NativeMethodAccessorImpl.java:62)
	at java.base/jdk.internal.reflect.DelegatingMethodAccessorImpl.invoke(DelegatingMethodAccessorImpl.java:43)
	at java.base/java.lang.reflect.Method.invoke(Method.java:563)
	at com.carrotsearch.randomizedtesting.RandomizedRunner.invoke(RandomizedRunner.java:1713)
	at com.carrotsearch.randomizedtesting.RandomizedRunner$8.evaluate(RandomizedRunner.java:907)
	at com.carrotsearch.randomizedtesting.RandomizedRunner$9.evaluate(RandomizedRunner.java:943)
	at com.carrotsearch.randomizedtesting.RandomizedRunner$10.evaluate(RandomizedRunner.java:957)
	at com.carrotsearch.randomizedtesting.rules.SystemPropertiesRestoreRule$1.evaluate(SystemPropertiesRestoreRule.java:57)
	at org.apache.lucene.util.TestRuleSetupTeardownChained$1.evaluate(TestRuleSetupTeardownChained.java:49)
	at org.apache.lucene.util.AbstractBeforeAfterRule$1.evaluate(AbstractBeforeAfterRule.java:45)
	at org.apache.lucene.util.TestRuleThreadAndTestName$1.evaluate(TestRuleThreadAndTestName.java:48)
	at org.apache.lucene.util.TestRuleIgnoreAfterMaxFailures$1.evaluate(TestRuleIgnoreAfterMaxFailures.java:64)
	at org.apache.lucene.util.TestRuleMarkFailure$1.evaluate(TestRuleMarkFailure.java:47)
	at com.carrotsearch.randomizedtesting.rules.StatementAdapter.evaluate(StatementAdapter.java:36)
	at com.carrotsearch.randomizedtesting.ThreadLeakControl$StatementRunner.run(ThreadLeakControl.java:368)
	at com.carrotsearch.randomizedtesting.ThreadLeakControl.forkTimeoutingTask(ThreadLeakControl.java:817)
	at com.carrotsearch.randomizedtesting.ThreadLeakControl$3.evaluate(ThreadLeakControl.java:468)
	at com.carrotsearch.randomizedtesting.RandomizedRunner.runSingleTest(RandomizedRunner.java:916)
	at com.carrotsearch.randomizedtesting.RandomizedRunner$5.evaluate(RandomizedRunner.java:802)
	at com.carrotsearch.randomizedtesting.RandomizedRunner$6.evaluate(RandomizedRunner.java:852)
	at com.carrotsearch.randomizedtesting.RandomizedRunner$7.evaluate(RandomizedRunner.java:863)
	at com.carrotsearch.randomizedtesting.rules.StatementAdapter.evaluate(StatementAdapter.java:36)
	at com.carrotsearch.randomizedtesting.rules.SystemPropertiesRestoreRule$1.evaluate(SystemPropertiesRestoreRule.java:57)
	at org.apache.lucene.util.AbstractBeforeAfterRule$1.evaluate(AbstractBeforeAfterRule.java:45)
	at com.carrotsearch.randomizedtesting.rules.StatementAdapter.evaluate(StatementAdapter.java:36)
	at org.apache.lucene.util.TestRuleStoreClassName$1.evaluate(TestRuleStoreClassName.java:41)
	at com.carrotsearch.randomizedtesting.rules.NoShadowingOrOverridesOnMethodsRule$1.evaluate(NoShadowingOrOverridesOnMethodsRule.java:40)
	at com.carrotsearch.randomizedtesting.rules.NoShadowingOrOverridesOnMethodsRule$1.evaluate(NoShadowingOrOverridesOnMethodsRule.java:40)
	at com.carrotsearch.randomizedtesting.rules.StatementAdapter.evaluate(StatementAdapter.java:36)
	at com.carrotsearch.randomizedtesting.rules.StatementAdapter.evaluate(StatementAdapter.java:36)
	at org.apache.lucene.util.TestRuleAssertionsRequired$1.evaluate(TestRuleAssertionsRequired.java:53)
	at org.apache.lucene.util.TestRuleMarkFailure$1.evaluate(TestRuleMarkFailure.java:47)
	at org.apache.lucene.util.TestRuleIgnoreAfterMaxFailures$1.evaluate(TestRuleIgnoreAfterMaxFailures.java:64)
	at org.apache.lucene.util.TestRuleIgnoreTestSuites$1.evaluate(TestRuleIgnoreTestSuites.java:54)
	at com.carrotsearch.randomizedtesting.rules.StatementAdapter.evaluate(StatementAdapter.java:36)
	at com.carrotsearch.randomizedtesting.ThreadLeakControl$StatementRunner.run(ThreadLeakControl.java:368)
	at java.base/java.lang.Thread.run(Thread.java:844)


FAILED:  org.apache.solr.update.processor.ClassificationUpdateProcessorTest.knnMonoClass_sampleParams_shouldAssignCorrectClass

Error Message:
 Expected: is "class1"      got: "class2" 

Stack Trace:
java.lang.AssertionError: 
Expected: is "class1"
     got: "class2"

	at __randomizedtesting.SeedInfo.seed([819E30883BAEDC76:AF13D99AD1432CA]:0)
	at org.junit.Assert.assertThat(Assert.java:780)
	at org.junit.Assert.assertThat(Assert.java:738)
	at org.apache.solr.update.processor.ClassificationUpdateProcessorTest.knnMonoClass_sampleParams_shouldAssignCorrectClass(ClassificationUpdateProcessorTest.java:122)
	at java.base/jdk.internal.reflect.NativeMethodAccessorImpl.invoke0(Native Method)
	at java.base/jdk.internal.reflect.NativeMethodAccessorImpl.invoke(NativeMethodAccessorImpl.java:62)
	at java.base/jdk.internal.reflect.DelegatingMethodAccessorImpl.invoke(DelegatingMethodAccessorImpl.java:43)
	at java.base/java.lang.reflect.Method.invoke(Method.java:563)
	at com.carrotsearch.randomizedtesting.RandomizedRunner.invoke(RandomizedRunner.java:1713)
	at com.carrotsearch.randomizedtesting.RandomizedRunner$8.evaluate(RandomizedRunner.java:907)
	at com.carrotsearch.randomizedtesting.RandomizedRunner$9.evaluate(RandomizedRunner.java:943)
	at com.carrotsearch.randomizedtesting.RandomizedRunner$10.evaluate(RandomizedRunner.java:957)
	at com.carrotsearch.randomizedtesting.rules.SystemPropertiesRestoreRule$1.evaluate(SystemPropertiesRestoreRule.java:57)
	at org.apache.lucene.util.TestRuleSetupTeardownChained$1.evaluate(TestRuleSetupTeardownChained.java:49)
	at org.apache.lucene.util.AbstractBeforeAfterRule$1.evaluate(AbstractBeforeAfterRule.java:45)
	at org.apache.lucene.util.TestRuleThreadAndTestName$1.evaluate(TestRuleThreadAndTestName.java:48)
	at org.apache.lucene.util.TestRuleIgnoreAfterMaxFailures$1.evaluate(TestRuleIgnoreAfterMaxFailures.java:64)
	at org.apache.lucene.util.TestRuleMarkFailure$1.evaluate(TestRuleMarkFailure.java:47)
	at com.carrotsearch.randomizedtesting.rules.StatementAdapter.evaluate(StatementAdapter.java:36)
	at com.carrotsearch.randomizedtesting.ThreadLeakControl$StatementRunner.run(ThreadLeakControl.java:368)
	at com.carrotsearch.randomizedtesting.ThreadLeakControl.forkTimeoutingTask(ThreadLeakControl.java:817)
	at com.carrotsearch.randomizedtesting.ThreadLeakControl$3.evaluate(ThreadLeakControl.java:468)
	at com.carrotsearch.randomizedtesting.RandomizedRunner.runSingleTest(RandomizedRunner.java:916)
	at com.carrotsearch.randomizedtesting.RandomizedRunner$5.evaluate(RandomizedRunner.java:802)
	at com.carrotsearch.randomizedtesting.RandomizedRunner$6.evaluate(RandomizedRunner.java:852)
	at com.carrotsearch.randomizedtesting.RandomizedRunner$7.evaluate(RandomizedRunner.java:863)
	at com.carrotsearch.randomizedtesting.rules.StatementAdapter.evaluate(StatementAdapter.java:36)
	at com.carrotsearch.randomizedtesting.rules.SystemPropertiesRestoreRule$1.evaluate(SystemPropertiesRestoreRule.java:57)
	at org.apache.lucene.util.AbstractBeforeAfterRule$1.evaluate(AbstractBeforeAfterRule.java:45)
	at com.carrotsearch.randomizedtesting.rules.StatementAdapter.evaluate(StatementAdapter.java:36)
	at org.apache.lucene.util.TestRuleStoreClassName$1.evaluate(TestRuleStoreClassName.java:41)
	at com.carrotsearch.randomizedtesting.rules.NoShadowingOrOverridesOnMethodsRule$1.evaluate(NoShadowingOrOverridesOnMethodsRule.java:40)
	at com.carrotsearch.randomizedtesting.rules.NoShadowingOrOverridesOnMethodsRule$1.evaluate(NoShadowingOrOverridesOnMethodsRule.java:40)
	at com.carrotsearch.randomizedtesting.rules.StatementAdapter.evaluate(StatementAdapter.java:36)
	at com.carrotsearch.randomizedtesting.rules.StatementAdapter.evaluate(StatementAdapter.java:36)
	at org.apache.lucene.util.TestRuleAssertionsRequired$1.evaluate(TestRuleAssertionsRequired.java:53)
	at org.apache.lucene.util.TestRuleMarkFailure$1.evaluate(TestRuleMarkFailure.java:47)
	at org.apache.lucene.util.TestRuleIgnoreAfterMaxFailures$1.evaluate(TestRuleIgnoreAfterMaxFailures.java:64)
	at org.apache.lucene.util.TestRuleIgnoreTestSuites$1.evaluate(TestRuleIgnoreTestSuites.java:54)
	at com.carrotsearch.randomizedtesting.rules.StatementAdapter.evaluate(StatementAdapter.java:36)
	at com.carrotsearch.randomizedtesting.ThreadLeakControl$StatementRunner.run(ThreadLeakControl.java:368)
	at java.base/java.lang.Thread.run(Thread.java:844)


FAILED:  org.apache.solr.update.processor.ClassificationUpdateProcessorTest.classificationMonoClass_predictedClassFieldSet_shouldAssignClassInPredictedClassField

Error Message:
 Expected: is "class1"      got: "class2" 

Stack Trace:
java.lang.AssertionError: 
Expected: is "class1"
     got: "class2"

	at __randomizedtesting.SeedInfo.seed([819E30883BAEDC76:88D15E3025073BFD]:0)
	at org.junit.Assert.assertThat(Assert.java:780)
	at org.junit.Assert.assertThat(Assert.java:738)
	at org.apache.solr.update.processor.ClassificationUpdateProcessorTest.classificationMonoClass_predictedClassFieldSet_shouldAssignClassInPredictedClassField(ClassificationUpdateProcessorTest.java:102)
	at java.base/jdk.internal.reflect.NativeMethodAccessorImpl.invoke0(Native Method)
	at java.base/jdk.internal.reflect.NativeMethodAccessorImpl.invoke(NativeMethodAccessorImpl.java:62)
	at java.base/jdk.internal.reflect.DelegatingMethodAccessorImpl.invoke(DelegatingMethodAccessorImpl.java:43)
	at java.base/java.lang.reflect.Method.invoke(Method.java:563)
	at com.carrotsearch.randomizedtesting.RandomizedRunner.invoke(RandomizedRunner.java:1713)
	at com.carrotsearch.randomizedtesting.RandomizedRunner$8.evaluate(RandomizedRunner.java:907)
	at com.carrotsearch.randomizedtesting.RandomizedRunner$9.evaluate(RandomizedRunner.java:943)
	at com.carrotsearch.randomizedtesting.RandomizedRunner$10.evaluate(RandomizedRunner.java:957)
	at com.carrotsearch.randomizedtesting.rules.SystemPropertiesRestoreRule$1.evaluate(SystemPropertiesRestoreRule.java:57)
	at org.apache.lucene.util.TestRuleSetupTeardownChained$1.evaluate(TestRuleSetupTeardownChained.java:49)
	at org.apache.lucene.util.AbstractBeforeAfterRule$1.evaluate(AbstractBeforeAfterRule.java:45)
	at org.apache.lucene.util.TestRuleThreadAndTestName$1.evaluate(TestRuleThreadAndTestName.java:48)
	at org.apache.lucene.util.TestRuleIgnoreAfterMaxFailures$1.evaluate(TestRuleIgnoreAfterMaxFailures.java:64)
	at org.apache.lucene.util.TestRuleMarkFailure$1.evaluate(TestRuleMarkFailure.java:47)
	at com.carrotsearch.randomizedtesting.rules.StatementAdapter.evaluate(StatementAdapter.java:36)
	at com.carrotsearch.randomizedtesting.ThreadLeakControl$StatementRunner.run(ThreadLeakControl.java:368)
	at com.carrotsearch.randomizedtesting.ThreadLeakControl.forkTimeoutingTask(ThreadLeakControl.java:817)
	at com.carrotsearch.randomizedtesting.ThreadLeakControl$3.evaluate(ThreadLeakControl.java:468)
	at com.carrotsearch.randomizedtesting.RandomizedRunner.runSingleTest(RandomizedRunner.java:916)
	at com.carrotsearch.randomizedtesting.RandomizedRunner$5.evaluate(RandomizedRunner.java:802)
	at com.carrotsearch.randomizedtesting.RandomizedRunner$6.evaluate(RandomizedRunner.java:852)
	at com.carrotsearch.randomizedtesting.RandomizedRunner$7.evaluate(RandomizedRunner.java:863)
	at com.carrotsearch.randomizedtesting.rules.StatementAdapter.evaluate(StatementAdapter.java:36)
	at com.carrotsearch.randomizedtesting.rules.SystemPropertiesRestoreRule$1.evaluate(SystemPropertiesRestoreRule.java:57)
	at org.apache.lucene.util.AbstractBeforeAfterRule$1.evaluate(AbstractBeforeAfterRule.java:45)
	at com.carrotsearch.randomizedtesting.rules.StatementAdapter.evaluate(StatementAdapter.java:36)
	at org.apache.lucene.util.TestRuleStoreClassName$1.evaluate(TestRuleStoreClassName.java:41)
	at com.carrotsearch.randomizedtesting.rules.NoShadowingOrOverridesOnMethodsRule$1.evaluate(NoShadowingOrOverridesOnMethodsRule.java:40)
	at com.carrotsearch.randomizedtesting.rules.NoShadowingOrOverridesOnMethodsRule$1.evaluate(NoShadowingOrOverridesOnMethodsRule.java:40)
	at com.carrotsearch.randomizedtesting.rules.StatementAdapter.evaluate(StatementAdapter.java:36)
	at com.carrotsearch.randomizedtesting.rules.StatementAdapter.evaluate(StatementAdapter.java:36)
	at org.apache.lucene.util.TestRuleAssertionsRequired$1.evaluate(TestRuleAssertionsRequired.java:53)
	at org.apache.lucene.util.TestRuleMarkFailure$1.evaluate(TestRuleMarkFailure.java:47)
	at org.apache.lucene.util.TestRuleIgnoreAfterMaxFailures$1.evaluate(TestRuleIgnoreAfterMaxFailures.java:64)
	at org.apache.lucene.util.TestRuleIgnoreTestSuites$1.evaluate(TestRuleIgnoreTestSuites.java:54)
	at com.carrotsearch.randomizedtesting.rules.StatementAdapter.evaluate(StatementAdapter.java:36)
	at com.carrotsearch.randomizedtesting.ThreadLeakControl$StatementRunner.run(ThreadLeakControl.java:368)
	at java.base/java.lang.Thread.run(Thread.java:844)




Build Log:
[...truncated 11558 lines...]
   [junit4] Suite: org.apache.solr.handler.admin.StatsReloadRaceTest
   [junit4]   2> Creating dataDir: /home/jenkins/workspace/Lucene-Solr-master-Linux/solr/build/solr-core/test/J0/temp/solr.handler.admin.StatsReloadRaceTest_819E30883BAEDC76-001/init-core-data-001
   [junit4]   2> 873904 INFO  (SUITE-StatsReloadRaceTest-seed#[819E30883BAEDC76]-worker) [    ] o.a.s.SolrTestCaseJ4 Using TrieFields
   [junit4]   2> 873907 INFO  (SUITE-StatsReloadRaceTest-seed#[819E30883BAEDC76]-worker) [    ] o.a.s.SolrTestCaseJ4 Randomized ssl (false) and clientAuth (false) via: @org.apache.solr.util.RandomizeSSL(reason="", ssl=0.0/0.0, value=0.0/0.0, clientAuth=0.0/0.0)
   [junit4]   2> 873908 INFO  (SUITE-StatsReloadRaceTest-seed#[819E30883BAEDC76]-worker) [    ] o.a.s.SolrTestCaseJ4 ####initCore
   [junit4]   2> 873909 INFO  (SUITE-StatsReloadRaceTest-seed#[819E30883BAEDC76]-worker) [    ] o.a.s.c.SolrResourceLoader [null] Added 2 libs to classloader, from paths: [/home/jenkins/workspace/Lucene-Solr-master-Linux/solr/core/src/test-files/solr/collection1/lib, /home/jenkins/workspace/Lucene-Solr-master-Linux/solr/core/src/test-files/solr/collection1/lib/classes]
   [junit4]   2> 873980 WARN  (SUITE-StatsReloadRaceTest-seed#[819E30883BAEDC76]-worker) [    ] o.a.s.c.Config Beginning with Solr 5.5, <mergePolicy> is deprecated, use <mergePolicyFactory> instead.
   [junit4]   2> 873981 INFO  (SUITE-StatsReloadRaceTest-seed#[819E30883BAEDC76]-worker) [    ] o.a.s.c.SolrConfig Using Lucene MatchVersion: 7.0.0
   [junit4]   2> 873999 INFO  (SUITE-StatsReloadRaceTest-seed#[819E30883BAEDC76]-worker) [    ] o.a.s.s.IndexSchema [null] Schema name=test
   [junit4]   2> 874085 WARN  (SUITE-StatsReloadRaceTest-seed#[819E30883BAEDC76]-worker) [    ] o.a.s.s.IndexSchema [null] default search field in schema is text. WARNING: Deprecated, please use 'df' on request instead.
   [junit4]   2> 874088 INFO  (SUITE-StatsReloadRaceTest-seed#[819E30883BAEDC76]-worker) [    ] o.a.s.s.IndexSchema Loaded schema test/1.0 with uniqueid field id
   [junit4]   2> 874225 INFO  (SUITE-StatsReloadRaceTest-seed#[819E30883BAEDC76]-worker) [    ] o.a.s.m.r.SolrJmxReporter JMX monitoring for 'solr.node' (registry 'solr.node') enabled at server: com.sun.jmx.mbeanserver.JmxMBeanServer@1a7b729
   [junit4]   2> 874228 INFO  (SUITE-StatsReloadRaceTest-seed#[819E30883BAEDC76]-worker) [    ] o.a.s.m.r.SolrJmxReporter JMX monitoring for 'solr.jvm' (registry 'solr.jvm') enabled at server: com.sun.jmx.mbeanserver.JmxMBeanServer@1a7b729
   [junit4]   2> 874228 INFO  (SUITE-StatsReloadRaceTest-seed#[819E30883BAEDC76]-worker) [    ] o.a.s.m.r.SolrJmxReporter JMX monitoring for 'solr.jetty' (registry 'solr.jetty') enabled at server: com.sun.jmx.mbeanserver.JmxMBeanServer@1a7b729
   [junit4]   2> 874231 INFO  (coreLoadExecutor-2703-thread-1) [    ] o.a.s.c.SolrResourceLoader [null] Added 2 libs to classloader, from paths: [/home/jenkins/workspace/Lucene-Solr-master-Linux/solr/core/src/test-files/solr/collection1/lib, /home/jenkins/workspace/Lucene-Solr-master-Linux/solr/core/src/test-files/solr/collection1/lib/classes]
   [junit4]   2> 874300 WARN  (coreLoadExecutor-2703-thread-1) [    ] o.a.s.c.Config Beginning with Solr 5.5, <mergePolicy> is deprecated, use <mergePolicyFactory> instead.
   [junit4]   2> 874301 INFO  (coreLoadExecutor-2703-thread-1) [    ] o.a.s.c.SolrConfig Using Lucene MatchVersion: 7.0.0
   [junit4]   2> 874318 INFO  (coreLoadExecutor-2703-thread-1) [    ] o.a.s.s.IndexSchema [collection1] Schema name=test
   [junit4]   2> 874405 WARN  (coreLoadExecutor-2703-thread-1) [    ] o.a.s.s.IndexSchema [collection1] default search field in schema is text. WARNING: Deprecated, please use 'df' on request instead.
   [junit4]   2> 874408 INFO  (coreLoadExecutor-2703-thread-1) [    ] o.a.s.s.IndexSchema Loaded schema test/1.0 with uniqueid field id
   [junit4]   2> 874432 INFO  (coreLoadExecutor-2703-thread-1) [    ] o.a.s.c.CoreContainer Creating SolrCore 'collection1' using configuration from instancedir /home/jenkins/workspace/Lucene-Solr-master-Linux/solr/core/src/test-files/solr/collection1, trusted=true
   [junit4]   2> 874432 INFO  (coreLoadExecutor-2703-thread-1) [    ] o.a.s.m.r.SolrJmxReporter JMX monitoring for 'solr.core.collection1' (registry 'solr.core.collection1') enabled at server: com.sun.jmx.mbeanserver.JmxMBeanServer@1a7b729
   [junit4]   2> 874432 INFO  (coreLoadExecutor-2703-thread-1) [    ] o.a.s.c.SolrCore solr.RecoveryStrategy.Builder
   [junit4]   2> 874432 INFO  (coreLoadExecutor-2703-thread-1) [    ] o.a.s.c.SolrCore [[collection1] ] Opening new SolrCore at [/home/jenkins/workspace/Lucene-Solr-master-Linux/solr/core/src/test-files/solr/collection1], dataDir=[/home/jenkins/workspace/Lucene-Solr-master-Linux/solr/build/solr-core/test/J0/temp/solr.handler.admin.StatsReloadRaceTest_819E30883BAEDC76-001/init-core-data-001/]
   [junit4]   2> 874434 INFO  (coreLoadExecutor-2703-thread-1) [    ] o.a.s.u.RandomMergePolicy RandomMergePolicy wrapping class org.apache.lucene.index.TieredMergePolicy: [TieredMergePolicy: maxMergeAtOnce=37, maxMergeAtOnceExplicit=47, maxMergedSegmentMB=75.6455078125, floorSegmentMB=1.5205078125, forceMergeDeletesPctAllowed=24.28436871736498, segmentsPerTier=34.0, maxCFSSegmentSizeMB=8.796093022207999E12, noCFSRatio=1.0
   [junit4]   2> 874626 INFO  (coreLoadExecutor-2703-thread-1) [    ] o.a.s.u.UpdateHandler Using UpdateLog implementation: org.apache.solr.update.UpdateLog
   [junit4]   2> 874626 INFO  (coreLoadExecutor-2703-thread-1) [    ] o.a.s.u.UpdateLog Initializing UpdateLog: dataDir= defaultSyncLevel=FLUSH numRecordsToKeep=100 maxNumLogsToKeep=10 numVersionBuckets=65536
   [junit4]   2> 874627 INFO  (coreLoadExecutor-2703-thread-1) [    ] o.a.s.u.CommitTracker Hard AutoCommit: disabled
   [junit4]   2> 874627 INFO  (coreLoadExecutor-2703-thread-1) [    ] o.a.s.u.CommitTracker Soft AutoCommit: disabled
   [junit4]   2> 874627 INFO  (coreLoadExecutor-2703-thread-1) [    ] o.a.s.u.RandomMergePolicy RandomMergePolicy wrapping class org.apache.lucene.index.LogByteSizeMergePolicy: [LogByteSizeMergePolicy: minMergeSize=1677721, mergeFactor=6, maxMergeSize=2147483648, maxMergeSizeForForcedMerge=9223372036854775807, calibrateSizeByDeletes=false, maxMergeDocs=2147483647, maxCFSSegmentSizeMB=8.796093022207999E12, noCFSRatio=0.20698644816832418]
   [junit4]   2> 874628 INFO  (coreLoadExecutor-2703-thread-1) [    ] o.a.s.s.SolrIndexSearcher Opening [Searcher@283501[collection1] main]
   [junit4]   2> 874628 INFO  (coreLoadExecutor-2703-thread-1) [    ] o.a.s.h.c.SpellCheckComponent Initializing spell checkers
   [junit4]   2> 877369 INFO  (coreLoadExecutor-2703-thread-1) [    ] o.a.s.s.DirectSolrSpellChecker init: {name=direct,classname=DirectSolrSpellChecker,field=lowerfilt,minQueryLength=3}
   [junit4]   2> 877752 INFO  (coreLoadExecutor-2703-thread-1) [    ] o.a.s.h.ReplicationHandler Commits will be reserved for  10000
   [junit4]   2> 877752 INFO  (searcherExecutor-2704-thread-1) [    ] o.a.s.h.c.SpellCheckComponent Loading spell index for spellchecker: default
   [junit4]   2> 877752 INFO  (coreLoadExecutor-2703-thread-1) [    ] o.a.s.u.UpdateLog Could not find max version in index or recent updates, using new clock 1564448594531975168
   [junit4]   2> 877753 INFO  (searcherExecutor-2704-thread-1) [    ] o.a.s.h.c.SpellCheckComponent Loading spell index for spellchecker: direct
   [junit4]   2> 877753 INFO  (searcherExecutor-2704-thread-1) [    ] o.a.s.h.c.SpellCheckComponent Loading spell index for spellchecker: wordbreak
   [junit4]   2> 877753 INFO  (searcherExecutor-2704-thread-1) [    ] o.a.s.h.c.SpellCheckComponent Loading spell index for spellchecker: multipleFields
   [junit4]   2> 877753 INFO  (searcherExecutor-2704-thread-1) [    ] o.a.s.h.c.SpellCheckComponent Loading spell index for spellchecker: jarowinkler
   [junit4]   2> 877754 INFO  (searcherExecutor-2704-thread-1) [    ] o.a.s.h.c.SpellCheckComponent Loading spell index for spellchecker: external
   [junit4]   2> 877754 INFO  (searcherExecutor-2704-thread-1) [    ] o.a.s.h.c.SpellCheckComponent Loading spell index for spellchecker: freq
   [junit4]   2> 877754 INFO  (searcherExecutor-2704-thread-1) [    ] o.a.s.h.c.SpellCheckComponent Loading spell index for spellchecker: fqcn
   [junit4]   2> 877754 INFO  (searcherExecutor-2704-thread-1) [    ] o.a.s.h.c.SpellCheckComponent Loading spell index for spellchecker: perDict
   [junit4]   2> 877755 INFO  (SUITE-StatsReloadRaceTest-seed#[819E30883BAEDC76]-worker) [    ] o.a.s.SolrTestCaseJ4 ####initCore end
   [junit4]   2> 877756 INFO  (searcherExecutor-2704-thread-1) [    ] o.a.s.c.SolrCore [collection1] Registered new searcher Searcher@283501[collection1] main{ExitableDirectoryReader(UninvertingDirectoryReader())}
   [junit4]   2> 877758 INFO  (SUITE-StatsReloadRaceTest-seed#[819E30883BAEDC76]-worker) [    ] o.a.s.u.p.LogUpdateProcessorFactory [collection1]  webapp=null path=null params={}{add=[0 (1564448594536169472), 1 (1564448594537218048), 2 (1564448594537218049), 3 (1564448594537218050), 4 (1564448594537218051), 5 (1564448594537218052), 6 (1564448594537218053), 7 (1564448594537218054), 8 (1564448594537218055), 9 (1564448594537218056), ... (37 adds)]} 0 2
   [junit4]   2> 877759 INFO  (SUITE-StatsReloadRaceTest-seed#[819E30883BAEDC76]-worker) [    ] o.a.s.u.DirectUpdateHandler2 start commit{,optimize=false,openSearcher=true,waitSearcher=true,expungeDeletes=false,softCommit=false,prepareCommit=false}
   [junit4]   2> 877759 INFO  (SUITE-StatsReloadRaceTest-seed#[819E30883BAEDC76]-worker) [    ] o.a.s.u.SolrIndexWriter Calling setCommitData with IW:org.apache.solr.update.SolrIndexWriter@1a4a0cb commitCommandVersion:0
   [junit4]   2> 877764 INFO  (SUITE-StatsReloadRaceTest-seed#[819E30883BAEDC76]-worker) [    ] o.a.s.s.SolrIndexSearcher Opening [Searcher@1969d87[collection1] main]
   [junit4]   2> 877765 INFO  (searcherExecutor-2704-thread-1) [    ] o.a.s.c.SolrCore [collection1] Registered new searcher Searcher@1969d87[collection1] main{ExitableDirectoryReader(UninvertingDirectoryReader(Uninverting(_0(7.0.0):C37)))}
   [junit4]   2> 877803 INFO  (SUITE-StatsReloadRaceTest-seed#[819E30883BAEDC76]-worker) [    ] o.a.s.u.DirectUpdateHandler2 end_commit_flush
   [junit4]   2> 877803 INFO  (SUITE-StatsReloadRaceTest-seed#[819E30883BAEDC76]-worker) [    ] o.a.s.u.p.LogUpdateProcessorFactory [collection1]  webapp=null path=null params={}{commit=} 0 43
   [junit4]   2> 877805 INFO  (TEST-StatsReloadRaceTest.testParallelReloadAndStats-seed#[819E30883BAEDC76]) [    ] o.a.s.SolrTestCaseJ4 ###Starting testParallelReloadAndStats
   [junit4]   2> 877805 INFO  (TEST-StatsReloadRaceTest.testParallelReloadAndStats-seed#[819E30883BAEDC76]) [    ] o.a.s.h.a.CoreAdminOperation Checking request status for : 1
   [junit4]   2> 877806 INFO  (TEST-StatsReloadRaceTest.testParallelReloadAndStats-seed#[819E30883BAEDC76]) [    ] o.a.s.h.a.CoreAdminOperation Checking request status for : 1
   [junit4]   2> 877806 INFO  (TEST-StatsReloadRaceTest.testParallelReloadAndStats-seed#[819E30883BAEDC76]) [    ] o.a.s.h.a.CoreAdminOperation Checking request status for : 1
   [junit4]   2> 877806 INFO  (parallelCoreAdminExecutor-2702-thread-1) [    ] o.a.s.c.SolrResourceLoader [null] Added 2 libs to classloader, from paths: [/home/jenkins/workspace/Lucene-Solr-master-Linux/solr/core/src/test-files/solr/collection1/lib, /home/jenkins/workspace/Lucene-Solr-master-Linux/solr/core/src/test-files/solr/collection1/lib/classes]
   [junit4]   2> 877812 INFO  (TEST-StatsReloadRaceTest.testParallelReloadAndStats-seed#[819E30883BAEDC76]) [    ] o.a.s.h.a.CoreAdminOperation Checking request status for : 1
   [junit4]   2> 877813 INFO  (TEST-StatsReloadRaceTest.testParallelReloadAndStats-seed#[819E30883BAEDC76]) [    ] o.a.s.h.a.CoreAdminOperation Checking request status for : 1
   [junit4]   2> 877813 INFO  (TEST-StatsReloadRaceTest.testParallelReloadAndStats-seed#[819E30883BAEDC76]) [    ] o.a.s.h.a.CoreAdminOperation Checking request status for : 1
   [junit4]   2> 877814 INFO  (TEST-StatsReloadRaceTest.testParallelReloadAndStats-seed#[819E30883BAEDC76]) [    ] o.a.s.h.a.CoreAdminOperation Checking request status for : 1
   [junit4]   2> 877814 INFO  (TEST-StatsReloadRaceTest.testParallelReloadAndStats-seed#[819E30883BAEDC76]) [    ] o.a.s.h.a.CoreAdminOperation Checking request status for : 1
   [junit4]   2> 877815 INFO  (TEST-StatsReloadRaceTest.testParallelReloadAndStats-seed#[819E30883BAEDC76]) [    ] o.a.s.h.a.CoreAdminOperation Checking request status for : 1
   [junit4]   2> 877815 INFO  (TEST-StatsReloadRaceTest.testParallelReloadAndStats-seed#[819E30883BAEDC76]) [    ] o.a.s.h.a.CoreAdminOperation Checking request status for : 1
   [junit4]   2> 877815 INFO  (TEST-StatsReloadRaceTest.testParallelReloadAndStats-seed#[819E30883BAEDC76]) [    ] o.a.s.h.a.CoreAdminOperation Checking request status for : 1
   [junit4]   2> 877815 INFO  (TEST-StatsReloadRaceTest.testParallelReloadAndStats-seed#[819E30883BAEDC76]) [    ] o.a.s.h.a.CoreAdminOperation Checking request status for : 1
   [junit4]   2> 877815 INFO  (TEST-StatsReloadRaceTest.testParallelReloadAndStats-seed#[819E30883BAEDC76]) [    ] o.a.s.h.a.CoreAdminOperation Checking request status for : 1
   [junit4]   2> 877815 INFO  (TEST-StatsReloadRaceTest.testParallelReloadAndStats-seed#[819E30883BAEDC76]) [    ] o.a.s.h.a.CoreAdminOperation Checking request status for : 1
   [junit4]   2> 877816 INFO  (TEST-StatsReloadRaceTest.testParallelReloadAndStats-seed#[819E30883BAEDC76]) [    ] o.a.s.h.a.CoreAdminOperation Checking request status for : 1
   [junit4]   2> 877816 INFO  (TEST-StatsReloadRaceTest.testParallelReloadAndStats-seed#[819E30883BAEDC76]) [    ] o.a.s.h.a.CoreAdminOperation Checking request status for : 1
   [junit4]   2> 877817 INFO  (TEST-StatsReloadRaceTest.testParallelReloadAndStats-seed#[819E30883BAEDC76]) [    ] o.a.s.h.a.CoreAdminOperation Checking request status for : 1
   [junit4]   2> 877817 INFO  (TEST-StatsReloadRaceTest.testParallelReloadAndStats-seed#[819E30883BAEDC76]) [    ] o.a.s.h.a.CoreAdminOperation Checking request status for : 1
   [junit4]   2> 877818 INFO  (TEST-StatsReloadRaceTest.testParallelReloadAndStats-seed#[819E30883BAEDC76]) [    ] o.a.s.h.a.CoreAdminOperation Checking request status for : 1
   [junit4]   2> 877819 INFO  (TEST-StatsReloadRaceTest.testParallelReloadAndStats-seed#[819E30883BAEDC76]) [    ] o.a.s.h.a.CoreAdminOperation Checking request status for : 1
   [junit4]   2> 877819 INFO  (TEST-StatsReloadRaceTest.testParallelReloadAndStats-seed#[819E30883BAEDC76]) [    ] o.a.s.h.a.CoreAdminOperation Checking request status for : 1
   [junit4]   2> 877820 INFO  (TEST-StatsReloadRaceTest.testParallelReloadAndStats-seed#[819E30883BAEDC76]) [    ] o.a.s.h.a.CoreAdminOperation Checking request status for : 1
   [junit4]   2> 877820 INFO  (TEST-StatsReloadRaceTest.testParallelReloadAndStats-seed#[819E30883BAEDC76]) [    ] o.a.s.h.a.CoreAdminOperation Checking request status for : 1
   [junit4]   2> 877820 INFO  (TEST-StatsReloadRaceTest.testParallelReloadAndStats-seed#[819E30883BAEDC76]) [    ] o.a.s.h.a.CoreAdminOperation Checking request status for : 1
   [junit4]   2> 877820 INFO  (TEST-StatsReloadRaceTest.testParallelReloadAndStats-seed#[819E30883BAEDC76]) [    ] o.a.s.h.a.CoreAdminOperation Checking request status for : 1
   [junit4]   2> 877820 INFO  (TEST-StatsReloadRaceTest.testParallelReloadAndStats-seed#[819E30883BAEDC76]) [    ] o.a.s.h.a.CoreAdminOperation Checking request status for : 1
   [junit4]   2> 877821 INFO  (TEST-StatsReloadRaceTest.testParallelReloadAndStats-seed#[819E30883BAEDC76]) [    ] o.a.s.h.a.CoreAdminOperation Checking request status for : 1
   [junit4]   2> 877821 INFO  (TEST-StatsReloadRaceTest.testParallelReloadAndStats-seed#[819E30883BAEDC76]) [    ] o.a.s.h.a.CoreAdminOperation Checking request status for : 1
   [junit4]   2> 877822 INFO  (TEST-StatsReloadRaceTest.testParallelReloadAndStats-seed#[819E30883BAEDC76]) [    ] o.a.s.h.a.CoreAdminOperation Checking request status for : 1
   [junit4]   2> 877822 INFO  (TEST-StatsReloadRaceTest.testParallelReloadAndStats-seed#[819E30883BAEDC76]) [    ] o.a.s.h.a.CoreAdminOperation Checking request status for : 1
   [junit4]   2> 877822 INFO  (TEST-StatsReloadRaceTest.testParallelReloadAndStats-seed#[819E30883BAEDC76]) [    ] o.a.s.h.a.CoreAdminOperation Checking request status for : 1
   [junit4]   2> 877823 INFO  (TEST-StatsReloadRaceTest.testParallelReloadAndStats-seed#[819E30883BAEDC76]) [    ] o.a.s.h.a.CoreAdminOperation Checking request status for : 1
   [junit4]   2> 877824 INFO  (TEST-StatsReloadRaceTest.testParallelReloadAndStats-seed#[819E30883BAEDC76]) [    ] o.a.s.h.a.CoreAdminOperation Checking request status for : 1
   [junit4]   2> 877825 INFO  (TEST-StatsReloadRaceTest.testParallelReloadAndStats-seed#[819E30883BAEDC76]) [    ] o.a.s.h.a.CoreAdminOperation Checking request status for : 1
   [junit4]   2> 877826 INFO  (TEST-StatsReloadRaceTest.testParallelReloadAndStats-seed#[819E30883BAEDC76]) [    ] o.a.s.h.a.CoreAdminOperation Checking request status for : 1
   [junit4]   2> 877826 INFO  (TEST-StatsReloadRaceTest.testParallelReloadAndStats-seed#[819E30883BAEDC76]) [    ] o.a.s.h.a.CoreAdminOperation Checking request status for : 1
   [junit4]   2> 877827 INFO  (TEST-StatsReloadRaceTest.testParallelReloadAndStats-seed#[819E30883BAEDC76]) [    ] o.a.s.h.a.CoreAdminOperation Checking request status for : 1
   [junit4]   2> 877827 INFO  (TEST-StatsReloadRaceTest.testParallelReloadAndStats-seed#[819E30883BAEDC76]) [    ] o.a.s.h.a.CoreAdminOperation Checking request status for : 1
   [junit4]   2> 877828 INFO  (TEST-StatsReloadRaceTest.testParallelReloadAndStats-seed#[819E30883BAEDC76]) [    ] o.a.s.h.a.CoreAdminOperation Checking request status for : 1
   [junit4]   2> 877828 INFO  (TEST-StatsReloadRaceTest.testParallelReloadAndStats-seed#[819E30883BAEDC76]) [    ] o.a.s.h.a.CoreAdminOperation Checking request status for : 1
   [junit4]   2> 877829 INFO  (TEST-StatsReloadRaceTest.testParallelReloadAndStats-seed#[819E30883BAEDC76]) [    ] o.a.s.h.a.CoreAdminOperation Checking request status for : 1
   [junit4]   2> 877829 INFO  (TEST-StatsReloadRaceTest.testParallelReloadAndStats-seed#[819E30883BAEDC76]) [    ] o.a.s.h.a.CoreAdminOperation Checking request status for : 1
   [junit4]   2> 877829 INFO  (TEST-StatsReloadRaceTest.testParallelReloadAndStats-seed#[819E30883BAEDC76]) [    ] o.a.s.h.a.CoreAdminOperation Checking request status for : 1
   [junit4]   2> 877830 INFO  (TEST-StatsReloadRaceTest.testParallelReloadAndStats-seed#[819E30883BAEDC76]) [    ] o.a.s.h.a.CoreAdminOperation Checking request status for : 1
   [junit4]   2> 877830 INFO  (TEST-StatsReloadRaceTest.testParallelReloadAndStats-seed#[819E30883BAEDC76]) [    ] o.a.s.h.a.CoreAdminOperation Checking request status for : 1
   [junit4]   2> 877830 INFO  (TEST-StatsReloadRaceTest.testParallelReloadAndStats-seed#[819E30883BAEDC76]) [    ] o.a.s.h.a.CoreAdminOperation Checking request status for : 1
   [junit4]   2> 877831 INFO  (TEST-StatsReloadRaceTest.testParallelReloadAndStats-seed#[819E30883BAEDC76]) [    ] o.a.s.h.a.CoreAdminOperation Checking request status for : 1
   [junit4]   2> 877831 INFO  (TEST-StatsReloadRaceTest.testParallelReloadAndStats-seed#[819E30883BAEDC76]) [    ] o.a.s.h.a.CoreAdminOperation Checking request status for : 1
   [junit4]   2> 877832 INFO  (TEST-StatsReloadRaceTest.testParallelReloadAndStats-seed#[819E30883BAEDC76]) [    ] o.a.s.h.a.CoreAdminOperation Checking request status for : 1
   [junit4]   2> 877832 INFO  (TEST-StatsReloadRaceTest.testParallelReloadAndStats-seed#[819E30883BAEDC76]) [    ] o.a.s.h.a.CoreAdminOperation Checking request status for : 1
   [junit4]   2> 877832 INFO  (TEST-StatsReloadRaceTest.testParallelReloadAndStats-seed#[819E30883BAEDC76]) [    ] o.a.s.h.a.CoreAdminOperation Checking request status for : 1
   [junit4]   2> 877833 INFO  (TEST-StatsReloadRaceTest.testParallelReloadAndStats-seed#[819E30883BAEDC76]) [    ] o.a.s.h.a.CoreAdminOperation Checking request status for : 1
   [junit4]   2> 877833 INFO  (TEST-StatsReloadRaceTest.testParallelReloadAndStats-seed#[819E30883BAEDC76]) [    ] o.a.s.h.a.CoreAdminOperation Checking request status for : 1
   [junit4]   2> 877833 INFO  (TEST-StatsReloadRaceTest.testParallelReloadAndStats-seed#[819E30883BAEDC76]) [    ] o.a.s.h.a.CoreAdminOperation Checking request status for : 1
   [junit4]   2> 877833 INFO  (TEST-StatsReloadRaceTest.testParallelReloadAndStats-seed#[819E30883BAEDC76]) [    ] o.a.s.h.a.CoreAdminOperation Checking request status for : 1
   [junit4]   2> 877834 INFO  (TEST-StatsReloadRaceTest.testParallelReloadAndStats-seed#[819E30883BAEDC76]) [    ] o.a.s.h.a.CoreAdminOperation Checking request status for : 1
   [junit4]   2> 877834 INFO  (TEST-StatsReloadRaceTest.testParallelReloadAndStats-seed#[819E30883BAEDC76]) [    ] o.a.s.h.a.CoreAdminOperation Checking request status for : 1
   [junit4]   2> 877834 INFO  (TEST-StatsReloadRaceTest.testParallelReloadAndStats-seed#[819E30883BAEDC76]) [    ] o.a.s.h.a.CoreAdminOperation Checking request status for : 1
   [junit4]   2> 877835 INFO  (TEST-StatsReloadRaceTest.testParallelReloadAndStats-seed#[819E30883BAEDC76]) [    ] o.a.s.h.a.CoreAdminOperation Checking request status for : 1
   [junit4]   2> 877835 INFO  (TEST-StatsReloadRaceTest.testParallelReloadAndStats-seed#[819E30883BAEDC76]) [    ] o.a.s.h.a.CoreAdminOperation Checking request status for : 1
   [junit4]   2> 877836 INFO  (TEST-StatsReloadRaceTest.testParallelReloadAndStats-seed#[819E30883BAEDC76]) [    ] o.a.s.h.a.CoreAdminOperation Checking request status for : 1
   [junit4]   2> 877837 INFO  (TEST-StatsReloadRaceTest.testParallelReloadAndStats-seed#[819E30883BAEDC76]) [    ] o.a.s.h.a.CoreAdminOperation Checking request status for : 1
   [junit4]   2> 877837 INFO  (TEST-StatsReloadRaceTest.testParallelReloadAndStats-seed#[819E30883BAEDC76]) [    ] o.a.s.h.a.CoreAdminOperation Checking request status for : 1
   [junit4]   2> 877837 INFO  (TEST-StatsReloadRaceTest.testParallelReloadAndStats-seed#[819E30883BAEDC76]) [    ] o.a.s.h.a.CoreAdminOperation Checking request status for : 1
   [junit4]   2> 877837 INFO  (TEST-StatsReloadRaceTest.testParallelReloadAndStats-seed#[819E30883BAEDC76]) [    ] o.a.s.h.a.CoreAdminOperation Checking request status for : 1
   [junit4]   2> 877837 INFO  (TEST-StatsReloadRaceTest.testParallelReloadAndStats-seed#[819E30883BAEDC76]) [    ] o.a.s.h.a.CoreAdminOperation Checking request status for : 1
   [junit4]   2> 877837 INFO  (TEST-StatsReloadRaceTest.testParallelReloadAndStats-seed#[819E30883BAEDC76]) [    ] o.a.s.h.a.CoreAdminOperation Checking request status for : 1
   [junit4]   2> 877838 INFO  (TEST-StatsReloadRaceTest.testParallelReloadAndStats-seed#[819E30883BAEDC76]) [    ] o.a.s.h.a.CoreAdminOperation Checking request status for : 1
   [junit4]   2> 877838 INFO  (TEST-StatsReloadRaceTest.testParallelReloadAndStats-seed#[819E30883BAEDC76]) [    ] o.a.s.h.a.CoreAdminOperation Checking request status for : 1
   [junit4]   2> 877839 INFO  (TEST-StatsReloadRaceTest.testParallelReloadAndStats-seed#[819E30883BAEDC76]) [    ] o.a.s.h.a.CoreAdminOperation Checking request status for : 1
   [junit4]   2> 877839 INFO  (TEST-StatsReloadRaceTest.testParallelReloadAndStats-seed#[819E30883BAEDC76]) [    ] o.a.s.h.a.CoreAdminOperation Checking request status for : 1
   [junit4]   2> 877840 INFO  (TEST-StatsReloadRaceTest.testParallelReloadAndStats-seed#[819E30883BAEDC76]) [    ] o.a.s.h.a.CoreAdminOperation Checking request status for : 1
   [junit4]   2> 877840 INFO  (TEST-StatsReloadRaceTest.testParallelReloadAndStats-seed#[819E30883BAEDC76]) [    ] o.a.s.h.a.CoreAdminOperation Checking request status for : 1
   [junit4]   2> 877840 INFO  (TEST-StatsReloadRaceTest.testParallelReloadAndStats-seed#[819E30883BAEDC76]) [    ] o.a.s.h.a.CoreAdminOperation Checking request status for : 1
   [junit4]   2> 877841 INFO  (TEST-StatsReloadRaceTest.testParallelReloadAndStats-seed#[819E30883BAEDC76]) [    ] o.a.s.h.a.CoreAdminOperation Checking request status for : 1
   [junit4]   2> 877842 INFO  (TEST-StatsReloadRaceTest.testParallelReloadAndStats-seed#[819E30883BAEDC76]) [    ] o.a.s.h.a.CoreAdminOperation Checking request status for : 1
   [junit4]   2> 877842 INFO  (TEST-StatsReloadRaceTest.testParallelReloadAndStats-seed#[819E30883BAEDC76]) [    ] o.a.s.h.a.CoreAdminOperation Checking request status for : 1
   [junit4]   2> 877843 INFO  (TEST-StatsReloadRaceTest.testParallelReloadAndStats-seed#[819E30883BAEDC76]) [    ] o.a.s.h.a.CoreAdminOperation Checking request status for : 1
   [junit4]   2> 877844 INFO  (TEST-StatsReloadRaceTest.testParallelReloadAndStats-seed#[819E30883BAEDC76]) [    ] o.a.s.h.a.CoreAdminOperation Checking request status for : 1
   [junit4]   2> 877844 INFO  (TEST-StatsReloadRaceTest.testParallelReloadAndStats-seed#[819E30883BAEDC76]) [    ] o.a.s.h.a.CoreAdminOperation Checking request status for : 1
   [junit4]   2> 877844 INFO  (TEST-StatsReloadRaceTest.testParallelReloadAndStats-seed#[819E30883BAEDC76]) [    ] o.a.s.h.a.CoreAdminOperation Checking request status for : 1
   [junit4]   2> 877845 INFO  (TEST-StatsReloadRaceTest.testParallelReloadAndStats-seed#[819E30883BAEDC76]) [    ] o.a.s.h.a.CoreAdminOperation Checking request status for : 1
   [junit4]   2> 877845 INFO  (TEST-StatsReloadRaceTest.testParallelReloadAndStats-seed#[819E30883BAEDC76]) [    ] o.a.s.h.a.CoreAdminOperation Checking request status for : 1
   [junit4]   2> 877845 INFO  (TEST-StatsReloadRaceTest.testParallelReloadAndStats-seed#[819E30883BAEDC76]) [    ] o.a.s.h.a.CoreAdminOperation Checking request status for : 1
   [junit4]   2> 877845 INFO  (TEST-StatsReloadRaceTest.testParallelReloadAndStats-seed#[819E30883BAEDC76]) [    ] o.a.s.h.a.CoreAdminOperation Checking request status for : 1
   [junit4]   2> 877846 INFO  (TEST-StatsReloadRaceTest.testParallelReloadAndStats-seed#[819E30883BAEDC76]) [    ] o.a.s.h.a.CoreAdminOperation Checking request status for : 1
   [junit4]   2> 877846 INFO  (TEST-StatsReloadRaceTest.testParallelReloadAndStats-seed#[819E30883BAEDC76]) [    ] o.a.s.h.a.CoreAdminOperation Checking request status for : 1
   [junit4]   2> 877846 INFO  (TEST-StatsReloadRaceTest.testParallelReloadAndStats-seed#[819E30883BAEDC76]) [    ] o.a.s.h.a.CoreAdminOperation Checking request status for : 1
   [junit4]   2> 877847 INFO  (TEST-StatsReloadRaceTest.testParallelReloadAndStats-seed#[819E30883BAEDC76]) [    ] o.a.s.h.a.CoreAdminOperation Checking request status for : 1
   [junit4]   2> 877847 INFO  (TEST-StatsReloadRaceTest.testParallelReloadAndStats-seed#[819E30883BAEDC76]) [    ] o.a.s.h.a.CoreAdminOperation Checking request status for : 1
   [junit4]   2> 877848 INFO  (TEST-StatsReloadRaceTest.testParallelReloadAndStats-seed#[819E30883BAEDC76]) [    ] o.a.s.h.a.CoreAdminOperation Checking request status for : 1
   [junit4]   2> 877849 INFO  (TEST-StatsReloadRaceTest.testParallelReloadAndStats-seed#[819E30883BAEDC76]) [    ] o.a.s.h.a.CoreAdminOperation Checking request status for : 1
   [junit4]   2> 877849 INFO  (TEST-StatsReloadRaceTest.testParallelReloadAndStats-seed#[819E30883BAEDC76]) [    ] o.a.s.h.a.CoreAdminOperation Checking request status for : 1
   [junit4]   2> 877849 INFO  (TEST-StatsReloadRaceTest.testParallelReloadAndStats-seed#[819E30883BAEDC76]) [    ] o.a.s.h.a.CoreAdminOperation Checking request status for : 1
   [junit4]   2> 877850 INFO  (TEST-StatsReloadRaceTest.testParallelReloadAndStats-seed#[819E30883BAEDC76]) [    ] o.a.s.h.a.CoreAdminOperation Checking request status for : 1
   [junit4]   2> 877851 INFO  (TEST-StatsReloadRaceTest.testParallelReloadAndStats-seed#[819E30883BAEDC76]) [    ] o.a.s.h.a.CoreAdminOperation Checking request status for : 1
   [junit4]   2> 877851 INFO  (TEST-StatsReloadRaceTest.testParallelReloadAndStats-seed#[819E30883BAEDC76]) [    ] o.a.s.h.a.CoreAdminOperation Checking request status for : 1
   [junit4]   2> 877852 INFO  (TEST-StatsReloadRaceTest.testParallelReloadAndStats-seed#[819E30883BAEDC76]) [    ] o.a.s.h.a.CoreAdminOperation Checking request status for : 1
   [junit4]   2> 877853 INFO  (TEST-StatsReloadRaceTest.testParallelReloadAndStats-seed#[819E30883BAEDC76]) [    ] o.a.s.h.a.CoreAdminOperation Checking request status for : 1
   [junit4]   2> 877855 INFO  (TEST-StatsReloadRaceTest.testParallelReloadAndStats-seed#[819E30883BAEDC76]) [    ] o.a.s.h.a.CoreAdminOperation Checking request status for : 1
   [junit4]   2> 877855 INFO  (TEST-StatsReloadRaceTest.testParallelReloadAndStats-seed#[819E30883BAEDC76]) [    ] o.a.s.h.a.CoreAdminOperation Checking request status for : 1
   [junit4]   2> 877855 INFO  (TEST-StatsReloadRaceTest.testParallelReloadAndStats-seed#[819E30883BAEDC76]) [    ] o.a.s.h.a.CoreAdminOperation Checking request status for : 1
   [junit4]   2> 877856 INFO  (TEST-StatsReloadRaceTest.testParallelReloadAndStats-seed#[819E30883BAEDC76]) [    ] o.a.s.h.a.CoreAdminOperation Checking request status for : 1
   [junit4]   2> 877856 INFO  (TEST-StatsReloadRaceTest.testParallelReloadAndStats-seed#[819E30883BAEDC76]) [    ] o.a.s.h.a.CoreAdminOperation Checking request status for : 1
   [junit4]   2> 877857 INFO  (TEST-StatsReloadRaceTest.testParallelReloadAndStats-seed#[819E30883BAEDC76]) [    ] o.a.s.h.a.CoreAdminOperation Checking request status for : 1
   [junit4]   2> 877857 INFO  (TEST-StatsReloadRaceTest.testParallelReloadAndStats-seed#[819E30883BAEDC76]) [    ] o.a.s.h.a.CoreAdminOperation Checking request status for : 1
   [junit4]   2> 877858 INFO  (TEST-StatsReloadRaceTest.testParallelReloadAndStats-seed#[819E30883BAEDC76]) [    ] o.a.s.h.a.CoreAdminOperation Checking request status for : 1
   [junit4]   2> 877858 INFO  (TEST-StatsReloadRaceTest.testParallelReloadAndStats-seed#[819E30883BAEDC76]) [    ] o.a.s.h.a.CoreAdminOperation Checking request status for : 1
   [junit4]   2> 877858 INFO  (TEST-StatsReloadRaceTest.testParallelReloadAndStats-seed#[819E30883BAEDC76]) [    ] o.a.s.h.a.CoreAdminOperation Checking request status for : 1
   [junit4]   2> 877859 INFO  (TEST-StatsReloadRaceTest.testParallelReloadAndStats-seed#[819E30883BAEDC76]) [    ] o.a.s.h.a.CoreAdminOperation Checking request status for : 1
   [junit4]   2> 877876 INFO  (TEST-StatsReloadRaceTest.testParallelReloadAndStats-seed#[819E30883BAEDC76]) [    ] o.a.s.h.a.CoreAdminOperation Checking request status for : 1
   [junit4]   2> 877876 INFO  (TEST-StatsReloadRaceTest.testParallelReloadAndStats-seed#[819E30883BAEDC76]) [    ] o.a.s.h.a.CoreAdminOperation Checking request status for : 1
   [junit4]   2> 877877 INFO  (TEST-StatsReloadRaceTest.testParallelReloadAndStats-seed#[819E30883BAEDC76]) [    ] o.a.s.h.a.CoreAdminOperation Checking request status for : 1
   [junit4]   2> 877877 INFO  (TEST-StatsReloadRaceTest.testParallelReloadAndStats-seed#[819E30883BAEDC76]) [    ] o.a.s.h.a.CoreAdminOperation Checking request status for : 1
   [junit4]   2> 877878 INFO  (TEST-StatsReloadRaceTest.testParallelReloadAndStats-seed#[819E30883BAEDC76]) [    ] o.a.s.h.a.CoreAdminOperation Checking request status for : 1
   [junit4]   2> 877879 INFO  (TEST-StatsReloadRaceTest.testParallelReloadAndStats-seed#[819E30883BAEDC76]) [    ] o.a.s.h.a.CoreAdminOperation Checking request status for : 1
   [junit4]   2> 877879 INFO  (TEST-StatsReloadRaceTest.testParallelReloadAndStats-seed#[819E30883BAEDC76]) [    ] o.a.s.h.a.CoreAdminOperation Checking request status for : 1
   [junit4]   2> 877879 INFO  (TEST-StatsReloadRaceTest.testParallelReloadAndStats-seed#[819E30883BAEDC76]) [    ] o.a.s.h.a.CoreAdminOperation Checking request status for : 1
   [junit4]   2> 877880 INFO  (TEST-StatsReloadRaceTest.testParallelReloadAndStats-seed#[819E30883BAEDC76]) [    ] o.a.s.h.a.CoreAdminOperation Checking request status for : 1
   [junit4]   2> 877881 INFO  (TEST-StatsReloadRaceTest.testParallelReloadAndStats-seed#[819E30883BAEDC76]) [    ] o.a.s.h.a.CoreAdminOperation Checking request status for : 1
   [junit4]   2> 877881 INFO  (TEST-StatsReloadRaceTest.testParallelReloadAndStats-seed#[819E30883BAEDC76]) [    ] o.a.s.h.a.CoreAdminOperation Checking request status for : 1
   [junit4]   2> 877882 INFO  (TEST-StatsReloadRaceTest.testParallelReloadAndStats-seed#[819E30883BAEDC76]) [    ] o.a.s.h.a.CoreAdminOperation Checking request status for : 1
   [junit4]   2> 877882 INFO  (TEST-StatsReloadRaceTest.testParallelReloadAndStats-seed#[819E30883BAEDC76]) [    ] o.a.s.h.a.CoreAdminOperation Checking request status for : 1
   [junit4]   2> 877883 INFO  (TEST-StatsReloadRaceTest.testParallelReloadAndStats-seed#[819E30883BAEDC76]) [    ] o.a.s.h.a.CoreAdminOperation Checking request status for : 1
   [junit4]   2> 877883 INFO  (TEST-StatsReloadRaceTest.testParallelReloadAndStats-seed#[819E30883BAEDC76]) [    ] o.a.s.h.a.CoreAdminOperation Checking request status for : 1
   [junit4]   2> 877883 INFO  (TEST-StatsReloadRaceTest.testParallelReloadAndStats-seed#[819E30883BAEDC76]) [    ] o.a.s.h.a.CoreAdminOperation Checking request status for : 1
   [junit4]   2> 877883 INFO  (TEST-StatsReloadRaceTest.testParallelReloadAndStats-seed#[819E30883BAEDC76]) [    ] o.a.s.h.a.CoreAdminOperation Checking request status for : 1
   [junit4]   2> 877883 INFO  (TEST-StatsReloadRaceTest.testParallelReloadAndStats-seed#[819E30883BAEDC76]) [    ] o.a.s.h.a.CoreAdminOperation Checking request status for : 1
   [junit4]   2> 877884 INFO  (TEST-StatsReloadRaceTest.testParallelReloadAndStats-seed#[819E30883BAEDC76]) [    ] o.a.s.h.a.CoreAdminOperation Checking request status for : 1
   [junit4]   2> 877884 INFO  (TEST-StatsReloadRaceTest.testParallelReloadAndStats-seed#[819E30883BAEDC76]) [    ] o.a.s.h.a.CoreAdminOperation Checking request status for : 1
   [junit4]   2> 877884 INFO  (TEST-StatsReloadRaceTest.testParallelReloadAndStats-seed#[819E30883BAEDC76]) [    ] o.a.s.h.a.CoreAdminOperation Checking request status for : 1
   [junit4]   2> 877884 INFO  (TEST-StatsReloadRaceTest.testParallelReloadAndStats-seed#[819E30883BAEDC76]) [    ] o.a.s.h.a.CoreAdminOperation Checking request status for : 1
   [junit4]   2> 877885 INFO  (TEST-StatsReloadRaceTest.testParallelReloadAndStats-seed#[819E30883BAEDC76]) [    ] o.a.s.h.a.CoreAdminOperation Checking request status for : 1
   [junit4]   2> 877885 INFO  (TEST-StatsReloadRaceTest.testParallelReloadAndStats-seed#[819E30883BAEDC76]) [    ] o.a.s.h.a.CoreAdminOperation Checking request status for : 1
   [junit4]   2> 877885 INFO  (TEST-StatsReloadRaceTest.testParallelReloadAndStats-seed#[819E30883BAEDC76]) [    ] o.a.s.h.a.CoreAdminOperation Checking request status for : 1
   [junit4]   2> 877886 INFO  (TEST-StatsReloadRaceTest.testParallelReloadAndStats-seed#[819E30883BAEDC76]) [    ] o.a.s.h.a.CoreAdminOperation Checking request status for : 1
   [junit4]   2> 877886 INFO  (TEST-StatsReloadRaceTest.testParallelReloadAndStats-seed#[819E30883BAEDC76]) [    ] o.a.s.h.a.CoreAdminOperation Checking request status for : 1
   [junit4]   2> 877887 INFO  (TEST-StatsReloadRaceTest.testParallelReloadAndStats-seed#[819E30883BAEDC76]) [    ] o.a.s.h.a.CoreAdminOperation Checking request status for : 1
   [junit4]   2> 877887 INFO  (TEST-StatsReloadRaceTest.testParallelReloadAndStats-seed#[819E30883BAEDC76]) [    ] o.a.s.h.a.CoreAdminOperation Checking request status for : 1
   [junit4]   2> 877887 INFO  (TEST-StatsReloadRaceTest.testParallelReloadAndStats-seed#[819E30883BAEDC76]) [    ] o.a.s.h.a.CoreAdminOperation Checking request status for : 1
   [junit4]   2> 877888 INFO  (TEST-StatsReloadRaceTest.testParallelReloadAndStats-seed#[819E30883BAEDC76]) [    ] o.a.s.h.a.CoreAdminOperation Checking request status for : 1
   [junit4]   2> 877888 INFO  (TEST-StatsReloadRaceTest.testParallelReloadAndStats-seed#[819E30883BAEDC76]) [    ] o.a.s.h.a.CoreAdminOperation Checking request status for : 1
   [junit4]   2> 877889 INFO  (TEST-StatsReloadRaceTest.testParallelReloadAndStats-seed#[819E30883BAEDC76]) [    ] o.a.s.h.a.CoreAdminOperation Checking request status for : 1
   [junit4]   2> 877889 INFO  (TEST-StatsReloadRaceTest.testParallelReloadAndStats-seed#[819E30883BAEDC76]) [    ] o.a.s.h.a.CoreAdminOperation Checking request status for : 1
   [junit4]   2> 877889 INFO  (TEST-StatsReloadRaceTest.testParallelReloadAndStats-seed#[819E30883BAEDC76]) [    ] o.a.s.h.a.CoreAdminOperation Checking request status for : 1
   [junit4]   2> 877889 INFO  (TEST-StatsReloadRaceTest.testParallelReloadAndStats-seed#[819E30883BAEDC76]) [    ] o.a.s.h.a.CoreAdminOperation Checking request status for : 1
   [junit4]   2> 877890 INFO  (TEST-StatsReloadRaceTest.testParallelReloadAndStats-seed#[819E30883BAEDC76]) [    ] o.a.s.h.a.CoreAdminOperation Checking request status for : 1
   [junit4]   2> 877890 INFO  (TEST-StatsReloadRaceTest.testParallelReloadAndStats-seed#[819E30883BAEDC76]) [    ] o.a.s.h.a.CoreAdminOperation Checking request status for : 1
   [junit4]   2> 877891 INFO  (TEST-StatsReloadRaceTest.testParallelReloadAndStats-seed#[819E30883BAEDC76]) [    ] o.a.s.h.a.CoreAdminOperation Checking request status for : 1
   [junit4]   2> 877891 INFO  (TEST-StatsReloadRaceTest.testParallelReloadAndStats-seed#[819E30883BAEDC76]) [    ] o.a.s.h.a.CoreAdminOperation Checking request status for : 1
   [junit4]   2> 877892 INFO  (TEST-StatsReloadRaceTest.testParallelReloadAndStats-seed#[819E30883BAEDC76]) [    ] o.a.s.h.a.CoreAdminOperation Checking request status for : 1
   [junit4]   2> 877892 INFO  (TEST-StatsReloadRaceTest.testParallelReloadAndStats-seed#[819E30883BAEDC76]) [    ] o.a.s.h.a.CoreAdminOperation Checking request status for : 1
   [junit4]   2> 877892 INFO  (TEST-StatsReloadRaceTest.testParallelReloadAndStats-seed#[819E30883BAEDC76]) [    ] o.a.s.h.a.CoreAdminOperation Checking request status for : 1
   [junit4]   2> 877893 INFO  (TEST-StatsReloadRaceTest.testParallelReloadAndStats-seed#[819E30883BAEDC76]) [    ] o.a.s.h.a.CoreAdminOperation Checking request status for : 1
   [junit4]   2> 877893 INFO  (TEST-StatsReloadRaceTest.testParallelReloadAndStats-seed#[819E30883BAEDC76]) [    ] o.a.s.h.a.CoreAdminOperation Checking request status for : 1
   [junit4]   2> 877893 INFO  (TEST-StatsReloadRaceTest.testParallelReloadAndStats-seed#[819E30883BAEDC76]) [    ] o.a.s.h.a.CoreAdminOperation Checking request status for : 1
   [junit4]   2> 877893 INFO  (TEST-StatsReloadRaceTest.testParallelReloadAndStats-seed#[819E30883BAEDC76]) [    ] o.a.s.h.a.CoreAdminOperation Checking request status for : 1
   [junit4]   2> 877893 INFO  (TEST-StatsReloadRaceTest.testParallelReloadAndStats-seed#[819E30883BAEDC76]) [    ] o.a.s.h.a.CoreAdminOperation Checking request status for : 1
   [junit4]   2> 877894 INFO  (TEST-StatsReloadRaceTest.testParallelReloadAndStats-seed#[819E30883BAEDC76]) [    ] o.a.s.h.a.CoreAdminOperation Checking request status for : 1
   [junit4]   2> 877894 INFO  (TEST-StatsReloadRaceTest.testParallelReloadAndStats-seed#[819E30883BAEDC76]) [    ] o.a.s.h.a.CoreAdminOperation Checking request status for : 1
   [junit4]   2> 877894 INFO  (TEST-StatsReloadRaceTest.testParallelReloadAndStats-seed#[819E30883BAEDC76]) [    ] o.a.s.h.a.CoreAdminOperation Checking request status for : 1
   [junit4]   2> 877895 INFO  (TEST-StatsReloadRaceTest.testParallelReloadAndStats-seed#[819E30883BAEDC76]) [    ] o.a.s.h.a.CoreAdminOperation Checking request status for : 1
   [junit4]   2> 877895 WARN  (parallelCoreAdminExecutor-2702-thread-1) [    ] o.a.s.c.Config Beginning with Solr 5.5, <mergePolicy> is deprecated, use <mergePolicyFactory> instead.
   [junit4]   2> 877895 INFO  (TEST-StatsReloadRaceTest.testParallelReloadAndStats-seed#[819E30883BAEDC76]) [    ] o.a.s.h.a.CoreAdminOperation Checking request status for : 1
   [junit4]   2> 877896 INFO  (TEST-StatsReloadRaceTest.testParallelReloadAndStats-seed#[819E30883BAEDC76]) [    ] o.a.s.h.a.CoreAdminOperation Checking request status for : 1
   [junit4]   2> 877896 INFO  (parallelCoreAdminExecutor-2702-thread-1) [    ] o.a.s.c.SolrConfig Using Lucene MatchVersion: 7.0.0
   [junit4]   2> 877896 INFO  (TEST-StatsReloadRaceTest.testParallelReloadAndStats-seed#[819E30883BAEDC76]) [    ] o.a.s.h.a.CoreAdminOperation Checking request status for : 1
   [junit4]   2> 877897 INFO  (TEST-StatsReloadRaceTest.testParallelReloadAndStats-seed#[819E30883BAEDC76]) [    ] o.a.s.h.a.CoreAdminOperation Checking request status for : 1
   [junit4]   2> 877897 INFO  (TEST-StatsReloadRaceTest.testParallelReloadAndStats-seed#[819E30883BAEDC76]) [    ] o.a.s.h.a.CoreAdminOperation Checking request status for : 1
   [junit4]   2> 877897 INFO  (TEST-StatsReloadRaceTest.testParallelReloadAndStats-seed#[819E30883BAEDC76]) [    ] o.a.s.h.a.CoreAdminOperation Checking request status for : 1
   [junit4]   2> 877897 INFO  (TEST-StatsReloadRaceTest.testParallelReloadAndStats-seed#[819E30883BAEDC76]) [    ] o.a.s.h.a.CoreAdminOperation Checking request status for : 1
   [junit4]   2> 877897 INFO  (TEST-StatsReloadRaceTest.testParallelReloadAndStats-seed#[819E30883BAEDC76]) [    ] o.a.s.h.a.CoreAdminOperation Checking request status for : 1
   [junit4]   2> 877897 INFO  (TEST-StatsReloadRaceTest.testParallelReloadAndStats-seed#[819E30883BAEDC76]) [    ] o.a.s.h.a.CoreAdminOperation Checking request status for : 1
   [junit4]   2> 877897 INFO  (TEST-StatsReloadRaceTest.testParallelReloadAndStats-seed#[819E30883BAEDC76]) [    ] o.a.s.h.a.CoreAdminOperation Checking request status for : 1
   [junit4]   2> 877898 INFO  (TEST-StatsReloadRaceTest.testParallelReloadAndStats-seed#[819E30883BAEDC76]) [    ] o.a.s.h.a.CoreAdminOperation Checking request status for : 1
   [junit4]   2> 877898 INFO  (TEST-StatsReloadRaceTest.testParallelReloadAndStats-seed#[819E30883BAEDC76]) [    ] o.a.s.h.a.CoreAdminOperation Checking request status for : 1
   [junit4]   2> 877898 INFO  (TEST-StatsReloadRaceTest.testParallelReloadAndStats-seed#[819E30883BAEDC76]) [    ] o.a.s.h.a.CoreAdminOperation Checking request status for : 1
   [junit4]   2> 877898 INFO  (TEST-StatsReloadRaceTest.testParallelReloadAndStats-seed#[819E30883BAEDC76]) [    ] o.a.s.h.a.CoreAdminOperation Checking request status for : 1
   [junit4]   2> 877899 INFO  (TEST-StatsReloadRaceTest.testParallelReloadAndStats-seed#[819E30883BAEDC76]) [    ] o.a.s.h.a.CoreAdminOperation Checking request status for : 1
   [junit4]   2> 877899 INFO  (TEST-StatsReloadRaceTest.testParallelReloadAndStats-seed#[819E30883BAEDC76]) [    ] o.a.s.h.a.CoreAdminOperation Checking request status for : 1
   [junit4]   2> 877900 INFO  (TEST-StatsReloadRaceTest.testParallelReloadAndStats-seed#[819E30883BAEDC76]) [    ] o.a.s.h.a.CoreAdminOperation Checking request status for : 1
   [junit4]   2> 877900 INFO  (TEST-StatsReloadRaceTest.testParallelReloadAndStats-seed#[819E30883BAEDC76]) [    ] o.a.s.h.a.CoreAdminOperation Checking request status for : 1
   [junit4]   2> 877900 INFO  (TEST-StatsReloadRaceTest.testParallelReloadAndStats-seed#[819E30883BAEDC76]) [    ] o.a.s.h.a.CoreAdminOperation Checking request status for : 1
   [junit4]   2> 877900 INFO  (TEST-StatsReloadRaceTest.testParallelReloadAndStats-seed#[819E30883BAEDC76]) [    ] o.a.s.h.a.CoreAdminOperation Checking request status for : 1
   [junit4]   2> 877900 INFO  (TEST-StatsReloadRaceTest.testParallelReloadAndStats-seed#[819E30883BAEDC76]) [    ] o.a.s.h.a.CoreAdminOperation Checking request status for : 1
   [junit4]   2> 877900 INFO  (TEST-StatsReloadRaceTest.testParallelReloadAndStats-seed#[819E30883BAEDC76]) [    ] o.a.s.h.a.CoreAdminOperation Checking request status for : 1
   [junit4]   2> 877900 INFO  (TEST-StatsReloadRaceTest.testParallelReloadAndStats-seed#[819E30883BAEDC76]) [    ] o.a.s.h.a.CoreAdminOperation Checking request status for : 1
   [junit4]   2> 877901 INFO  (TEST-StatsReloadRaceTest.testParallelReloadAndStats-seed#[819E30883BAEDC76]) [    ] o.a.s.h.a.CoreAdminOperation Checking request status for : 1
   [junit4]   2> 877901 INFO  (TEST-StatsReloadRaceTest.testParallelReloadAndStats-seed#[819E30883BAEDC76]) [    ] o.a.s.h.a.CoreAdminOperation Checking request status for : 1
   [junit4]   2> 877901 INFO  (TEST-StatsReloadRaceTest.testParallelReloadAndStats-seed#[819E30883BAEDC76]) [    ] o.a.s.h.a.CoreAdminOperation Checking request status for : 1
   [junit4]   2> 877901 INFO  (TEST-StatsReloadRaceTest.testParallelReloadAndStats-seed#[819E30883BAEDC76]) [    ] o.a.s.h.a.CoreAdminOperation Checking request status for : 1
   [junit4]   2> 877901 INFO  (TEST-StatsReloadRaceTest.testParallelReloadAndStats-seed#[819E30883BAEDC76]) [    ] o.a.s.h.a.CoreAdminOperation Checking request status for : 1
   [junit4]   2> 877902 INFO  (TEST-StatsReloadRaceTest.testParallelReloadAndStats-seed#[819E30883BAEDC76]) [    ] o.a.s.h.a.CoreAdminOperation Checking request status for : 1
   [junit4]   2> 877903 INFO  (TEST-StatsReloadRaceTest.testParallelReloadAndStats-seed#[819E30883BAEDC76]) [    ] o.a.s.h.a.CoreAdminOperation Checking request status for : 1
   [junit4]   2> 877903 INFO  (TEST-StatsReloadRaceTest.testParallelReloadAndStats-seed#[819E30883BAEDC76]) [    ] o.a.s.h.a.CoreAdminOperation Checking request status for : 1
   [junit4]   2> 877903 INFO  (TEST-StatsReloadRaceTest.testParallelReloadAndStats-seed#[819E30883BAEDC76]) [    ] o.a.s.h.a.CoreAdminOperation Checking request status for : 1
   [junit4]   2> 877903 INFO  (TEST-StatsReloadRaceTest.testParallelReloadAndStats-seed#[819E30883BAEDC76]) [    ] o.a.s.h.a.CoreAdminOperation Checking request status for : 1
   [junit4]   2> 877904 INFO  (TEST-StatsReloadRaceTest.testParallelReloadAndStats-seed#[819E30883BAEDC76]) [    ] o.a.s.h.a.CoreAdminOperation Checking request status for : 1
   [junit4]   2> 877904 INFO  (TEST-StatsReloadRaceTest.testParallelReloadAndStats-seed#[819E30883BAEDC76]) [    ] o.a.s.h.a.CoreAdminOperation Checking request status for : 1
   [junit4]   2> 877905 INFO  (TEST-StatsReloadRaceTest.testParallelReloadAndStats-seed#[819E30883BAEDC76]) [    ] o.a.s.h.a.CoreAdminOperation Checking request status for : 1
   [junit4]   2> 877906 INFO  (TEST-StatsReloadRaceTest.testParallelReloadAndStats-seed#[819E30883BAEDC76]) [    ] o.a.s.h.a.CoreAdminOperation Checking request status for : 1
   [junit4]   2> 877906 INFO  (TEST-StatsReloadRaceTest.testParallelReloadAndStats-seed#[819E30883BAEDC76]) [    ] o.a.s.h.a.CoreAdminOperation Checking request status for : 1
   [junit4]   2> 877906 INFO  (TEST-StatsReloadRaceTest.testParallelReloadAndStats-seed#[819E30883BAEDC76]) [    ] o.a.s.h.a.CoreAdminOperation Checking request status for : 1
   [junit4]   2> 877906 INFO  (TEST-StatsReloadRaceTest.testParallelReloadAndStats-seed#[819E30883BAEDC76]) [    ] o.a.s.h.a.CoreAdminOperation Checking request status for : 1
   [junit4]   2> 877907 INFO  (TEST-StatsReloadRaceTest.testParallelReloadAndStats-seed#[819E30883BAEDC76]) [    ] o.a.s.h.a.CoreAdminOperation Checking request status for : 1
   [junit4]   2> 877907 INFO  (TEST-StatsReloadRaceTest.testParallelReloadAndStats-seed#[819E30883BAEDC76]) [    ] o.a.s.h.a.CoreAdminOperation Checking request status for : 1
   [junit4]   2> 877907 INFO  (TEST-StatsReloadRaceTest.testParallelReloadAndStats-seed#[819E30883BAEDC76]) [    ] o.a.s.h.a.CoreAdminOperation Checking request status for : 1
   [junit4]   2> 877908 INFO  (TEST-StatsReloadRaceTest.testParallelReloadAndStats-seed#[819E30883BAEDC76]) [    ] o.a.s.h.a.CoreAdminOperation Checking request status for : 1
   [junit4]   2> 877908 INFO  (TEST-StatsReloadRaceTest.testParallelReloadAndStats-seed#[819E30883BAEDC76]) [    ] o.a.s.h.a.CoreAdminOperation Checking request status for : 1
   [junit4]   2> 877908 INFO  (TEST-StatsReloadRaceTest.testParallelReloadAndStats-seed#[819E30883BAEDC76]) [    ] o.a.s.h.a.CoreAdminOperation Checking request status for : 1
   [junit4]   2> 877909 INFO  (TEST-StatsReloadRaceTest.testParallelReloadAndStats-seed#[819E30883BAEDC76]) [    ] o.a.s.h.a.CoreAdminOperation Checking request status for : 1
   [junit4]   2> 877909 INFO  (TEST-StatsReloadRaceTest.testParallelReloadAndStats-seed#[819E30883BAEDC76]) [    ] o.a.s.h.a.CoreAdminOperation Checking request status for : 1
   [junit4]   2> 877909 INFO  (TEST-StatsReloadRaceTest.testParallelReloadAndStats-seed#[819E30883BAEDC76]) [    ] o.a.s.h.a.CoreAdminOperation Checking request status for : 1
   [junit4]   2> 877909 INFO  (TEST-StatsReloadRaceTest.testParallelReloadAndStats-seed#[819E30883BAEDC76]) [    ] o.a.s.h.a.CoreAdminOperation Checking request status for : 1
   [junit4]   2> 877910 INFO  (TEST-StatsReloadRaceTest.testParallelReloadAndStats-seed#[819E30883BAEDC76]) [    ] o.a.s.h.a.CoreAdminOperation Checking request status for : 1
   [junit4]   2> 877910 INFO  (TEST-StatsReloadRaceTest.testParallelReloadAndStats-seed#[819E30883BAEDC76]) [    ] o.a.s.h.a.CoreAdminOperation Checking request status for : 1
   [junit4]   2> 877910 INFO  (TEST-StatsReloadRaceTest.testParallelReloadAndStats-seed#[819E30883BAEDC76]) [    ] o.a.s.h.a.CoreAdminOperation Checking request status for : 1
   [junit4]   2> 877910 INFO  (TEST-StatsReloadRaceTest.testParallelReloadAndStats-seed#[819E30883BAEDC76]) [    ] o.a.s.h.a.CoreAdminOperation Checking request status for : 1
   [junit4]   2> 877911 INFO  (TEST-StatsReloadRaceTest.testParallelReloadAndStats-seed#[819E30883BAEDC76]) [    ] o.a.s.h.a.CoreAdminOperation Checking request status for : 1
   [junit4]   2> 877911 INFO  (TEST-StatsReloadRaceTest.testParallelReloadAndStats-seed#[819E30883BAEDC76]) [    ] o.a.s.h.a.CoreAdminOperation Checking request status for : 1
   [junit4]   2> 877911 INFO  (TEST-StatsReloadRaceTest.testParallelReloadAndStats-seed#[819E30883BAEDC76]) [    ] o.a.s.h.a.CoreAdminOperation Checking request status for : 1
   [junit4]   2> 877912 INFO  (TEST-StatsReloadRaceTest.testParallelReloadAndStats-seed#[819E30883BAEDC76]) [    ] o.a.s.h.a.CoreAdminOperation Checking request status for : 1
   [junit4]   2> 877912 INFO  (TEST-StatsReloadRaceTest.testParallelReloadAndStats-seed#[819E30883BAEDC76]) [    ] o.a.s.h.a.CoreAdminOperation Checking request status for : 1
   [junit4]   2> 877912 INFO  (TEST-StatsReloadRaceTest.testParallelReloadAndStats-seed#[819E30883BAEDC76]) [    ] o.a.s.h.a.CoreAdminOperation Checking request status for : 1
   [junit4]   2> 877912 INFO  (TEST-StatsReloadRaceTest.testParallelReloadAndStats-seed#[819E30883BAEDC76]) [    ] o.a.s.h.a.CoreAdminOperation Checking request status for : 1
   [junit4]   2> 877912 INFO  (TEST-StatsReloadRaceTest.testParallelReloadAndStats-seed#[819E30883BAEDC76]) [    ] o.a.s.h.a.CoreAdminOperation Checking request status for : 1
   [junit4]   2> 877913 INFO  (TEST-StatsReloadRaceTest.testParallelReloadAndStats-seed#[819E30883BAEDC76]) [    ] o.a.s.h.a.CoreAdminOperation Checking request status for : 1
   [junit4]   2> 877913 INFO  (TEST-StatsReloadRaceTest.testParallelReloadAndStats-seed#[819E30883BAEDC76]) [    ] o.a.s.h.a.CoreAdminOperation Checking request status for : 1
   [junit4]   2> 877913 INFO  (TEST-StatsReloadRaceTest.testParallelReloadAndStats-seed#[819E30883BAEDC76]) [    ] o.a.s.h.a.CoreAdminOperation Checking request status for : 1
   [junit4]   2> 877914 INFO  (TEST-StatsReloadRaceTest.testParallelReloadAndStats-seed#[819E30883BAEDC76]) [    ] o.a.s.h.a.CoreAdminOperation Checking request status for : 1
   [junit4]   2> 877914 INFO  (parallelCoreAdminExecutor-2702-thread-1) [    ] o.a.s.s.IndexSchema [collection1] Schema name=test
   [junit4]   2> 877914 INFO  (TEST-StatsReloadRaceTest.testParallelReloadAndStats-seed#[819E30883BAEDC76]) [    ] o.a.s.h.a.CoreAdminOperation Checking request status for : 1
   [junit4]   2> 877915 INFO  (TEST-StatsReloadRaceTest.testParallelReloadAndStats-seed#[819E30883BAEDC76]) [    ] o.a.s.h.a.CoreAdminOperation Checking request status for : 1
   [junit4]   2> 877915 INFO  (TEST-StatsReloadRaceTest.testParallelReloadAndStats-seed#[819E30883BAEDC76]) [    ] o.a.s.h.a.CoreAdminOperation Checking request status for : 1
   [junit4]   2> 877915 INFO  (TEST-StatsReloadRaceTest.testParallelReloadAndStats-seed#[819E30883BAEDC76]) [    ] o.a.s.h.a.CoreAdminOperation Checking request status for : 1
   [junit4]   2> 877916 INFO  (TEST-StatsReloadRaceTest.testParallelReloadAndStats-seed#[819E30883BAEDC76]) [    ] o.a.s.h.a.CoreAdminOperation Checking request status for : 1
   [junit4]   2> 877916 INFO  (TEST-StatsReloadRaceTest.testParallelReloadAndStats-seed#[819E30883BAEDC76]) [    ] o.a.s.h.a.CoreAdminOperation Checking request status for : 1
   [junit4]   2> 877916 INFO  (TEST-StatsReloadRaceTest.testParallelReloadAndStats-seed#[819E30883BAEDC76]) [    ] o.a.s.h.a.CoreAdminOperation Checking request status for : 1
   [junit4]   2> 877916 INFO  (TEST-StatsReloadRaceTest.testParallelReloadAndStats-seed#[819E30883BAEDC76]) [    ] o.a.s.h.a.CoreAdminOperation Checking request status for : 1
   [junit4]   2> 877917 INFO  (TEST-StatsReloadRaceTest.testParallelReloadAndStats-seed#[819E30883BAEDC76]) [    ] o.a.s.h.a.CoreAdminOperation Checking request status for : 1
   [junit4]   2> 877917 INFO  (TEST-StatsReloadRaceTest.testParallelReloadAndStats-seed#[819E30883BAEDC76]) [    ] o.a.s.h.a.CoreAdminOperation Checking request status for : 1
   [junit4]   2> 877917 INFO  (TEST-StatsReloadRaceTest.testParallelReloadAndStats-seed#[819E30883BAEDC76]) [    ] o.a.s.h.a.CoreAdminOperation Checking request status for : 1
   [junit4]   2> 877917 INFO  (TEST-StatsReloadRaceTest.testParallelReloadAndStats-seed#[819E30883BAEDC76]) [    ] o.a.s.h.a.CoreAdminOperation Checking request status for : 1
   [junit4]   2> 877917 INFO  (TEST-StatsReloadRaceTest.testParallelReloadAndStats-seed#[819E30883BAEDC76]) [    ] o.a.s.h.a.CoreAdminOperation Checking request status for : 1
   [junit4]   2> 877917 INFO  (TEST-StatsReloadRaceTest.testParallelReloadAndStats-seed#[819E30883BAEDC76]) [    ] o.a.s.h.a.CoreAdminOperation Checking request status for : 1
   [junit4]   2> 877917 INFO  (TEST-StatsReloadRaceTest.testParallelReloadAndStats-seed#[819E30883BAEDC76]) [    ] o.a.s.h.a.CoreAdminOperation Checking request status for : 1
   [junit4]   2> 877917 INFO  (TEST-StatsReloadRaceTest.testParallelReloadAndStats-seed#[819E30883BAEDC76]) [    ] o.a.s.h.a.CoreAdminOperation Checking request status for : 1
   [junit4]   2> 877918 INFO  (TEST-StatsReloadRaceTest.testParallelReloadAndStats-seed#[819E30883BAEDC76]) [    ] o.a.s.h.a.CoreAdminOperation Checking request status for : 1
   [junit4]   2> 877918 INFO  (TEST-StatsReloadRaceTest.testParallelReloadAndStats-seed#[819E30883BAEDC76]) [    ] o.a.s.h.a.CoreAdminOperation Checking request status for : 1
   [junit4]   2> 877918 INFO  (TEST-StatsReloadRaceTest.testParallelReloadAndStats-seed#[819E30883BAEDC76]) [    ] o.a.s.h.a.CoreAdminOperation Checking request status for : 1
   [junit4]   2> 877919 INFO  (TEST-StatsReloadRaceTest.testParallelReloadAndStats-seed#[819E30883BAEDC76]) [    ] o.a.s.h.a.CoreAdminOperation Checking request status for : 1
   [junit4]   2> 877919 INFO  (TEST-StatsReloadRaceTest.testParallelReloadAndStats-seed#[819E30883BAEDC76]) [    ] o.a.s.h.a.CoreAdminOperation Checking request status for : 1
   [junit4]   2> 877919 INFO  (TEST-StatsReloadRaceTest.testParallelReloadAndStats-seed#[819E30883BAEDC76]) [    ] o.a.s.h.a.CoreAdminOperation Checking request status for : 1
   [junit4]   2> 877919 INFO  (TEST-StatsReloadRaceTest.testParallelReloadAndStats-seed#[819E30883BAEDC76]) [    ] o.a.s.h.a.CoreAdminOperation Checking request status for : 1
   [junit4]   2> 877919 INFO  (TEST-StatsReloadRaceTest.testParallelReloadAndStats-seed#[819E30883BAEDC76]) [    ] o.a.s.h.a.CoreAdminOperation Checking request status for : 1
   [junit4]   2> 877920 INFO  (TEST-StatsReloadRaceTest.testParallelReloadAndStats-seed#[819E30883BAEDC76]) [    ] o.a.s.h.a.CoreAdminOperation Checking request status for : 1
   [junit4]   2> 877920 INFO  (TEST-StatsReloadRaceTest.testParallelReloadAndStats-seed#[819E30883BAEDC76]) [    ] o.a.s.h.a.CoreAdminOperation Checking request status for : 1
   [junit4]   2> 877920 INFO  (TEST-StatsReloadRaceTest.testParallelReloadAndStats-seed#[819E30883BAEDC76]) [    ] o.a.s.h.a.CoreAdminOperation Checking request status for : 1
   [junit4]   2> 877921 INFO  (TEST-StatsReloadRaceTest.testParallelReloadAndStats-seed#[819E30883BAEDC76]) [    ] o.a.s.h.a.CoreAdminOperation Checking request status for : 1
   [junit4]   2> 877921 INFO  (TEST-StatsReloadRaceTest.testParallelReloadAndStats-seed#[819E30883BAEDC76]) [    ] o.a.s.h.a.CoreAdminOperation Checking request status for : 1
   [junit4]   2> 877921 INFO  (TEST-StatsReloadRaceTest.testParallelReloadAndStats-seed#[819E30883BAEDC76]) [    ] o.a.s.h.a.CoreAdminOperation Checking request status for : 1
   [junit4]   2> 877921 INFO  (TEST-StatsReloadRaceTest.testParallelReloadAndStats-seed#[819E30883BAEDC76]) [    ] o.a.s.h.a.CoreAdminOperation Checking request status for : 1
   [junit4]   2> 877922 INFO  (TEST-StatsReloadRaceTest.testParallelReloadAndStats-seed#[819E30883BAEDC76]) [    ] o.a.s.h.a.CoreAdminOperation Checking request status for : 1
   [junit4]   2> 877922 INFO  (TEST-StatsReloadRaceTest.testParallelReloadAndStats-seed#[819E30883BAEDC76]) [    ] o.a.s.h.a.CoreAdminOperation Checking request status for : 1
   [junit4]   2> 877923 INFO  (TEST-StatsReloadRaceTest.testParallelReloadAndStats-seed#[819E30883BAEDC76]) [    ] o.a.s.h.a.CoreAdminOperation Checking request status for : 1
   [junit4]   2> 877923 INFO  (TEST-StatsReloadRaceTest.testParallelReloadAndStats-seed#[819E30883BAEDC76]) [    ] o.a.s.h.a.CoreAdminOperation Checking request status for : 1
   [junit4]   2> 877924 INFO  (TEST-StatsReloadRaceTest.testParallelReloadAndStats-seed#[819E30883BAEDC76]) [    ] o.a.s.h.a.CoreAdminOperation Checking request status for : 1
   [junit4]   2> 877924 INFO  (TEST-StatsReloadRaceTest.testParallelReloadAndStats-seed#[819E30883BAEDC76]) [    ] o.a.s.h.a.CoreAdminOperation Checking request status for : 1
   [junit4]   2> 877925 INFO  (TEST-StatsReloadRaceTest.testParallelReloadAndStats-seed#[819E30883BAEDC76]) [    ] o.a.s.h.a.CoreAdminOperation Checking request status for : 1
   [junit4]   2> 877925 INFO  (TEST-StatsReloadRaceTest.testParallelReloadAndStats-seed#[819E30883BAEDC76]) [    ] o.a.s.h.a.CoreAdminOperation Checking request status for : 1
   [junit4]   2> 877943 INFO  (TEST-StatsReloadRaceTest.testParallelReloadAndStats-seed#[819E30883BAEDC76]) [    ] o.a.s.h.a.CoreAdminOperation Checking request status for : 1
   [junit4]   2> 877943 INFO  (TEST-StatsReloadRaceTest.testParallelReloadAndStats-seed#[819E30883BAEDC76]) [    ] o.a.s.h.a.CoreAdminOperation Checking request status for : 1
   [junit4]   2> 877943 INFO  (TEST-StatsReloadRaceTest.testParallelReloadAndStats-seed#[819E30883BAEDC76]) [    ] o.a.s.h.a.CoreAdminOperation Checking request status for : 1
   [junit4]   2> 877943 INFO  (TEST-StatsReloadRaceTest.testParallelReloadAndStats-seed#[819E30883BAEDC76]) [    ] o.a.s.h.a.CoreAdminOperation Checking request status for : 1
   [junit4]   2> 877944 INFO  (TEST-StatsReloadRaceTest.testParallelReloadAndStats-seed#[819E30883BAEDC76]) [    ] o.a.s.h.a.CoreAdminOperation Checking request status for : 1
   [junit4]   2> 877945 INFO  (TEST-StatsReloadRaceTest.testParallelReloadAndStats-seed#[819E30883BAEDC76]) [    ] o.a.s.h.a.CoreAdminOperation Checking request status for : 1
   [junit4]   2> 877945 INFO  (TEST-StatsReloadRaceTest.testParallelReloadAndStats-seed#[819E30883BAEDC76]) [    ] o.a.s.h.a.CoreAdminOperation Checking request status for : 1
   [junit4]   2> 877945 INFO  (TEST-StatsReloadRaceTest.testParallelReloadAndStats-seed#[819E30883BAEDC76]) [    ] o.a.s.h.a.CoreAdminOperation Checking request status for : 1
   [junit4]   2> 877945 INFO  (TEST-StatsReloadRaceTest.testParallelReloadAndStats-seed#[819E30883BAEDC76]) [    ] o.a.s.h.a.CoreAdminOperation Checking request status for : 1
   [junit4]   2> 877945 INFO  (TEST-StatsReloadRaceTest.testParallelReloadAndStats-seed#[819E30883BAEDC76]) [    ] o.a.s.h.a.CoreAdminOperation Checking request status for : 1
   [junit4]   2> 877945 INFO  (TEST-StatsReloadRaceTest.testParallelReloadAndStats-seed#[819E30883BAEDC76]) [    ] o.a.s.h.a.CoreAdminOperation Checking request status for : 1
   [junit4]   2> 877946 INFO  (TEST-StatsReloadRaceTest.testParallelReloadAndStats-seed#[819E30883BAEDC76]) [    ] o.a.s.h.a.CoreAdminOperation Checking request status for : 1
   [junit4]   2> 877946 INFO  (TEST-StatsReloadRaceTest.testParallelReloadAndStats-seed#[819E30883BAEDC76]) [    ] o.a.s.h.a.CoreAdminOperation Checking request status for : 1
   [junit4]   2> 877946 INFO  (TEST-StatsReloadRaceTest.testParallelReloadAndStats-seed#[819E30883BAEDC76]) [    ] o.a.s.h.a.CoreAdminOperation Checking request status for : 1
   [junit4]   2> 877946 INFO  (TEST-StatsReloadRaceTest.testParallelReloadAndStats-seed#[819E30883BAEDC76]) [    ] o.a.s.h.a.CoreAdminOperation Checking request status for : 1
   [junit4]   2> 877947 INFO  (TEST-StatsReloadRaceTest.testParallelReloadAndStats-seed#[819E30883BAEDC76]) [    ] o.a.s.h.a.CoreAdminOperation Checking request status for : 1
   [junit4]   2> 877947 INFO  (TEST-StatsReloadRaceTest.testParallelReloadAndStats-seed#[819E30883BAEDC76]) [    ] o.a.s.h.a.CoreAdminOperation Checking request status for : 1
   [junit4]   2> 877947 INFO  (TEST-StatsReloadRaceTest.testParallelReloadAndStats-seed#[819E30883BAEDC76]) [    ] o.a.s.h.a.CoreAdminOperation Checking request status for : 1
   [junit4]   2> 877948 INFO  (TEST-StatsReloadRaceTest.testParallelReloadAndStats-seed#[819E30883BAEDC76]) [    ] o.a.s.h.a.CoreAdminOperation Checking request status for : 1
   [junit4]   2> 877948 INFO  (TEST-StatsReloadRaceTest.testParallelReloadAndStats-seed#[819E30883BAEDC76]) [    ] o.a.s.h.a.CoreAdminOperation Checking request status for : 1
   [junit4]   2> 877948 INFO  (TEST-StatsReloadRaceTest.testParallelReloadAndStats-seed#[819E30883BAEDC76]) [    ] o.a.s.h.a.CoreAdminOperation Checking request status for : 1
   [junit4]   2> 877948 INFO  (TEST-StatsReloadRaceTest.testParallelReloadAndStats-seed#[819E30883BAEDC76]) [    ] o.a.s.h.a.CoreAdminOperation Checking request status for : 1
   [junit4]   2> 877948 INFO  (TEST-StatsReloadRaceTest.testParallelReloadAndStats-seed#[819E30883BAEDC76]) [    ] o.a.s.h.a.CoreAdminOperation Checking request status for : 1
   [junit4]   2> 877948 INFO  (TEST-StatsReloadRaceTest.testParallelReloadAndStats-seed#[819E30883BAEDC76]) [    ] o.a.s.h.a.CoreAdminOperation Checking request status for : 1
   [junit4]   2> 877949 INFO  (TEST-StatsReloadRaceTest.testParallelReloadAndStats-seed#[819E30883BAEDC76]) [    ] o.a.s.h.a.CoreAdminOperation Checking request status for : 1
   [junit4]   2> 877952 INFO  (TEST-StatsReloadRaceTest.testParallelReloadAndStats-seed#[819E30883BAEDC76]) [    ] o.a.s.h.a.CoreAdminOperation Checking request status for : 1
   [junit4]   2> 877954 INFO  (TEST-StatsReloadRaceTest.testParallelReloadAndStats-seed#[819E30883BAEDC76]) [    ] o.a.s.h.a.CoreAdminOperation Checking request status for : 1
   [junit4]   2> 877955 INFO  (TEST-StatsReloadRaceTest.testParallelReloadAndStats-seed#[819E30883BAEDC76]) [    ] o.a.s.h.a.CoreAdminOperation Checking request status for : 1
   [junit4]   2> 877955 INFO  (TEST-StatsReloadRaceTest.testParallelReloadAndStats-seed#[819E30883BAEDC76]) [    ] o.a.s.h.a.CoreAdminOperation Checking request status for : 1
   [junit4]   2> 877956 INFO  (TEST-StatsReloadRaceTest.testParallelReloadAndStats-seed#[819E30883BAEDC76]) [    ] o.a.s.h.a.CoreAdminOperation Checking request status for : 1
   [junit4]   2> 877960 INFO  (TEST-StatsReloadRaceTest.testParallelReloadAndStats-seed#[819E30883BAEDC76]) [    ] o.a.s.h.a.CoreAdminOperation Checking request status for : 1
   [junit4]   2> 877961 INFO  (TEST-StatsReloadRaceTest.testParallelReloadAndStats-seed#[819E30883BAEDC76]) [    ] o.a.s.h.a.CoreAdminOperation Checking request status for : 1
   [junit4]   2> 877961 INFO  (TEST-StatsReloadRaceTest.testParallelReloadAndStats-seed#[819E30883BAEDC76]) [    ] o.a.s.h.a.CoreAdminOperation Checking request status for : 1
   [junit4]   2> 877962 INFO  (TEST-StatsReloadRaceTest.testParallelReloadAndStats-seed#[819E30883BAEDC76]) [    ] o.a.s.h.a.CoreAdminOperation Checking request status for : 1
   [junit4]   2> 877968 INFO  (TEST-StatsReloadRaceTest.testParallelReloadAndStats-seed#[819E30883BAEDC76]) [    ] o.a.s.h.a.CoreAdminOperation Checking request status for : 1
   [junit4]   2> 877969 INFO  (TEST-StatsReloadRaceTest.testParallelReloadAndStats-seed#[819E30883BAEDC76]) [    ] o.a.s.h.a.CoreAdminOperation Checking request status for : 1
   [junit4]   2> 877969 INFO  (TEST-StatsReloadRaceTest.testParallelReloadAndStats-seed#[819E30883BAEDC76]) [    ] o.a.s.h.a.CoreAdminOperation Checking request status for : 1
   [junit4]   2> 877970 INFO  (TEST-StatsReloadRaceTest.testParallelReloadAndStats-seed#[819E30883BAEDC76]) [    ] o.a.s.h.a.CoreAdminOperation Checking request status for : 1
   [junit4]   2> 877970 INFO  (TEST-StatsReloadRaceTest.testParallelReloadAndStats-seed#[819E30883BAEDC76]) [    ] o.a.s.h.a.CoreAdminOperation Checking request status for : 1
   [junit4]   2> 877970 INFO  (TEST-StatsReloadRaceTest.testParallelReloadAndStats-seed#[819E30883BAEDC76]) [    ] o.a.s.h.a.CoreAdminOperation Checking request status for : 1
   [junit4]   2> 877970 INFO  (TEST-StatsReloadRaceTest.testParallelReloadAndStats-seed#[819E30883BAEDC76]) [    ] o.a.s.h.a.CoreAdminOperation Checking request status for : 1
   [junit4]   2> 877971 INFO  (TEST-StatsReloadRaceTest.testParallelReloadAndStats-seed#[819E30883BAEDC76]) [    ] o.a.s.h.a.CoreAdminOperation Checking request status for : 1
   [junit4]   2> 877971 INFO  (TEST-StatsReloadRaceTest.testParallelReloadAndStats-seed#[819E30883BAEDC76]) [    ] o.a.s.h.a.CoreAdminOperation Checking request status for : 1
   [junit4]   2> 877972 INFO  (TEST-StatsReloadRaceTest.testParallelReloadAndStats-seed#[819E30883BAEDC76]) [    ] o.a.s.h.a.CoreAdminOperation Checking request status for : 1
   [junit4]   2> 877972 INFO  (TEST-StatsReloadRaceTest.testParallelReloadAndStats-seed#[819E30883BAEDC76]) [    ] o.a.s.h.a.CoreAdminOperation Checking request status for : 1
   [junit4]   2> 877972 INFO  (TEST-StatsReloadRaceTest.testParallelReloadAndStats-seed#[819E30883BAEDC76]) [    ] o.a.s.h.a.CoreAdminOperation Checking request status for : 1
   [junit4]   2> 877972 INFO  (TEST-StatsReloadRaceTest.testParallelReloadAndStats-seed#[819E30883BAEDC76]) [    ] o.a.s.h.a.CoreAdminOperation Checking request status for : 1
   [junit4]   2> 877972 INFO  (TEST-StatsReloadRaceTest.testParallelReloadAndStats-seed#[819E30883BAEDC76]) [    ] o.a.s.h.a.CoreAdminOperation Checking request status for : 1
   [junit4]   2> 877973 INFO  (TEST-StatsReloadRaceTest.testParallelReloadAndStats-seed#[819E30883BAEDC76]) [    ] o.a.s.h.a.CoreAdminOperation Checking request status for : 1
   [junit4]   2> 877973 INFO  (TEST-StatsReloadRaceTest.testParallelReloadAndStats-seed#[819E30883BAEDC76]) [    ] o.a.s.h.a.CoreAdminOperation Checking request status for : 1
   [junit4]   2> 877974 INFO  (TEST-StatsReloadRaceTest.testParallelReloadAndStats-seed#[819E30883BAEDC76]) [    ] o.a.s.h.a.CoreAdminOperation Checking request status for : 1
   [junit4]   2> 877975 INFO  (TEST-StatsReloadRaceTest.testParallelReloadAndStats-seed#[819E30883BAEDC76]) [    ] o.a.s.h.a.CoreAdminOperation Checking request status for : 1
   [junit4]   2> 877975 INFO  (TEST-StatsReloadRaceTest.testParallelReloadAndStats-seed#[819E30883BAEDC76]) [    ] o.a.s.h.a.CoreAdminOperation Checking request status for : 1
   [junit4]   2> 877975 INFO  (TEST-StatsReloadRaceTest.testParallelReloadAndStats-seed#[819E30883BAEDC76]) [    ] o.a.s.h.a.CoreAdminOperation Checking request status for : 1
   [junit4]   2> 877976 INFO  (TEST-StatsReloadRaceTest.testParallelReloadAndStats-seed#[819E30883BAEDC76]) [    ] o.a.s.h.a.CoreAdminOperation Checking request status for : 1
   [junit4]   2> 877976 INFO  (TEST-StatsReloadRaceTest.testParallelReloadAndStats-seed#[819E30883BAEDC76]) [    ] o.a.s.h.a.CoreAdminOperation Checking request status for : 1
   [junit4]   2> 877976 INFO  (TEST-StatsReloadRaceTest.testParallelReloadAndStats-seed#[819E30883BAEDC76]) [    ] o.a.s.h.a.CoreAdminOperation Checking request status for : 1
   [junit4]   2> 877976 INFO  (TEST-StatsReloadRaceTest.testParallelReloadAndStats-seed#[819E30883BAEDC76]) [    ] o.a.s.h.a.CoreAdminOperation Checking request status for : 1
   [junit4]   2> 877976 INFO  (TEST-StatsReloadRaceTest.testParallelReloadAndStats-seed#[819E30883BAEDC76]) [    ] o.a.s.h.a.CoreAdminOperation Checking request status for : 1
   [junit4]   2> 877976 INFO  (TEST-StatsReloadRaceTest.testParallelReloadAndStats-seed#[819E30883BAEDC76]) [    ] o.a.s.h.a.CoreAdminOperation Checking request status for : 1
   [junit4]   2> 877977 INFO  (TEST-StatsReloadRaceTest.testParallelReloadAndStats-seed#[819E30883BAEDC76]) [    ] o.a.s.h.a.CoreAdminOperation Checking request status for : 1
   [junit4]   2> 877977 INFO  (TEST-StatsReloadRaceTest.testParallelReloadAndStats-seed#[819E30883BAEDC76]) [    ] o.a.s.h.a.CoreAdminOperation Checking request status for : 1
   [junit4]   2> 877977 INFO  (TEST-StatsReloadRaceTest.testParallelReloadAndStats-seed#[819E30883BAEDC76]) [    ] o.a.s.h.a.CoreAdminOperation Checking request status for : 1
   [junit4]   2> 877977 INFO  (TEST-StatsReloadRaceTest.testParallelReloadAndStats-seed#[819E30883BAEDC76]) [    ] o.a.s.h.a.CoreAdminOperation Checking request status for : 1
   [junit4]   2> 877977 INFO  (TEST-StatsReloadRaceTest.testParallelReloadAndStats-seed#[819E30883BAEDC76]) [    ] o.a.s.h.a.CoreAdminOperation Checking request status for : 1
   [junit4]   2> 877978 INFO  (TEST-StatsReloadRaceTest.testParallelReloadAndStats-seed#[819E30883BAEDC76]) [    ] o.a.s.h.a.CoreAdminOperation Checking request status for : 1
   [junit4]   2> 877978 INFO  (TEST-StatsReloadRaceTest.testParallelReloadAndStats-seed#[819E30883BAEDC76]) [    ] o.a.s.h.a.CoreAdminOperation Checking request status for : 1
   [junit4]   2> 877978 INFO  (TEST-StatsReloadRaceTest.testParallelReloadAndStats-seed#[819E30883BAEDC76]) [    ] o.a.s.h.a.CoreAdminOperation Checking request status for : 1
   [junit4]   2> 877979 INFO  (TEST-StatsReloadRaceTest.testParallelReloadAndStats-seed#[819E30883BAEDC76]) [    ] o.a.s.h.a.CoreAdminOperation Checking request status for : 1
   [junit4]   2> 877979 INFO  (TEST-StatsReloadRaceTest.testParallelReloadAndStats-seed#[819E30883BAEDC76]) [    ] o.a.s.h.a.CoreAdminOperation Checking request status for : 1
   [junit4]   2> 877980 INFO  (TEST-StatsReloadRaceTest.testParallelReloadAndStats-seed#[819E30883BAEDC76]) [    ] o.a.s.h.a.CoreAdminOperation Checking request status for : 1
   [junit4]   2> 877980 INFO  (TEST-StatsReloadRaceTest.testParallelReloadAndStats-seed#[819E30883BAEDC76]) [    ] o.a.s.h.a.CoreAdminOperation Checking request status for : 1
   [junit4]   2> 877980 INFO  (TEST-StatsReloadRaceTest.testParallelReloadAndStats-seed#[819E30883BAEDC76]) [    ] o.a.s.h.a.CoreAdminOperation Checking request status for : 1
   [junit4]   2> 877981 INFO  (TEST-StatsReloadRaceTest.testParallelReloadAndStats-seed#[819E30883BAEDC76]) [    ] o.a.s.h.a.CoreAdminOperation Checking request status for : 1
   [junit4]   2> 877981 INFO  (TEST-StatsReloadRaceTest.testParallelReloadAndStats-seed#[819E30883BAEDC76]) [    ] o.a.s.h.a.CoreAdminOperation Checking request status for : 1
   [junit4]   2> 877981 INFO  (TEST-StatsReloadRaceTest.testParallelReloadAndStats-seed#[819E30883BAEDC76]) [    ] o.a.s.h.a.CoreAdminOperation Checking request status for : 1
   [junit4]   2> 877982 INFO  (TEST-StatsReloadRaceTest.testParallelReloadAndStats-seed#[819E30883BAEDC76]) [    ] o.a.s.h.a.CoreAdminOperation Checking request status for : 1
   [junit4]   2> 877982 INFO  (TEST-StatsReloadRaceTest.testParallelReloadAndStats-seed#[819E30883BAEDC76]) [    ] o.a.s.h.a.CoreAdminOperation Checking request status for : 1
   [junit4]   2> 877982 INFO  (TEST-StatsReloadRaceTest.testParallelReloadAndStats-seed#[819E30883BAEDC76]) [    ] o.a.s.h.a.CoreAdminOperation Checking request status for : 1
   [junit4]   2> 877982 INFO  (TEST-StatsReloadRaceTest.testParallelReloadAndStats-seed#[819E30883BAEDC76]) [    ] o.a.s.h.a.CoreAdminOperation Checking request status for : 1
   [junit4]   2> 877982 INFO  (TEST-StatsReloadRaceTest.testParallelReloadAndStats-seed#[819E30883BAEDC76]) [    ] o.a.s.h.a.CoreAdminOperation Checking request status for : 1
   [junit4]   2> 877982 INFO  (TEST-StatsReloadRaceTest.testParallelReloadAndStats-seed#[819E30883BAEDC76]) [    ] o.a.s.h.a.CoreAdminOperation Checking request status for : 1
   [junit4]   2> 877982 INFO  (TEST-StatsReloadRaceTest.testParallelReloadAndStats-seed#[819E30883BAEDC76]) [    ] o.a.s.h.a.CoreAdminOperation Checking request status for : 1
   [junit4]   2> 877982 INFO  (TEST-StatsReloadRaceTest.testParallelReloadAndStats-seed#[819E30883BAEDC76]) [    ] o.a.s.h.a.CoreAdminOperation Checking request status for : 1
   [junit4]   2> 877982 INFO  (TEST-StatsReloadRaceTest.testParallelReloadAndStats-seed#[819E30883BAEDC76]) [    ] o.a.s.h.a.CoreAdminOperation Checking request status for : 1
   [junit4]   2> 877999 INFO  (TEST-StatsReloadRaceTest.testParallelReloadAndStats-seed#[819E30883BAEDC76]) [    ] o.a.s.h.a.CoreAdminOperation Checking request status for : 1
   [junit4]   2> 877999 INFO  (TEST-StatsReloadRaceTest.testParallelReloadAndStats-seed#[819E30883BAEDC76]) [    ] o.a.s.h.a.CoreAdminOperation Checking request status for : 1
   [junit4]   2> 878000 INFO  (TEST-StatsReloadRaceTest.testParallelReloadAndStats-seed#[819E30883BAEDC76]) [    ] o.a.s.h.a.CoreAdminOperation Checking request status for : 1
   [junit4]   2> 878000 INFO  (TEST-StatsReloadRaceTest.testParallelReloadAndStats-seed#[819E30883BAEDC76]) [    ] o.a.s.h.a.CoreAdminOperation Checking request status for : 1
   [junit4]   2> 878000 INFO  (TEST-StatsReloadRaceTest.testParallelReloadAndStats-seed#[819E30883BAEDC76]) [    ] o.a.s.h.a.CoreAdminOperation Checking request status for : 1
   [junit4]   2> 878000 INFO  (TEST-StatsReloadRaceTest.testParallelReloadAndStats-seed#[819E30883BAEDC76]) [    ] o.a.s.h.a.CoreAdminOperation Checking request status for : 1
   [junit4]   2> 878000 INFO  (TEST-StatsReloadRaceTest.testParallelReloadAndStats-seed#[819E30883BAEDC76]) [    ] o.a.s.h.a.CoreAdminOperation Checking request status for : 1
   [junit4]   2> 878001 INFO  (TEST-StatsReloadRaceTest.testParallelReloadAndStats-seed#[819E30883BAEDC76]) [    ] o.a.s.h.a.CoreAdminOperation Checking request status for : 1
   [junit4]   2> 878001 INFO  (TEST-StatsReloadRaceTest.testParallelReloadAndStats-seed#[819E30883BAEDC76]) [    ] o.a.s.h.a.CoreAdminOperation Checking request status for : 1
   [junit4]   2> 878001 INFO  (TEST-StatsReloadRaceTest.testParallelReloadAndStats-seed#[819E30883BAEDC76]) [    ] o.a.s.h.a.CoreAdminOperation Checking request status for : 1
   [junit4]   2> 878001 INFO  (TEST-StatsReloadRaceTest.testParallelReloadAndStats-seed#[819E30883BAEDC76]) [    ] o.a.s.h.a.CoreAdminOperation Checking request status for : 1
   [junit4]   2> 878001 INFO  (TEST-StatsReloadRaceTest.testParallelReloadAndStats-seed#[819E30883BAEDC76]) [    ] o.a.s.h.a.CoreAdminOperation Checking request status for : 1
   [junit4]   2> 878002 INFO  (TEST-StatsReloadRaceTest.testParallelReloadAndStats-seed#[819E30883BAEDC76]) [    ] o.a.s.h.a.CoreAdminOperation Checking request status for : 1
   [junit4]   2> 878002 INFO  (TEST-StatsReloadRaceTest.testParallelReloadAndStats-seed#[819E30883BAEDC76]) [    ] o.a.s.h.a.CoreAdminOperation Checking request status for : 1
   [junit4]   2> 878003 INFO  (TEST-StatsReloadRaceTest.testParallelReloadAndStats-seed#[819E30883BAEDC76]) [    ] o.a.s.h.a.CoreAdminOperation Checking request status for : 1
   [junit4]   2> 878003 INFO  (TEST-StatsReloadRaceTest.testParallelReloadAndStats-seed#[819E30883BAEDC76]) [    ] o.a.s.h.a.CoreAdminOperation Checking request status for : 1
   [junit4]   2> 878003 INFO  (TEST-StatsReloadRaceTest.testParallelReloadAndStats-seed#[819E30883BAEDC76]) [    ] o.a.s.h.a.CoreAdminOperation Checking request status for : 1
   [junit4]   2> 878004 INFO  (TEST-StatsReloadRaceTest.testParallelReloadAndStats-seed#[819E30883BAEDC76]) [    ] o.a.s.h.a.CoreAdminOperation Checking request status for : 1
   [junit4]   2> 878004 INFO  (TEST-StatsReloadRaceTest.testPar

[...truncated too long message...]

 ###Ending bayesMultiClass_maxOutputClasses2_shouldAssignMax2Classes
   [junit4]   2> 1270515 INFO  (TEST-ClassificationUpdateProcessorTest.bayesMultiClass_boostFieldsMaxOutputClasses2_shouldAssignMax2Classes-seed#[819E30883BAEDC76]) [    ] o.a.s.SolrTestCaseJ4 ###Starting bayesMultiClass_boostFieldsMaxOutputClasses2_shouldAssignMax2Classes
   [junit4]   2> 1270522 INFO  (TEST-ClassificationUpdateProcessorTest.bayesMultiClass_boostFieldsMaxOutputClasses2_shouldAssignMax2Classes-seed#[819E30883BAEDC76]) [    ] o.a.s.SolrTestCaseJ4 ###Ending bayesMultiClass_boostFieldsMaxOutputClasses2_shouldAssignMax2Classes
   [junit4]   2> 1270524 INFO  (TEST-ClassificationUpdateProcessorTest.bayesMonoClass_boostFields_shouldAssignCorrectClass-seed#[819E30883BAEDC76]) [    ] o.a.s.SolrTestCaseJ4 ###Starting bayesMonoClass_boostFields_shouldAssignCorrectClass
   [junit4]   2> 1270529 INFO  (TEST-ClassificationUpdateProcessorTest.bayesMonoClass_boostFields_shouldAssignCorrectClass-seed#[819E30883BAEDC76]) [    ] o.a.s.SolrTestCaseJ4 ###Ending bayesMonoClass_boostFields_shouldAssignCorrectClass
   [junit4]   2> 1270531 INFO  (TEST-ClassificationUpdateProcessorTest.knnMultiClass_maxOutputClasses2_shouldAssignMax2Classes-seed#[819E30883BAEDC76]) [    ] o.a.s.SolrTestCaseJ4 ###Starting knnMultiClass_maxOutputClasses2_shouldAssignMax2Classes
   [junit4]   2> 1270539 INFO  (TEST-ClassificationUpdateProcessorTest.knnMultiClass_maxOutputClasses2_shouldAssignMax2Classes-seed#[819E30883BAEDC76]) [    ] o.a.s.SolrTestCaseJ4 ###Ending knnMultiClass_maxOutputClasses2_shouldAssignMax2Classes
   [junit4]   2> 1270541 INFO  (TEST-ClassificationUpdateProcessorTest.knnMultiClass_boostFieldsMaxOutputClasses2_shouldAssignMax2Classes-seed#[819E30883BAEDC76]) [    ] o.a.s.SolrTestCaseJ4 ###Starting knnMultiClass_boostFieldsMaxOutputClasses2_shouldAssignMax2Classes
   [junit4]   2> 1270550 INFO  (TEST-ClassificationUpdateProcessorTest.knnMultiClass_boostFieldsMaxOutputClasses2_shouldAssignMax2Classes-seed#[819E30883BAEDC76]) [    ] o.a.s.SolrTestCaseJ4 ###Ending knnMultiClass_boostFieldsMaxOutputClasses2_shouldAssignMax2Classes
   [junit4]   2> 1270552 INFO  (TEST-ClassificationUpdateProcessorTest.knnMonoClass_contextQueryFiltered_shouldAssignCorrectClass-seed#[819E30883BAEDC76]) [    ] o.a.s.SolrTestCaseJ4 ###Starting knnMonoClass_contextQueryFiltered_shouldAssignCorrectClass
   [junit4]   2> 1270561 INFO  (TEST-ClassificationUpdateProcessorTest.knnMonoClass_contextQueryFiltered_shouldAssignCorrectClass-seed#[819E30883BAEDC76]) [    ] o.a.s.SolrTestCaseJ4 ###Ending knnMonoClass_contextQueryFiltered_shouldAssignCorrectClass
   [junit4]   2> 1270563 INFO  (TEST-ClassificationUpdateProcessorTest.knnMonoClass_boostFields_shouldAssignCorrectClass-seed#[819E30883BAEDC76]) [    ] o.a.s.SolrTestCaseJ4 ###Starting knnMonoClass_boostFields_shouldAssignCorrectClass
   [junit4]   2> 1270572 INFO  (TEST-ClassificationUpdateProcessorTest.knnMonoClass_boostFields_shouldAssignCorrectClass-seed#[819E30883BAEDC76]) [    ] o.a.s.SolrTestCaseJ4 ###Ending knnMonoClass_boostFields_shouldAssignCorrectClass
   [junit4]   2> 1270574 INFO  (TEST-ClassificationUpdateProcessorTest.classificationMonoClass_predictedClassFieldSet_shouldAssignClassInPredictedClassField-seed#[819E30883BAEDC76]) [    ] o.a.s.SolrTestCaseJ4 ###Starting classificationMonoClass_predictedClassFieldSet_shouldAssignClassInPredictedClassField
   [junit4]   2> 1270583 INFO  (TEST-ClassificationUpdateProcessorTest.classificationMonoClass_predictedClassFieldSet_shouldAssignClassInPredictedClassField-seed#[819E30883BAEDC76]) [    ] o.a.s.SolrTestCaseJ4 ###Ending classificationMonoClass_predictedClassFieldSet_shouldAssignClassInPredictedClassField
   [junit4]   2> NOTE: reproduce with: ant test  -Dtestcase=ClassificationUpdateProcessorTest -Dtests.method=classificationMonoClass_predictedClassFieldSet_shouldAssignClassInPredictedClassField -Dtests.seed=819E30883BAEDC76 -Dtests.multiplier=3 -Dtests.slow=true -Dtests.locale=fr-FR -Dtests.timezone=America/Campo_Grande -Dtests.asserts=true -Dtests.file.encoding=UTF-8
   [junit4] FAILURE 0.01s J1 | ClassificationUpdateProcessorTest.classificationMonoClass_predictedClassFieldSet_shouldAssignClassInPredictedClassField <<<
   [junit4]    > Throwable #1: java.lang.AssertionError: 
   [junit4]    > Expected: is "class1"
   [junit4]    >      got: "class2"
   [junit4]    > 	at __randomizedtesting.SeedInfo.seed([819E30883BAEDC76:88D15E3025073BFD]:0)
   [junit4]    > 	at org.apache.solr.update.processor.ClassificationUpdateProcessorTest.classificationMonoClass_predictedClassFieldSet_shouldAssignClassInPredictedClassField(ClassificationUpdateProcessorTest.java:102)
   [junit4]    > 	at java.base/jdk.internal.reflect.NativeMethodAccessorImpl.invoke0(Native Method)
   [junit4]    > 	at java.base/jdk.internal.reflect.NativeMethodAccessorImpl.invoke(NativeMethodAccessorImpl.java:62)
   [junit4]    > 	at java.base/jdk.internal.reflect.DelegatingMethodAccessorImpl.invoke(DelegatingMethodAccessorImpl.java:43)
   [junit4]    > 	at java.base/java.lang.reflect.Method.invoke(Method.java:563)
   [junit4]    > 	at java.base/java.lang.Thread.run(Thread.java:844)
   [junit4]   2> 1270585 INFO  (SUITE-ClassificationUpdateProcessorTest-seed#[819E30883BAEDC76]-worker) [    ] o.a.s.SolrTestCaseJ4 ###deleteCore
   [junit4]   2> 1270585 INFO  (SUITE-ClassificationUpdateProcessorTest-seed#[819E30883BAEDC76]-worker) [    ] o.a.s.c.CoreContainer Shutting down CoreContainer instance=4003434
   [junit4]   2> 1270585 INFO  (SUITE-ClassificationUpdateProcessorTest-seed#[819E30883BAEDC76]-worker) [    ] o.a.s.m.SolrMetricManager Closing metric reporters for registry=solr.node, tag=null
   [junit4]   2> 1270587 INFO  (SUITE-ClassificationUpdateProcessorTest-seed#[819E30883BAEDC76]-worker) [    ] o.a.s.m.SolrMetricManager Closing metric reporters for registry=solr.jvm, tag=null
   [junit4]   2> 1270588 INFO  (SUITE-ClassificationUpdateProcessorTest-seed#[819E30883BAEDC76]-worker) [    ] o.a.s.m.SolrMetricManager Closing metric reporters for registry=solr.jetty, tag=null
   [junit4]   2> 1270588 INFO  (SUITE-ClassificationUpdateProcessorTest-seed#[819E30883BAEDC76]-worker) [    ] o.a.s.c.TransientSolrCoreCacheDefault Allocating transient cache for 2147483647 transient cores
   [junit4]   2> 1270588 INFO  (coreCloseExecutor-2794-thread-1) [    ] o.a.s.c.SolrCore [collection1]  CLOSING SolrCore org.apache.solr.core.SolrCore@1635002
   [junit4]   2> 1270593 INFO  (coreCloseExecutor-2794-thread-1) [    ] o.a.s.m.SolrMetricManager Closing metric reporters for registry=solr.core.collection1, tag=23285762
   [junit4]   2> NOTE: leaving temporary files on disk at: /home/jenkins/workspace/Lucene-Solr-master-Linux/solr/build/solr-core/test/J1/temp/solr.update.processor.ClassificationUpdateProcessorTest_819E30883BAEDC76-001
   [junit4]   2> NOTE: test params are: codec=Asserting(Lucene70): {author=Lucene50(blocksize=128), cat=FST50, id=PostingsFormat(name=Memory), title=PostingsFormat(name=MockRandom), content=Lucene50(blocksize=128)}, docValues:{}, maxPointsInLeafNode=585, maxMBSortInHeap=7.8682884454196, sim=RandomSimilarity(queryNorm=true): {author=DFR I(ne)LZ(0.3), cat=DFR I(F)Z(0.3), id=IB SPL-D3(800.0), title=DFI(ChiSquared), content=DFR GL1}, locale=fr-FR, timezone=America/Campo_Grande
   [junit4]   2> NOTE: Linux 4.4.0-72-generic i386/Oracle Corporation 9-ea (32-bit)/cpus=12,threads=1,free=283498960,total=518979584
   [junit4]   2> NOTE: All tests run in this JVM: [SolrInfoBeanTest, TestSearchPerf, TestJavabinTupleStreamParser, BJQParserTest, TestRequestForwarding, IndexSchemaTest, UpdateLogTest, ShufflingReplicaListTransformerTest, DistributedFacetPivotSmallAdvancedTest, TestSolrCoreParser, TestLRUCache, TestFieldCollectionResource, TestPKIAuthenticationPlugin, TestRTGBase, CollectionsAPISolrJTest, TestSystemIdResolver, HdfsThreadLeakTest, OnlyLeaderIndexesTest, BlockCacheTest, TestQueryUtils, HdfsWriteToMultipleCollectionsTest, OpenCloseCoreStressTest, TermsComponentTest, TestFuzzyAnalyzedSuggestions, SoftAutoCommitTest, SolrSlf4jReporterTest, TestSolrCloudSnapshots, TermVectorComponentTest, AssignTest, LargeFieldTest, ResourceLoaderTest, CleanupOldIndexTest, DistribCursorPagingTest, ExplicitHLLTest, DOMUtilTest, JsonValidatorTest, TestDynamicLoading, TestExclusionRuleCollectionAccess, OverseerStatusTest, SuggesterFSTTest, TestFieldCacheSortRandom, SOLR749Test, TestPerFieldSimilarity, TestLeaderElectionZkExpiry, TestSubQueryTransformer, TestManagedResource, SpatialFilterTest, TestUninvertingReader, PreAnalyzedFieldManagedSchemaCloudTest, TestRecoveryHdfs, TestNonDefinedSimilarityFactory, TestSolrIndexConfig, TestCoreContainer, TestBulkSchemaAPI, DirectSolrSpellCheckerTest, SortByFunctionTest, LoggingHandlerTest, CollectionsAPIDistributedZkTest, ConnectionReuseTest, TestCloudPivotFacet, TestSolrQueryParserDefaultOperatorResource, CollectionStateFormat2Test, TestSchemalessBufferedUpdates, SolrIndexMetricsTest, TestHashPartitioner, SSLMigrationTest, TestSimpleTrackingShardHandler, RuleEngineTest, TestPivotHelperCode, TestConfigOverlay, SolrMetricManagerTest, BasicFunctionalityTest, CdcrRequestHandlerTest, BadComponentTest, SortSpecParsingTest, SpellCheckCollatorWithCollapseTest, TestSolrCloudWithDelegationTokens, SolrCmdDistributorTest, HighlighterTest, DocumentBuilderTest, DistributedIntervalFacetingTest, SliceStateTest, TestDefaultStatsCache, ScriptEngineTest, HdfsDirectoryTest, HdfsDirectoryFactoryTest, TestSimpleQParserPlugin, ConvertedLegacyTest, OverseerCollectionConfigSetProcessorTest, TestManagedSchemaThreadSafety, IndexSchemaRuntimeFieldTest, BooleanFieldTest, AnalyticsMergeStrategyTest, BigEndianAscendingWordDeserializerTest, BasicAuthStandaloneTest, SolrGangliaReporterTest, ChaosMonkeySafeLeaderTest, ReplicationFactorTest, SecurityConfHandlerTest, ClassificationUpdateProcessorTest]
   [junit4] Completed [324/702 (2!)] on J1 in 0.58s, 11 tests, 2 failures <<< FAILURES!

[...truncated 37486 lines...]


Mime
View raw message