lucene-dev mailing list archives

Site index · List index
Message view « Date » · « Thread »
Top « Date » · « Thread »
From "Ishan Chattopadhyaya (JIRA)" <j...@apache.org>
Subject [jira] [Commented] (SOLR-10079) TestInPlaceUpdates(Distrib|Standalone) failures
Date Sat, 18 Mar 2017 07:43:41 GMT

    [ https://issues.apache.org/jira/browse/SOLR-10079?page=com.atlassian.jira.plugin.system.issuetabpanels:comment-tabpanel&focusedCommentId=15931111#comment-15931111
] 

Ishan Chattopadhyaya commented on SOLR-10079:
---------------------------------------------

Another similar failure:

{code}
Build: https://jenkins.thetaphi.de/job/Lucene-Solr-master-Linux/19196/
Java: 64bit/jdk-9-ea+160 -XX:-UseCompressedOops -XX:+UseSerialGC

1 tests failed.
FAILED:  org.apache.solr.update.TestInPlaceUpdatesDistrib.test

Error Message:
inplace_updatable_float didn't match for replica at client: https://127.0.0.1:42339/collection1
expected:<109.0> but was:<1.0>

Stack Trace:
java.lang.AssertionError: inplace_updatable_float didn't match for replica at client: https://127.0.0.1:42339/collection1
expected:<109.0> but was:<1.0>
        at __randomizedtesting.SeedInfo.seed([D5030D312D037BD7:5D5732EB83FF162F]:0)
        at org.junit.Assert.fail(Assert.java:93)
        at org.junit.Assert.failNotEquals(Assert.java:647)
        at org.junit.Assert.assertEquals(Assert.java:128)
        at org.apache.solr.update.TestInPlaceUpdatesDistrib.assertReplicaValue(TestInPlaceUpdatesDistrib.java:1005)
        at org.apache.solr.update.TestInPlaceUpdatesDistrib.outOfOrderUpdatesIndividualReplicaTest(TestInPlaceUpdatesDistrib.java:665)
        at org.apache.solr.update.TestInPlaceUpdatesDistrib.test(TestInPlaceUpdatesDistrib.java:162)
...
{code}

> TestInPlaceUpdates(Distrib|Standalone) failures
> -----------------------------------------------
>
>                 Key: SOLR-10079
>                 URL: https://issues.apache.org/jira/browse/SOLR-10079
>             Project: Solr
>          Issue Type: Bug
>      Security Level: Public(Default Security Level. Issues are Public) 
>            Reporter: Steve Rowe
>            Assignee: Ishan Chattopadhyaya
>             Fix For: master (7.0), branch_6x
>
>         Attachments: SOLR-10079.patch, stdout, tests-failures.txt
>
>
> From [https://jenkins.thetaphi.de/job/Lucene-Solr-master-Linux/18881/], reproduces for
me:
> {noformat}
> Checking out Revision d8d61ff61d1d798f5e3853ef66bc485d0d403f18 (refs/remotes/origin/master)
> [...]
>    [junit4]   2> NOTE: reproduce with: ant test  -Dtestcase=TestInPlaceUpdatesDistrib
-Dtests.method=test -Dtests.seed=E1BB56269B8215B0 -Dtests.multiplier=3 -Dtests.slow=true -Dtests.locale=sr-Latn-RS
-Dtests.timezone=America/Grand_Turk -Dtests.asserts=true -Dtests.file.encoding=UTF-8
>    [junit4] FAILURE 77.7s J2 | TestInPlaceUpdatesDistrib.test <<<
>    [junit4]    > Throwable #1: java.lang.AssertionError: Earlier: [79, 79, 79], now:
[78, 78, 78]
>    [junit4]    > 	at __randomizedtesting.SeedInfo.seed([E1BB56269B8215B0:69EF69FC357E7848]:0)
>    [junit4]    > 	at org.apache.solr.update.TestInPlaceUpdatesDistrib.ensureRtgWorksWithPartialUpdatesTest(TestInPlaceUpdatesDistrib.java:425)
>    [junit4]    > 	at org.apache.solr.update.TestInPlaceUpdatesDistrib.test(TestInPlaceUpdatesDistrib.java:142)
>    [junit4]    > 	at java.base/jdk.internal.reflect.NativeMethodAccessorImpl.invoke0(Native
Method)
>    [junit4]    > 	at java.base/jdk.internal.reflect.NativeMethodAccessorImpl.invoke(NativeMethodAccessorImpl.java:62)
>    [junit4]    > 	at java.base/jdk.internal.reflect.DelegatingMethodAccessorImpl.invoke(DelegatingMethodAccessorImpl.java:43)
>    [junit4]    > 	at java.base/java.lang.reflect.Method.invoke(Method.java:543)
>    [junit4]    > 	at org.apache.solr.BaseDistributedSearchTestCase$ShardsRepeatRule$ShardsFixedStatement.callStatement(BaseDistributedSearchTestCase.java:985)
>    [junit4]    > 	at org.apache.solr.BaseDistributedSearchTestCase$ShardsRepeatRule$ShardsStatement.evaluate(BaseDistributedSearchTestCase.java:960)
>    [junit4]    > 	at java.base/java.lang.Thread.run(Thread.java:844)
> [...]
>    [junit4]   2> NOTE: test params are: codec=Asserting(Lucene70): {id_i=PostingsFormat(name=LuceneFixedGap),
title_s=FSTOrd50, id=PostingsFormat(name=Asserting), id_field_copy_that_does_not_support_in_place_update_s=FSTOrd50},
docValues:{inplace_updatable_float=DocValuesFormat(name=Asserting), id_i=DocValuesFormat(name=Direct),
_version_=DocValuesFormat(name=Asserting), title_s=DocValuesFormat(name=Lucene70), id=DocValuesFormat(name=Lucene70),
id_field_copy_that_does_not_support_in_place_update_s=DocValuesFormat(name=Lucene70), inplace_updatable_int_with_default=DocValuesFormat(name=Asserting),
inplace_updatable_int=DocValuesFormat(name=Direct), inplace_updatable_float_with_default=DocValuesFormat(name=Direct)},
maxPointsInLeafNode=1342, maxMBSortInHeap=6.368734895089348, sim=RandomSimilarity(queryNorm=true):
{}, locale=sr-Latn-RS, timezone=America/Grand_Turk
>    [junit4]   2> NOTE: Linux 4.4.0-53-generic i386/Oracle Corporation 9-ea (32-bit)/cpus=12,threads=1,free=107734480,total=518979584
> {noformat}



--
This message was sent by Atlassian JIRA
(v6.3.15#6346)

---------------------------------------------------------------------
To unsubscribe, e-mail: dev-unsubscribe@lucene.apache.org
For additional commands, e-mail: dev-help@lucene.apache.org


Mime
View raw message