lucene-dev mailing list archives

Site index · List index
Message view « Date » · « Thread »
Top « Date » · « Thread »
From "Hoss Man (JIRA)" <j...@apache.org>
Subject [jira] [Commented] (SOLR-6286) TestReplicationHandler.doTestReplicateAfterCoreReload failure on jenkins
Date Tue, 14 Mar 2017 21:09:41 GMT

    [ https://issues.apache.org/jira/browse/SOLR-6286?page=com.atlassian.jira.plugin.system.issuetabpanels:comment-tabpanel&focusedCommentId=15925005#comment-15925005
] 

Hoss Man commented on SOLR-6286:
--------------------------------

here's another reproducible seed (as of master 09bd8612ce82c2852542127eb24b887c7b332a0d)

{noformat}
   [junit4]   2> NOTE: reproduce with: ant test  -Dtestcase=TestReplicationHandler -Dtests.method=doTestReplicateAfterCoreReload
-Dtests.seed=29F881D77A7556D8 -Dtests.nightly=true -Dtests.slow=true -Dtests.locale=en-NG
-Dtests.timezone=Israel -Dtests.asserts=true -Dtests.file.encoding=ISO-8859-1
   [junit4] FAILURE 55.3s | TestReplicationHandler.doTestReplicateAfterCoreReload <<<
   [junit4]    > Throwable #1: java.lang.AssertionError: expected:<[{indexVersion=1489525699190,generation=2,filelist=[_5u.fdt,
_5u.fdx, _5u.fnm, _5u.nvd, _5u.nvm, _5u.si, _5u_FST50_0.doc, _5u_FST50_0.tfp, _5v.fdt, _5v.fdx,
_5v.fnm, _5v.nvd, _5v.nvm, _5v.si, _5v_FST50_0.doc, _5v_FST50_0.tfp, _5w.fdt, _5w.fdx, _5w.fnm,
_5w.nvd, _5w.nvm, _5w.si, _5w_FST50_0.doc, _5w_FST50_0.tfp, _5x.fdt, _5x.fdx, _5x.fnm, _5x.nvd,
_5x.nvm, _5x.si, _5x_FST50_0.doc, _5x_FST50_0.tfp, _5y.fdt, _5y.fdx, _5y.fnm, _5y.nvd, _5y.nvm,
_5y.si, _5y_FST50_0.doc, _5y_FST50_0.tfp, _5z.fdt, _5z.fdx, _5z.fnm, _5z.nvd, _5z.nvm, _5z.si,
_5z_FST50_0.doc, _5z_FST50_0.tfp, _60.fdt, _60.fdx, _60.fnm, _60.nvd, _60.nvm, _60.si, _60_FST50_0.doc,
_60_FST50_0.tfp, _61.fdt, _61.fdx, _61.fnm, _61.nvd, _61.nvm, _61.si, _61_FST50_0.doc, _61_FST50_0.tfp,
_62.fdt, _62.fdx, _62.fnm, _62.nvd, _62.nvm, _62.si, _62_FST50_0.doc, _62_FST50_0.tfp, _63.fdt,
_63.fdx, _63.fnm, _63.nvd, _63.nvm, _63.si, _63_FST50_0.doc, _63_FST50_0.tfp, _64.fdt, _64.fdx,
_64.fnm, _64.nvd, _64.nvm, _64.si, _64_FST50_0.doc, _64_FST50_0.tfp, _65.fdt, _65.fdx, _65.fnm,
_65.nvd, _65.nvm, _65.si, _65_FST50_0.doc, _65_FST50_0.tfp, _66.fdt, _66.fdx, _66.fnm, _66.nvd,
_66.nvm, _66.si, _66_FST50_0.doc, _66_FST50_0.tfp, _67.fdt, _67.fdx, _67.fnm, _67.nvd, _67.nvm,
_67.si, _67_FST50_0.doc, _67_FST50_0.tfp, _68.fdt, _68.fdx, _68.fnm, _68.nvd, _68.nvm, _68.si,
_68_FST50_0.doc, _68_FST50_0.tfp, _69.fdt, _69.fdx, _69.fnm, _69.nvd, _69.nvm, _69.si, _69_FST50_0.doc,
_69_FST50_0.tfp, _6a.fdt, _6a.fdx, _6a.fnm, _6a.nvd, _6a.nvm, _6a.si, _6a_FST50_0.doc, _6a_FST50_0.tfp,
_6b.fdt, _6b.fdx, _6b.fnm, _6b.nvd, _6b.nvm, _6b.si, _6b_FST50_0.doc, _6b_FST50_0.tfp, _6c.fdt,
_6c.fdx, _6c.fnm, _6c.nvd, _6c.nvm, _6c.si, _6c_FST50_0.doc, _6c_FST50_0.tfp, _6d.fdt, _6d.fdx,
_6d.fnm, _6d.nvd, _6d.nvm, _6d.si, _6d_FST50_0.doc, _6d_FST50_0.tfp, _6e.fdt, _6e.fdx, _6e.fnm,
_6e.nvd, _6e.nvm, _6e.si, _6e_FST50_0.doc, _6e_FST50_0.tfp, _6f.fdt, _6f.fdx, _6f.fnm, _6f.nvd,
_6f.nvm, _6f.si, _6f_FST50_0.doc, _6f_FST50_0.tfp, _6h.fdt, _6h.fdx, _6h.fnm, _6h.nvd, _6h.nvm,
_6h.si, _6h_FST50_0.doc, _6h_FST50_0.tfp, _6i.fdt, _6i.fdx, _6i.fnm, _6i.nvd, _6i.nvm, _6i.si,
_6i_FST50_0.doc, _6i_FST50_0.tfp, segments_2]}]> but was:<[{indexVersion=1489525699190,generation=2,filelist=[_5u.fdt,
_5u.fdx, _5u.fnm, _5u.nvd, _5u.nvm, _5u.si, _5u_FST50_0.doc, _5u_FST50_0.tfp, _5v.fdt, _5v.fdx,
_5v.fnm, _5v.nvd, _5v.nvm, _5v.si, _5v_FST50_0.doc, _5v_FST50_0.tfp, _5w.fdt, _5w.fdx, _5w.fnm,
_5w.nvd, _5w.nvm, _5w.si, _5w_FST50_0.doc, _5w_FST50_0.tfp, _5x.fdt, _5x.fdx, _5x.fnm, _5x.nvd,
_5x.nvm, _5x.si, _5x_FST50_0.doc, _5x_FST50_0.tfp, _5y.fdt, _5y.fdx, _5y.fnm, _5y.nvd, _5y.nvm,
_5y.si, _5y_FST50_0.doc, _5y_FST50_0.tfp, _5z.fdt, _5z.fdx, _5z.fnm, _5z.nvd, _5z.nvm, _5z.si,
_5z_FST50_0.doc, _5z_FST50_0.tfp, _60.fdt, _60.fdx, _60.fnm, _60.nvd, _60.nvm, _60.si, _60_FST50_0.doc,
_60_FST50_0.tfp, _61.fdt, _61.fdx, _61.fnm, _61.nvd, _61.nvm, _61.si, _61_FST50_0.doc, _61_FST50_0.tfp,
_62.fdt, _62.fdx, _62.fnm, _62.nvd, _62.nvm, _62.si, _62_FST50_0.doc, _62_FST50_0.tfp, _63.fdt,
_63.fdx, _63.fnm, _63.nvd, _63.nvm, _63.si, _63_FST50_0.doc, _63_FST50_0.tfp, _64.fdt, _64.fdx,
_64.fnm, _64.nvd, _64.nvm, _64.si, _64_FST50_0.doc, _64_FST50_0.tfp, _65.fdt, _65.fdx, _65.fnm,
_65.nvd, _65.nvm, _65.si, _65_FST50_0.doc, _65_FST50_0.tfp, _66.fdt, _66.fdx, _66.fnm, _66.nvd,
_66.nvm, _66.si, _66_FST50_0.doc, _66_FST50_0.tfp, _67.fdt, _67.fdx, _67.fnm, _67.nvd, _67.nvm,
_67.si, _67_FST50_0.doc, _67_FST50_0.tfp, _68.fdt, _68.fdx, _68.fnm, _68.nvd, _68.nvm, _68.si,
_68_FST50_0.doc, _68_FST50_0.tfp, _69.fdt, _69.fdx, _69.fnm, _69.nvd, _69.nvm, _69.si, _69_FST50_0.doc,
_69_FST50_0.tfp, _6a.fdt, _6a.fdx, _6a.fnm, _6a.nvd, _6a.nvm, _6a.si, _6a_FST50_0.doc, _6a_FST50_0.tfp,
_6b.fdt, _6b.fdx, _6b.fnm, _6b.nvd, _6b.nvm, _6b.si, _6b_FST50_0.doc, _6b_FST50_0.tfp, _6c.fdt,
_6c.fdx, _6c.fnm, _6c.nvd, _6c.nvm, _6c.si, _6c_FST50_0.doc, _6c_FST50_0.tfp, _6d.fdt, _6d.fdx,
_6d.fnm, _6d.nvd, _6d.nvm, _6d.si, _6d_FST50_0.doc, _6d_FST50_0.tfp, _6e.fdt, _6e.fdx, _6e.fnm,
_6e.nvd, _6e.nvm, _6e.si, _6e_FST50_0.doc, _6e_FST50_0.tfp, _6f.fdt, _6f.fdx, _6f.fnm, _6f.nvd,
_6f.nvm, _6f.si, _6f_FST50_0.doc, _6f_FST50_0.tfp, _6h.fdt, _6h.fdx, _6h.fnm, _6h.nvd, _6h.nvm,
_6h.si, _6h_FST50_0.doc, _6h_FST50_0.tfp, _6i.fdt, _6i.fdx, _6i.fnm, _6i.nvd, _6i.nvm, _6i.si,
_6i_FST50_0.doc, _6i_FST50_0.tfp, segments_2]}, {indexVersion=1489525699190,generation=3,filelist=[_6f.fdt,
_6f.fdx, _6f.fnm, _6f.nvd, _6f.nvm, _6f.si, _6f_FST50_0.doc, _6f_FST50_0.tfp, _6g.fdt, _6g.fdx,
_6g.fnm, _6g.nvd, _6g.nvm, _6g.si, _6g_FST50_0.doc, _6g_FST50_0.tfp, _6h.fdt, _6h.fdx, _6h.fnm,
_6h.nvd, _6h.nvm, _6h.si, _6h_FST50_0.doc, _6h_FST50_0.tfp, _6i.fdt, _6i.fdx, _6i.fnm, _6i.nvd,
_6i.nvm, _6i.si, _6i_FST50_0.doc, _6i_FST50_0.tfp, segments_3]}]>
   [junit4]    > 	at __randomizedtesting.SeedInfo.seed([29F881D77A7556D8:C2F9AE70A3D58DB]:0)
   [junit4]    > 	at org.apache.solr.handler.TestReplicationHandler.doTestReplicateAfterCoreReload(TestReplicationHandler.java:1279)
   [junit4]    > 	at java.base/jdk.internal.reflect.NativeMethodAccessorImpl.invoke0(Native
Method)
   [junit4]    > 	at java.base/jdk.internal.reflect.NativeMethodAccessorImpl.invoke(NativeMethodAccessorImpl.java:62)
   [junit4]    > 	at java.base/jdk.internal.reflect.DelegatingMethodAccessorImpl.invoke(DelegatingMethodAccessorImpl.java:43)
   [junit4]    > 	at java.base/java.lang.reflect.Method.invoke(Method.java:547)
   [junit4]    > 	at java.base/java.lang.Thread.run(Thread.java:844)

{noformat}

> TestReplicationHandler.doTestReplicateAfterCoreReload failure on jenkins
> ------------------------------------------------------------------------
>
>                 Key: SOLR-6286
>                 URL: https://issues.apache.org/jira/browse/SOLR-6286
>             Project: Solr
>          Issue Type: Bug
>          Components: Tests
>            Reporter: Shalin Shekhar Mangar
>            Assignee: Shalin Shekhar Mangar
>             Fix For: 4.10, 6.0
>
>
> There have been a few failures on jenkins.
> {code}
> 3 tests failed.
> REGRESSION:  org.apache.solr.handler.TestReplicationHandler.doTestReplicateAfterCoreReload
> Error Message:
> expected:<[{indexVersion=1406477990053,generation=2,filelist=[_bta.fdt, _bta.fdx,
_bta.fnm, _bta.si, _bta_Lucene41_0.doc, _bta_Lucene41_0.tim, _bta_Lucene41_0.tip, _bta_nrm.cfe,
_bta_nrm.cfs, _nik.cfe, _nik.cfs, _nik.si, _yok.cfe, _yok.cfs, _yok.si, _yp3.cfe, _yp3.cfs,
_yp3.si, _yp4.cfe, _yp4.cfs, _yp4.si, _yp5.cfe, _yp5.cfs, _yp5.si, _yp6.cfe, _yp6.cfs, _yp6.si,
_yp7.cfe, _yp7.cfs, _yp7.si, _yp8.cfe, _yp8.cfs, _yp8.si, _yp9.cfe, _yp9.cfs, _yp9.si, _ypa.cfe,
_ypa.cfs, _ypa.si, _ypu.cfe, _ypu.cfs, _ypu.si, _ypv.cfe, _ypv.cfs, _ypv.si, _ypw.cfe, _ypw.cfs,
_ypw.si, _ypx.cfe, _ypx.cfs, _ypx.si, _ypy.cfe, _ypy.cfs, _ypy.si, segments_2]}]> but was:<[{indexVersion=1406477990053,generation=2,filelist=[_bta.fdt,
_bta.fdx, _bta.fnm, _bta.si, _bta_Lucene41_0.doc, _bta_Lucene41_0.tim, _bta_Lucene41_0.tip,
_bta_nrm.cfe, _bta_nrm.cfs, _nik.cfe, _nik.cfs, _nik.si, _yok.cfe, _yok.cfs, _yok.si, _yp3.cfe,
_yp3.cfs, _yp3.si, _yp4.cfe, _yp4.cfs, _yp4.si, _yp5.cfe, _yp5.cfs, _yp5.si, _yp6.cfe, _yp6.cfs,
_yp6.si, _yp7.cfe, _yp7.cfs, _yp7.si, _yp8.cfe, _yp8.cfs, _yp8.si, _yp9.cfe, _yp9.cfs, _yp9.si,
_ypa.cfe, _ypa.cfs, _ypa.si, _ypu.cfe, _ypu.cfs, _ypu.si, _ypv.cfe, _ypv.cfs, _ypv.si, _ypw.cfe,
_ypw.cfs, _ypw.si, _ypx.cfe, _ypx.cfs, _ypx.si, _ypy.cfe, _ypy.cfs, _ypy.si, segments_2]},
{indexVersion=1406477990053,generation=3,filelist=[_bta.fdt, _bta.fdx, _bta.fnm, _bta.si,
_bta_Lucene41_0.doc, _bta_Lucene41_0.tim, _bta_Lucene41_0.tip, _bta_nrm.cfe, _bta_nrm.cfs,
_nik.cfe, _nik.cfs, _nik.si, _ypc.cfe, _ypc.cfs, _ypc.si, _ypu.cfe, _ypu.cfs, _ypu.si, _ypv.cfe,
_ypv.cfs, _ypv.si, _ypw.cfe, _ypw.cfs, _ypw.si, _ypx.cfe, _ypx.cfs, _ypx.si, _ypy.cfe, _ypy.cfs,
_ypy.si, segments_3]}]>
> Stack Trace:
> java.lang.AssertionError: expected:<[{indexVersion=1406477990053,generation=2,filelist=[_bta.fdt,
_bta.fdx, _bta.fnm, _bta.si, _bta_Lucene41_0.doc, _bta_Lucene41_0.tim, _bta_Lucene41_0.tip,
_bta_nrm.cfe, _bta_nrm.cfs, _nik.cfe, _nik.cfs, _nik.si, _yok.cfe, _yok.cfs, _yok.si, _yp3.cfe,
_yp3.cfs, _yp3.si, _yp4.cfe, _yp4.cfs, _yp4.si, _yp5.cfe, _yp5.cfs, _yp5.si, _yp6.cfe, _yp6.cfs,
_yp6.si, _yp7.cfe, _yp7.cfs, _yp7.si, _yp8.cfe, _yp8.cfs, _yp8.si, _yp9.cfe, _yp9.cfs, _yp9.si,
_ypa.cfe, _ypa.cfs, _ypa.si, _ypu.cfe, _ypu.cfs, _ypu.si, _ypv.cfe, _ypv.cfs, _ypv.si, _ypw.cfe,
_ypw.cfs, _ypw.si, _ypx.cfe, _ypx.cfs, _ypx.si, _ypy.cfe, _ypy.cfs, _ypy.si, segments_2]}]>
but was:<[{indexVersion=1406477990053,generation=2,filelist=[_bta.fdt, _bta.fdx, _bta.fnm,
_bta.si, _bta_Lucene41_0.doc, _bta_Lucene41_0.tim, _bta_Lucene41_0.tip, _bta_nrm.cfe, _bta_nrm.cfs,
_nik.cfe, _nik.cfs, _nik.si, _yok.cfe, _yok.cfs, _yok.si, _yp3.cfe, _yp3.cfs, _yp3.si, _yp4.cfe,
_yp4.cfs, _yp4.si, _yp5.cfe, _yp5.cfs, _yp5.si, _yp6.cfe, _yp6.cfs, _yp6.si, _yp7.cfe, _yp7.cfs,
_yp7.si, _yp8.cfe, _yp8.cfs, _yp8.si, _yp9.cfe, _yp9.cfs, _yp9.si, _ypa.cfe, _ypa.cfs, _ypa.si,
_ypu.cfe, _ypu.cfs, _ypu.si, _ypv.cfe, _ypv.cfs, _ypv.si, _ypw.cfe, _ypw.cfs, _ypw.si, _ypx.cfe,
_ypx.cfs, _ypx.si, _ypy.cfe, _ypy.cfs, _ypy.si, segments_2]}, {indexVersion=1406477990053,generation=3,filelist=[_bta.fdt,
_bta.fdx, _bta.fnm, _bta.si, _bta_Lucene41_0.doc, _bta_Lucene41_0.tim, _bta_Lucene41_0.tip,
_bta_nrm.cfe, _bta_nrm.cfs, _nik.cfe, _nik.cfs, _nik.si, _ypc.cfe, _ypc.cfs, _ypc.si, _ypu.cfe,
_ypu.cfs, _ypu.si, _ypv.cfe, _ypv.cfs, _ypv.si, _ypw.cfe, _ypw.cfs, _ypw.si, _ypx.cfe, _ypx.cfs,
_ypx.si, _ypy.cfe, _ypy.cfs, _ypy.si, segments_3]}]>
>         at __randomizedtesting.SeedInfo.seed([E4FFCDCA8EC968BC:C128D6FAFE8166BF]:0)
>         at org.junit.Assert.fail(Assert.java:93)
>         at org.junit.Assert.failNotEquals(Assert.java:647)
>         at org.junit.Assert.assertEquals(Assert.java:128)
>         at org.junit.Assert.assertEquals(Assert.java:147)
>         at org.apache.solr.handler.TestReplicationHandler.doTestReplicateAfterCoreReload(TestReplicationHandler.java:1190)
>         at sun.reflect.NativeMethodAccessorImpl.invoke0(Native Method)
> {code}
> https://builds.apache.org/job/Lucene-Solr-NightlyTests-4.x/585/



--
This message was sent by Atlassian JIRA
(v6.3.15#6346)

---------------------------------------------------------------------
To unsubscribe, e-mail: dev-unsubscribe@lucene.apache.org
For additional commands, e-mail: dev-help@lucene.apache.org


Mime
View raw message