lucene-dev mailing list archives

Site index · List index
Message view « Date » · « Thread »
Top « Date » · « Thread »
From David Smiley <david.w.smi...@gmail.com>
Subject Re: [JENKINS] Lucene-Solr-6.x-Windows (64bit/jdk1.8.0_121) - Build # 786 - Still Unstable!
Date Sat, 18 Mar 2017 19:21:51 GMT
I *think* I fixed this one... we'll see if anything else comes up.
Frustratingly I can't reproduce anything but I'm in the process of getting
a Windows VM for the purposes of reproducing test failures.

On Fri, Mar 17, 2017 at 6:43 PM Policeman Jenkins Server <
jenkins@thetaphi.de> wrote:

> Build: https://jenkins.thetaphi.de/job/Lucene-Solr-6.x-Windows/786/
> Java: 64bit/jdk1.8.0_121 -XX:-UseCompressedOops -XX:+UseSerialGC
>
> 1 tests failed.
> FAILED:  junit.framework.TestSuite.org.apache.solr.search.LargeFieldTest
>
> Error Message:
> Illegal char <?> at index 17: ignoredSchemaName?
>
> Stack Trace:
> java.nio.file.InvalidPathException: Illegal char <?> at index 17:
> ignoredSchemaName?
>         at __randomizedtesting.SeedInfo.seed([3C219A465C77DEEB]:0)
>         at
> sun.nio.fs.WindowsPathParser.normalize(WindowsPathParser.java:182)
>         at sun.nio.fs.WindowsPathParser.parse(WindowsPathParser.java:153)
>         at sun.nio.fs.WindowsPathParser.parse(WindowsPathParser.java:77)
>         at sun.nio.fs.WindowsPath.parse(WindowsPath.java:94)
>         at sun.nio.fs.WindowsFileSystem.getPath(WindowsFileSystem.java:255)
>         at sun.nio.fs.AbstractPath.resolve(AbstractPath.java:53)
>         at
> org.apache.solr.core.SolrResourceLoader.openResource(SolrResourceLoader.java:385)
>         at
> org.apache.solr.core.SolrResourceLoader.openSchema(SolrResourceLoader.java:353)
>         at
> org.apache.solr.schema.ManagedIndexSchemaFactory.warnIfNonManagedSchemaExists(ManagedIndexSchemaFactory.java:241)
>         at
> org.apache.solr.schema.ManagedIndexSchemaFactory.readSchemaLocally(ManagedIndexSchemaFactory.java:198)
>         at
> org.apache.solr.schema.ManagedIndexSchemaFactory.create(ManagedIndexSchemaFactory.java:118)
>         at
> org.apache.solr.schema.ManagedIndexSchemaFactory.create(ManagedIndexSchemaFactory.java:45)
>         at
> org.apache.solr.schema.IndexSchemaFactory.buildIndexSchema(IndexSchemaFactory.java:75)
>         at org.apache.solr.util.TestHarness.<init>(TestHarness.java:109)
>         at
> org.apache.solr.SolrTestCaseJ4.createCore(SolrTestCaseJ4.java:704)
>         at org.apache.solr.SolrTestCaseJ4.initCore(SolrTestCaseJ4.java:694)
>         at org.apache.solr.SolrTestCaseJ4.initCore(SolrTestCaseJ4.java:568)
>         at org.apache.solr.SolrTestCaseJ4.initCore(SolrTestCaseJ4.java:557)
>         at
> org.apache.solr.search.LargeFieldTest.initManagedSchemaCore(LargeFieldTest.java:48)
>         at sun.reflect.NativeMethodAccessorImpl.invoke0(Native Method)
>         at
> sun.reflect.NativeMethodAccessorImpl.invoke(NativeMethodAccessorImpl.java:62)
>         at
> sun.reflect.DelegatingMethodAccessorImpl.invoke(DelegatingMethodAccessorImpl.java:43)
>         at java.lang.reflect.Method.invoke(Method.java:498)
>         at
> com.carrotsearch.randomizedtesting.RandomizedRunner.invoke(RandomizedRunner.java:1713)
>         at
> com.carrotsearch.randomizedtesting.RandomizedRunner$6.evaluate(RandomizedRunner.java:847)
>         at
> com.carrotsearch.randomizedtesting.RandomizedRunner$7.evaluate(RandomizedRunner.java:863)
>         at
> com.carrotsearch.randomizedtesting.rules.StatementAdapter.evaluate(StatementAdapter.java:36)
>         at
> com.carrotsearch.randomizedtesting.rules.SystemPropertiesRestoreRule$1.evaluate(SystemPropertiesRestoreRule.java:57)
>         at
> org.apache.lucene.util.AbstractBeforeAfterRule$1.evaluate(AbstractBeforeAfterRule.java:45)
>         at
> com.carrotsearch.randomizedtesting.rules.StatementAdapter.evaluate(StatementAdapter.java:36)
>         at
> org.apache.lucene.util.TestRuleStoreClassName$1.evaluate(TestRuleStoreClassName.java:41)
>         at
> com.carrotsearch.randomizedtesting.rules.NoShadowingOrOverridesOnMethodsRule$1.evaluate(NoShadowingOrOverridesOnMethodsRule.java:40)
>         at
> com.carrotsearch.randomizedtesting.rules.NoShadowingOrOverridesOnMethodsRule$1.evaluate(NoShadowingOrOverridesOnMethodsRule.java:40)
>         at
> com.carrotsearch.randomizedtesting.rules.StatementAdapter.evaluate(StatementAdapter.java:36)
>         at
> com.carrotsearch.randomizedtesting.rules.StatementAdapter.evaluate(StatementAdapter.java:36)
>         at
> com.carrotsearch.randomizedtesting.rules.StatementAdapter.evaluate(StatementAdapter.java:36)
>         at
> org.apache.lucene.util.TestRuleAssertionsRequired$1.evaluate(TestRuleAssertionsRequired.java:53)
>         at
> org.apache.lucene.util.TestRuleMarkFailure$1.evaluate(TestRuleMarkFailure.java:47)
>         at
> org.apache.lucene.util.TestRuleIgnoreAfterMaxFailures$1.evaluate(TestRuleIgnoreAfterMaxFailures.java:64)
>         at
> org.apache.lucene.util.TestRuleIgnoreTestSuites$1.evaluate(TestRuleIgnoreTestSuites.java:54)
>         at
> com.carrotsearch.randomizedtesting.rules.StatementAdapter.evaluate(StatementAdapter.java:36)
>         at
> com.carrotsearch.randomizedtesting.ThreadLeakControl$StatementRunner.run(ThreadLeakControl.java:368)
>         at java.lang.Thread.run(Thread.java:745)
>
>
>
>
> Build Log:
> [...truncated 13037 lines...]
>    [junit4] Suite: org.apache.solr.search.LargeFieldTest
>    [junit4]   2> Creating dataDir:
> C:\Users\jenkins\workspace\Lucene-Solr-6.x-Windows\solr\build\solr-core\test\J1\temp\solr.search.LargeFieldTest_3C219A465C77DEEB-001\init-core-data-001
>    [junit4]   2> 2633897 WARN
> (SUITE-LargeFieldTest-seed#[3C219A465C77DEEB]-worker) [    ]
> o.a.s.SolrTestCaseJ4 startTrackingSearchers: numOpens=7 numCloses=7
>    [junit4]   2> 2633897 INFO
> (SUITE-LargeFieldTest-seed#[3C219A465C77DEEB]-worker) [    ]
> o.a.s.SolrTestCaseJ4 Using PointFields
>    [junit4]   2> 2633903 INFO
> (SUITE-LargeFieldTest-seed#[3C219A465C77DEEB]-worker) [    ]
> o.a.s.SolrTestCaseJ4 Randomized ssl (false) and clientAuth (false) via:
> @org.apache.solr.util.RandomizeSSL(reason=, value=NaN, ssl=NaN,
> clientAuth=NaN)
>    [junit4]   2> 2633905 INFO
> (SUITE-LargeFieldTest-seed#[3C219A465C77DEEB]-worker) [    ]
> o.a.s.SolrTestCaseJ4 ####initCore
>    [junit4]   2> 2633906 INFO
> (SUITE-LargeFieldTest-seed#[3C219A465C77DEEB]-worker) [    ]
> o.a.s.c.SolrResourceLoader [null] Added 2 libs to classloader, from paths:
> [/C:/Users/jenkins/workspace/Lucene-Solr-6.x-Windows/solr/core/src/test-files/solr/collection1/lib,
> /C:/Users/jenkins/workspace/Lucene-Solr-6.x-Windows/solr/core/src/test-files/solr/collection1/lib/classes]
>    [junit4]   2> 2633962 INFO
> (SUITE-LargeFieldTest-seed#[3C219A465C77DEEB]-worker) [    ]
> o.a.s.c.SolrConfig Using Lucene MatchVersion: 6.6.0
>    [junit4]   2> 2633968 INFO
> (SUITE-LargeFieldTest-seed#[3C219A465C77DEEB]-worker) [    ]
> o.a.s.SolrTestCaseJ4 ###deleteCore
>    [junit4]   2> 2633968 INFO
> (SUITE-LargeFieldTest-seed#[3C219A465C77DEEB]-worker) [    ]
> o.a.s.SolrTestCaseJ4
> ------------------------------------------------------- Done waiting for
> tracked resources to be released
>    [junit4]   2> NOTE: test params are: codec=Asserting(Lucene62): {},
> docValues:{}, maxPointsInLeafNode=1091, maxMBSortInHeap=5.361922293973317,
> sim=RandomSimilarity(queryNorm=true,coord=yes): {}, locale=es-CL,
> timezone=Antarctica/DumontDUrville
>    [junit4]   2> NOTE: Windows 10 10.0 amd64/Oracle Corporation 1.8.0_121
> (64-bit)/cpus=3,threads=1,free=153085688,total=518979584
>    [junit4]   2> NOTE: All tests run in this JVM: [NoCacheHeaderTest,
> TestLMJelinekMercerSimilarityFactory, TestIndexSearcher,
> OpenCloseCoreStressTest, DistributedDebugComponentTest,
> TestJmxMonitoredMap, TestDistributedGrouping, TestExceedMaxTermLength,
> ShowFileRequestHandlerTest, TestDistribIDF, TestManagedResource,
> TestReversedWildcardFilterFactory, TermVectorComponentTest,
> ConnectionReuseTest, TestValueSourceCache, ZkStateReaderTest,
> TestRandomFaceting, TestReload, TestWriterPerf,
> PKIAuthenticationIntegrationTest, NotRequiredUniqueKeyTest,
> HdfsThreadLeakTest, DocExpirationUpdateProcessorFactoryTest,
> SuggesterTSTTest, TestMacroExpander, TestFieldCache,
> SpellCheckCollatorTest, TestTrie, SolrJmxReporterTest,
> TestLMDirichletSimilarityFactory, TestPathTrie, CircularListTest,
> TestQuerySenderListener, TestTestInjection, PreAnalyzedFieldTest,
> TestMinMaxOnMultiValuedField, TestOmitPositions,
> TestLeaderInitiatedRecoveryThread, AsyncCallRequestStatusResponseTest,
> TestNamedUpdateProcessors, TestUseDocValuesAsStored2, TestFilteredDocIdSet,
> TestExportWriter, TestPushWriter, TestXmlQParser,
> HdfsBasicDistributedZk2Test, LeaderFailureAfterFreshStartTest,
> TestSimpleQParserPlugin, AddSchemaFieldsUpdateProcessorFactoryTest,
> TestJsonFacetRefinement, TestMultiWordSynonyms, TestApiFramework,
> QueryParsingTest, TestStressCloudBlindAtomicUpdates,
> DataDrivenBlockJoinTest, TestDefaultSearchFieldResource, IndexSchemaTest,
> HdfsRecoverLeaseTest, TestRawTransformer, TestFieldTypeResource,
> RankQueryTest, TestJoin, DistributedQueryComponentCustomSortTest,
> DebugComponentTest, TestCollectionAPI, ShardSplitTest, SortByFunctionTest,
> TestSchemalessBufferedUpdates, TestAddFieldRealTimeGet,
> ClassificationUpdateProcessorTest, TestImplicitCoreProperties,
> CleanupOldIndexTest, ShufflingReplicaListTransformerTest, TestFastWriter,
> SolrMetricReporterTest, ReplaceNodeTest, TestSolrXml,
> DistributedFacetPivotLongTailTest, TestQuerySenderNoQuery, DeleteShardTest,
> TestMaxScoreQueryParser, BlockJoinFacetSimpleTest,
> TestBlendedInfixSuggestions, UpdateRequestProcessorFactoryTest,
> TestPointFields, HttpSolrCallGetCoreTest, LeaderElectionIntegrationTest,
> TestCloudPivotFacet, SolrGangliaReporterTest,
> TestTolerantUpdateProcessorRandomCloud, SolrXmlInZkTest,
> TestHashQParserPlugin, UpdateLogTest, TestUtils, TestLockTree,
> TestNumericTerms32, JsonValidatorTest, WrapperMergePolicyFactoryTest,
> StatsComponentTest, TestDFRSimilarityFactory, TestUnifiedSolrHighlighter,
> TestScoreJoinQPNoScore, TestSizeLimitedDistributedMap, TestRTimerTree,
> CoreAdminCreateDiscoverTest, TestCrossCoreJoin, TestMergePolicyConfig,
> DistributedTermsComponentTest, FullHLLTest, BadIndexSchemaTest,
> TestRangeQuery, TestReplicaProperties, DistribCursorPagingTest,
> ShardRoutingCustomTest, WordBreakSolrSpellCheckerTest, ConfigSetsAPITest,
> TestReloadAndDeleteDocs, SpellingQueryConverterTest, AutoCommitTest,
> CdcrReplicationHandlerTest, TestRandomCollapseQParserPlugin,
> ChaosMonkeySafeLeaderTest, TestHdfsBackupRestoreCore, MinimalSchemaTest,
> ParsingFieldUpdateProcessorsTest, TestManagedSchemaAPI, TestCloudRecovery,
> CollectionTooManyReplicasTest, TestSearchPerf, SuggesterWFSTTest,
> TestUninvertingReader, TestFieldCacheWithThreads, DistanceFunctionTest,
> TestJsonRequest, TestSolrConfigHandler, TestSolrCoreSnapshots,
> TestQueryTypes, BitVectorTest, BlockCacheTest,
> CoreMergeIndexesAdminHandlerTest, TestSolrCloudWithKerberosAlt,
> SolrIndexMetricsTest, JavabinLoaderTest, TestSegmentSorting,
> TestSolr4Spatial2, SSLMigrationTest, TestConfig,
> TriLevelCompositeIdRoutingTest, HdfsUnloadDistributedZkTest,
> HdfsLockFactoryTest, CacheHeaderTest, TestPerFieldSimilarityClassic,
> TestIndexingPerformance, FieldAnalysisRequestHandlerTest,
> TestReRankQParserPlugin, DeleteNodeTest, BasicDistributedZk2Test,
> TestPKIAuthenticationPlugin, JsonLoaderTest, DeleteInactiveReplicaTest,
> TestManagedSynonymFilterFactory, TestFuzzyAnalyzedSuggestions,
> OverseerRolesTest, BasicFunctionalityTest, CdcrVersionReplicationTest,
> TestSuggestSpellingConverter, TestBadConfig, SyncSliceTest, BasicZkTest,
> FullSolrCloudDistribCmdsTest, ClusterStateUpdateTest, ZkSolrClientTest,
> TestRandomDVFaceting, TestDistributedSearch, QueryElevationComponentTest,
> ConvertedLegacyTest, TestSort, TestFiltering, HighlighterTest,
> SoftAutoCommitTest, CurrencyFieldOpenExchangeTest,
> DistributedQueryElevationComponentTest, AnalysisAfterCoreReloadTest,
> SignatureUpdateProcessorFactoryTest, TestExtendedDismaxParser,
> CoreAdminHandlerTest, PolyFieldTest, TestUpdate,
> TestAtomicUpdateErrorCases, TestSolrDeletionPolicy1,
> XsltUpdateRequestHandlerTest, TestSurroundQueryParser, TestQueryUtils,
> DirectSolrSpellCheckerTest, DocumentAnalysisRequestHandlerTest,
> FileBasedSpellCheckerTest, DocumentBuilderTest, LoggingHandlerTest,
> ReturnFieldsTest, MBeansHandlerTest, BinaryUpdateRequestHandlerTest,
> CSVRequestHandlerTest, TestLFUCache, TestSolrDeletionPolicy2,
> NumericFieldsTest, ExternalFileFieldSortTest, TestPostingsSolrHighlighter,
> TestLuceneMatchVersion, TestCodecSupport, TestBM25SimilarityFactory,
> OpenExchangeRatesOrgProviderTest, TestFastLRUCache, TestSystemIdResolver,
> DateFieldTest, ClusterStateTest, TestLRUCache, UUIDFieldTest,
> DistributedIntervalFacetingTest, TestTolerantSearch,
> TestEmbeddedSolrServerSchemaAPI, ActionThrottleTest, AliasIntegrationTest,
> CloudExitableDirectoryReaderTest, CollectionReloadTest,
> CollectionsAPIAsyncDistributedZkTest, ConnectionManagerTest,
> CreateCollectionCleanupTest, DeleteLastCustomShardedReplicaTest,
> DeleteStatusTest, DistributedQueueTest, DocValuesNotIndexedTest,
> ForceLeaderTest, RemoteQueryErrorTest, RestartWhileUpdatingTest,
> RollingRestartTest, TestCryptoKeys, TestLeaderElectionWithEmptyReplica,
> TestMiniSolrCloudClusterSSL, TestRandomRequestDistribution,
> TestSSLRandomization, TestStressLiveNodes,
> TestTolerantUpdateProcessorCloud, TlogReplayBufferedWhileIndexingTest,
> HdfsBasicDistributedZkTest, HdfsChaosMonkeyNothingIsSafeTest,
> HdfsChaosMonkeySafeLeaderTest, HdfsCollectionsAPIDistributedZkTest,
> HdfsNNFailoverTest, HdfsRecoveryZkTest, HdfsRestartWhileUpdatingTest,
> HdfsSyncSliceTest, StressHdfsTest, ZkStateWriterTest, RulesTest,
> ConfigureRecoveryStrategyTest, CoreSorterTest, DirectoryFactoryTest,
> ExitableDirectoryReaderTest, HdfsDirectoryFactoryTest, QueryResultKeyTest,
> TestBackupRepositoryFactory, TestConfigOverlay, TestConfigSetImmutable,
> TestConfigSetProperties, TestConfigSets, TestCorePropertiesReload,
> TestCustomStream, RequestLoggingTest, TestBlobHandler, TestSQLHandler,
> TestSystemCollAutoCreate, InfoHandlerTest, MetricsHandlerTest,
> SegmentsInfoRequestHandlerTest, TestCollectionAPIs, TestConfigsApi,
> TestCoreAdminApis, DistributedExpandComponentTest,
> DistributedFacetExistsSmallTest, DistributedFacetPivotLargeTest,
> DistributedFacetPivotWhiteBoxTest, FacetPivotSmallTest,
> InfixSuggestersTest, ReplicaListTransformerTest,
> SuggestComponentContextFilterQueryTest,
> TestDistributedStatsComponentCardinality, TestFieldResource,
> TestSchemaNameResource, TestSchemaSimilarityResource,
> TestSolrQueryParserResource, BadCopyFieldTest, BooleanFieldTest,
> EnumFieldTest, TestBulkSchemaConcurrent, TestCollationFieldDocValues,
> TestSchemaManager, AnalyticsQueryTest, LargeFieldTest]
>    [junit4]   2> NOTE: reproduce with: ant test  -Dtestcase=LargeFieldTest
> -Dtests.seed=3C219A465C77DEEB -Dtests.slow=true -Dtests.locale=es-CL
> -Dtests.timezone=Antarctica/DumontDUrville -Dtests.asserts=true
> -Dtests.file.encoding=UTF-8
>    [junit4] ERROR   0.00s J1 | LargeFieldTest (suite) <<<
>    [junit4]    > Throwable #1: java.nio.file.InvalidPathException: Illegal
> char <?> at index 17: ignoredSchemaName?
>    [junit4]    >        at
> __randomizedtesting.SeedInfo.seed([3C219A465C77DEEB]:0)
>    [junit4]    >        at
> sun.nio.fs.WindowsPathParser.normalize(WindowsPathParser.java:182)
>    [junit4]    >        at
> sun.nio.fs.WindowsPathParser.parse(WindowsPathParser.java:153)
>    [junit4]    >        at
> sun.nio.fs.WindowsPathParser.parse(WindowsPathParser.java:77)
>    [junit4]    >        at
> sun.nio.fs.WindowsPath.parse(WindowsPath.java:94)
>    [junit4]    >        at
> sun.nio.fs.WindowsFileSystem.getPath(WindowsFileSystem.java:255)
>    [junit4]    >        at
> sun.nio.fs.AbstractPath.resolve(AbstractPath.java:53)
>    [junit4]    >        at
> org.apache.solr.core.SolrResourceLoader.openResource(SolrResourceLoader.java:385)
>    [junit4]    >        at
> org.apache.solr.core.SolrResourceLoader.openSchema(SolrResourceLoader.java:353)
>    [junit4]    >        at
> org.apache.solr.schema.ManagedIndexSchemaFactory.warnIfNonManagedSchemaExists(ManagedIndexSchemaFactory.java:241)
>    [junit4]    >        at
> org.apache.solr.schema.ManagedIndexSchemaFactory.readSchemaLocally(ManagedIndexSchemaFactory.java:198)
>    [junit4]    >        at
> org.apache.solr.schema.ManagedIndexSchemaFactory.create(ManagedIndexSchemaFactory.java:118)
>    [junit4]    >        at
> org.apache.solr.schema.ManagedIndexSchemaFactory.create(ManagedIndexSchemaFactory.java:45)
>    [junit4]    >        at
> org.apache.solr.schema.IndexSchemaFactory.buildIndexSchema(IndexSchemaFactory.java:75)
>    [junit4]    >        at
> org.apache.solr.util.TestHarness.<init>(TestHarness.java:109)
>    [junit4]    >        at
> org.apache.solr.SolrTestCaseJ4.createCore(SolrTestCaseJ4.java:704)
>    [junit4]    >        at
> org.apache.solr.SolrTestCaseJ4.initCore(SolrTestCaseJ4.java:694)
>    [junit4]    >        at
> org.apache.solr.SolrTestCaseJ4.initCore(SolrTestCaseJ4.java:568)
>    [junit4]    >        at
> org.apache.solr.SolrTestCaseJ4.initCore(SolrTestCaseJ4.java:557)
>    [junit4]    >        at
> org.apache.solr.search.LargeFieldTest.initManagedSchemaCore(LargeFieldTest.java:48)
>    [junit4]    >        at java.lang.Thread.run(Thread.java:745)
>    [junit4] Completed [636/700 (1!)] on J1 in 0.09s, 0 tests, 1 error <<<
> FAILURES!
>
> [...truncated 62914 lines...]
>
>
> ---------------------------------------------------------------------
> To unsubscribe, e-mail: dev-unsubscribe@lucene.apache.org
> For additional commands, e-mail: dev-help@lucene.apache.org

-- 
Lucene/Solr Search Committer, Consultant, Developer, Author, Speaker
LinkedIn: http://linkedin.com/in/davidwsmiley | Book:
http://www.solrenterprisesearchserver.com

Mime
View raw message