lucene-dev mailing list archives

Site index · List index
Message view « Date » · « Thread »
Top « Date » · « Thread »
From Policeman Jenkins Server <jenk...@thetaphi.de>
Subject [JENKINS] Lucene-Solr-master-Windows (64bit/jdk1.8.0_121) - Build # 6432 - Still unstable!
Date Fri, 03 Mar 2017 20:43:02 GMT
Build: https://jenkins.thetaphi.de/job/Lucene-Solr-master-Windows/6432/
Java: 64bit/jdk1.8.0_121 -XX:-UseCompressedOops -XX:+UseParallelGC

1 tests failed.
FAILED:  org.apache.solr.handler.extraction.ExtractingRequestHandlerTest.testExtraction

Error Message:
Exception during query

Stack Trace:
java.lang.RuntimeException: Exception during query
	at __randomizedtesting.SeedInfo.seed([26E977516A9A7635:9F9A032F16B2A6C0]:0)
	at org.apache.solr.SolrTestCaseJ4.assertQ(SolrTestCaseJ4.java:919)
	at org.apache.solr.SolrTestCaseJ4.assertQ(SolrTestCaseJ4.java:886)
	at org.apache.solr.handler.extraction.ExtractingRequestHandlerTest.testExtraction(ExtractingRequestHandlerTest.java:128)
	at sun.reflect.NativeMethodAccessorImpl.invoke0(Native Method)
	at sun.reflect.NativeMethodAccessorImpl.invoke(NativeMethodAccessorImpl.java:62)
	at sun.reflect.DelegatingMethodAccessorImpl.invoke(DelegatingMethodAccessorImpl.java:43)
	at java.lang.reflect.Method.invoke(Method.java:498)
	at com.carrotsearch.randomizedtesting.RandomizedRunner.invoke(RandomizedRunner.java:1713)
	at com.carrotsearch.randomizedtesting.RandomizedRunner$8.evaluate(RandomizedRunner.java:907)
	at com.carrotsearch.randomizedtesting.RandomizedRunner$9.evaluate(RandomizedRunner.java:943)
	at com.carrotsearch.randomizedtesting.RandomizedRunner$10.evaluate(RandomizedRunner.java:957)
	at com.carrotsearch.randomizedtesting.rules.SystemPropertiesRestoreRule$1.evaluate(SystemPropertiesRestoreRule.java:57)
	at org.apache.lucene.util.TestRuleSetupTeardownChained$1.evaluate(TestRuleSetupTeardownChained.java:49)
	at org.apache.lucene.util.AbstractBeforeAfterRule$1.evaluate(AbstractBeforeAfterRule.java:45)
	at org.apache.lucene.util.TestRuleThreadAndTestName$1.evaluate(TestRuleThreadAndTestName.java:48)
	at org.apache.lucene.util.TestRuleIgnoreAfterMaxFailures$1.evaluate(TestRuleIgnoreAfterMaxFailures.java:64)
	at org.apache.lucene.util.TestRuleMarkFailure$1.evaluate(TestRuleMarkFailure.java:47)
	at com.carrotsearch.randomizedtesting.rules.StatementAdapter.evaluate(StatementAdapter.java:36)
	at com.carrotsearch.randomizedtesting.ThreadLeakControl$StatementRunner.run(ThreadLeakControl.java:368)
	at com.carrotsearch.randomizedtesting.ThreadLeakControl.forkTimeoutingTask(ThreadLeakControl.java:817)
	at com.carrotsearch.randomizedtesting.ThreadLeakControl$3.evaluate(ThreadLeakControl.java:468)
	at com.carrotsearch.randomizedtesting.RandomizedRunner.runSingleTest(RandomizedRunner.java:916)
	at com.carrotsearch.randomizedtesting.RandomizedRunner$5.evaluate(RandomizedRunner.java:802)
	at com.carrotsearch.randomizedtesting.RandomizedRunner$6.evaluate(RandomizedRunner.java:852)
	at com.carrotsearch.randomizedtesting.RandomizedRunner$7.evaluate(RandomizedRunner.java:863)
	at com.carrotsearch.randomizedtesting.rules.StatementAdapter.evaluate(StatementAdapter.java:36)
	at com.carrotsearch.randomizedtesting.rules.SystemPropertiesRestoreRule$1.evaluate(SystemPropertiesRestoreRule.java:57)
	at org.apache.lucene.util.AbstractBeforeAfterRule$1.evaluate(AbstractBeforeAfterRule.java:45)
	at com.carrotsearch.randomizedtesting.rules.StatementAdapter.evaluate(StatementAdapter.java:36)
	at org.apache.lucene.util.TestRuleStoreClassName$1.evaluate(TestRuleStoreClassName.java:41)
	at com.carrotsearch.randomizedtesting.rules.NoShadowingOrOverridesOnMethodsRule$1.evaluate(NoShadowingOrOverridesOnMethodsRule.java:40)
	at com.carrotsearch.randomizedtesting.rules.NoShadowingOrOverridesOnMethodsRule$1.evaluate(NoShadowingOrOverridesOnMethodsRule.java:40)
	at com.carrotsearch.randomizedtesting.rules.StatementAdapter.evaluate(StatementAdapter.java:36)
	at com.carrotsearch.randomizedtesting.rules.StatementAdapter.evaluate(StatementAdapter.java:36)
	at com.carrotsearch.randomizedtesting.rules.StatementAdapter.evaluate(StatementAdapter.java:36)
	at org.apache.lucene.util.TestRuleAssertionsRequired$1.evaluate(TestRuleAssertionsRequired.java:53)
	at org.apache.lucene.util.TestRuleMarkFailure$1.evaluate(TestRuleMarkFailure.java:47)
	at org.apache.lucene.util.TestRuleIgnoreAfterMaxFailures$1.evaluate(TestRuleIgnoreAfterMaxFailures.java:64)
	at org.apache.lucene.util.TestRuleIgnoreTestSuites$1.evaluate(TestRuleIgnoreTestSuites.java:54)
	at com.carrotsearch.randomizedtesting.rules.StatementAdapter.evaluate(StatementAdapter.java:36)
	at com.carrotsearch.randomizedtesting.ThreadLeakControl$StatementRunner.run(ThreadLeakControl.java:368)
	at java.lang.Thread.run(Thread.java:745)
Caused by: java.lang.RuntimeException: REQUEST FAILED: xpath=//doc[1]/str[.='simple3']
	xml response was: <?xml version="1.0" encoding="UTF-8"?>
<response>
<lst name="responseHeader"><int name="status">0</int><int name="QTime">0</int></lst><result
name="response" numFound="2" start="0"><doc><arr name="t_meta"><str>stream_size</str><str>365</str><str>X-Parsed-By</str><str>org.apache.tika.parser.DefaultParser</str><str>X-Parsed-By</str><str>org.apache.tika.parser.html.HtmlParser</str><str>stream_content_type</str><str>application/xml</str><str>stream_name</str><str>simple.html</str><str>stream_source_info</str><str>file:/C:/Users/jenkins/workspace/Lucene-Solr-master-Windows/solr/contrib/extraction/src/test-files/extraction/simple.html</str><str>dc:title</str><str>Welcome
to Solr</str><str>Content-Encoding</str><str>ISO-8859-1</str><str>Content-Type</str><str>text/html;
charset=ISO-8859-1</str></arr><arr name="t_href"><str>rect</str><str>http://www.apache.org</str></arr><str
name="id">simple2</str><arr name="stream_size"><str>365</str></arr><arr
name="t_x_parsed_by"><str>org.apache.tika.parser.DefaultParser</str><str>org.apache.tika.parser.html.HtmlParser</str></arr><arr
name="stream_content_type"><str>application/xml</str></arr><arr name="stream_name"><str>simple.html</str></arr><arr
name="stream_source_info"><str>file:/C:/Users/jenkins/workspace/Lucene-Solr-master-Windows/solr/contrib/extraction/src/test-files/extraction/simple.html</str></arr><arr
name="t_dc_title"><str>Welcome to Solr</str></arr><arr name="t_content_encoding"><str>ISO-8859-1</str></arr><arr
name="title"><str>Welcome to Solr</str></arr><arr name="t_abcxyz"><str>text/html;
charset=ISO-8859-1</str></arr><arr name="t_content"><str> 
 
  
  
  
  
  
  
  
  
  
 Welcome to Solr 
 
 
 
  Here is some text
 

 distinct
words 

 Here is some text in a div 

 This has a  link . 

  </str></arr><arr name="multiDefault"><str>muLti-Default</str></arr><int
name="intDefault">42</int><date name="timestamp">2017-03-03T20:19:11.728Z</date></doc><doc><arr
name="t_meta"><str>stream_size</str><str>365</str><str>X-Parsed-By</str><str>org.apache.tika.parser.DefaultParser</str><str>X-Parsed-By</str><str>org.apache.tika.parser.html.HtmlParser</str><str>stream_content_type</str><str>application/xml</str><str>stream_name</str><str>simple.html</str><str>stream_source_info</str><str>file:/C:/Users/jenkins/workspace/Lucene-Solr-master-Windows/solr/contrib/extraction/src/test-files/extraction/simple.html</str><str>dc:title</str><str>Welcome
to Solr</str><str>Content-Encoding</str><str>ISO-8859-1</str><str>Content-Type</str><str>text/html;
charset=ISO-8859-1</str></arr><arr name="t_href"><str>rect</str><str>http://www.apache.org</str></arr><str
name="id">simple3</str><arr name="stream_size"><str>365</str></arr><arr
name="t_x_parsed_by"><str>org.apache.tika.parser.DefaultParser</str><str>org.apache.tika.parser.html.HtmlParser</str></arr><arr
name="stream_content_type"><str>application/xml</str></arr><arr name="stream_name"><str>simple.html</str></arr><arr
name="stream_source_info"><str>file:/C:/Users/jenkins/workspace/Lucene-Solr-master-Windows/solr/contrib/extraction/src/test-files/extraction/simple.html</str></arr><arr
name="t_dc_title"><str>Welcome to Solr</str></arr><arr name="t_content_encoding"><str>ISO-8859-1</str></arr><arr
name="title"><str>Welcome to Solr</str></arr><arr name="t_content_type"><str>text/html;
charset=ISO-8859-1</str></arr><arr name="t_content"><str> 
 
  
  
  
  
  
  
  
  
  
 Welcome to Solr 
 
 
 
  Here is some text
 

 distinct
words 

 Here is some text in a div 

 This has a  link . 

  </str></arr><arr name="multiDefault"><str>muLti-Default</str></arr><int
name="intDefault">42</int><date name="timestamp">2017-03-03T20:19:11.892Z</date></doc></result>
</response>

	request was:q=t_href:http&qt=standard&start=0&rows=20&version=2.2
	at org.apache.solr.SolrTestCaseJ4.assertQ(SolrTestCaseJ4.java:912)
	... 41 more




Build Log:
[...truncated 18360 lines...]
   [junit4] Suite: org.apache.solr.handler.extraction.ExtractingRequestHandlerTest
   [junit4]   2> Creating dataDir: C:\Users\jenkins\workspace\Lucene-Solr-master-Windows\solr\build\contrib\solr-cell\test\J0\temp\solr.handler.extraction.ExtractingRequestHandlerTest_26E977516A9A7635-001\init-core-data-001
   [junit4]   2> log4j:WARN No appenders could be found for logger (org.apache.solr.SolrTestCaseJ4).
   [junit4]   2> log4j:WARN Please initialize the log4j system properly.
   [junit4]   2> log4j:WARN See http://logging.apache.org/log4j/1.2/faq.html#noconfig for
more info.
   [junit4]   2> NOTE: reproduce with: ant test  -Dtestcase=ExtractingRequestHandlerTest
-Dtests.method=testExtraction -Dtests.seed=26E977516A9A7635 -Dtests.slow=true -Dtests.locale=bg
-Dtests.timezone=Etc/GMT-4 -Dtests.asserts=true -Dtests.file.encoding=Cp1252
   [junit4] ERROR   1.06s J0 | ExtractingRequestHandlerTest.testExtraction <<<
   [junit4]    > Throwable #1: java.lang.RuntimeException: Exception during query
   [junit4]    > 	at __randomizedtesting.SeedInfo.seed([26E977516A9A7635:9F9A032F16B2A6C0]:0)
   [junit4]    > 	at org.apache.solr.SolrTestCaseJ4.assertQ(SolrTestCaseJ4.java:919)
   [junit4]    > 	at org.apache.solr.SolrTestCaseJ4.assertQ(SolrTestCaseJ4.java:886)
   [junit4]    > 	at org.apache.solr.handler.extraction.ExtractingRequestHandlerTest.testExtraction(ExtractingRequestHandlerTest.java:128)
   [junit4]    > 	at java.lang.Thread.run(Thread.java:745)
   [junit4]    > Caused by: java.lang.RuntimeException: REQUEST FAILED: xpath=//doc[1]/str[.='simple3']
   [junit4]    > 	xml response was: <?xml version="1.0" encoding="UTF-8"?>
   [junit4]    > <response>
   [junit4]    > <lst name="responseHeader"><int name="status">0</int><int
name="QTime">0</int></lst><result name="response" numFound="2" start="0"><doc><arr
name="t_meta"><str>stream_size</str><str>365</str><str>X-Parsed-By</str><str>org.apache.tika.parser.DefaultParser</str><str>X-Parsed-By</str><str>org.apache.tika.parser.html.HtmlParser</str><str>stream_content_type</str><str>application/xml</str><str>stream_name</str><str>simple.html</str><str>stream_source_info</str><str>file:/C:/Users/jenkins/workspace/Lucene-Solr-master-Windows/solr/contrib/extraction/src/test-files/extraction/simple.html</str><str>dc:title</str><str>Welcome
to Solr</str><str>Content-Encoding</str><str>ISO-8859-1</str><str>Content-Type</str><str>text/html;
charset=ISO-8859-1</str></arr><arr name="t_href"><str>rect</str><str>http://www.apache.org</str></arr><str
name="id">simple2</str><arr name="stream_size"><str>365</str></arr><arr
name="t_x_parsed_by"><str>org.apache.tika.parser.DefaultParser</str><str>org.apache.tika.parser.html.HtmlParser</str></arr><arr
name="stream_content_type"><str>application/xml</str></arr><arr name="stream_name"><str>simple.html</str></arr><arr
name="stream_source_info"><str>file:/C:/Users/jenkins/workspace/Lucene-Solr-master-Windows/solr/contrib/extraction/src/test-files/extraction/simple.html</str></arr><arr
name="t_dc_title"><str>Welcome to Solr</str></arr><arr name="t_content_encoding"><str>ISO-8859-1</str></arr><arr
name="title"><str>Welcome to Solr</str></arr><arr name="t_abcxyz"><str>text/html;
charset=ISO-8859-1</str></arr><arr name="t_content"><str> 
   [junit4]    >  
   [junit4]    >   
   [junit4]    >   
   [junit4]    >   
   [junit4]    >   
   [junit4]    >   
   [junit4]    >   
   [junit4]    >   
   [junit4]    >   
   [junit4]    >   
   [junit4]    >  Welcome to Solr 
   [junit4]    >  
   [junit4]    >  
   [junit4]    >  
   [junit4]    >   Here is some text
   [junit4]    >  
   [junit4]    >  distinct
   [junit4]    > words 
   [junit4]    >  Here is some text in a div 
   [junit4]    >  This has a  link . 
   [junit4]    >   </str></arr><arr name="multiDefault"><str>muLti-Default</str></arr><int
name="intDefault">42</int><date name="timestamp">2017-03-03T20:19:11.728Z</date></doc><doc><arr
name="t_meta"><str>stream_size</str><str>365</str><str>X-Parsed-By</str><str>org.apache.tika.parser.DefaultParser</str><str>X-Parsed-By</str><str>org.apache.tika.parser.html.HtmlParser</str><str>stream_content_type</str><str>application/xml</str><str>stream_name</str><str>simple.html</str><str>stream_source_info</str><str>file:/C:/Users/jenkins/workspace/Lucene-Solr-master-Windows/solr/contrib/extraction/src/test-files/extraction/simple.html</str><str>dc:title</str><str>Welcome
to Solr</str><str>Content-Encoding</str><str>ISO-8859-1</str><str>Content-Type</str><str>text/html;
charset=ISO-8859-1</str></arr><arr name="t_href"><str>rect</str><str>http://www.apache.org</str></arr><str
name="id">simple3</str><arr name="stream_size"><str>365</str></arr><arr
name="t_x_parsed_by"><str>org.apache.tika.parser.DefaultParser</str><str>org.apache.tika.parser.html.HtmlParser</str></arr><arr
name="stream_content_type"><str>application/xml</str></arr><arr name="stream_name"><str>simple.html</str></arr><arr
name="stream_source_info"><str>file:/C:/Users/jenkins/workspace/Lucene-Solr-master-Windows/solr/contrib/extraction/src/test-files/extraction/simple.html</str></arr><arr
name="t_dc_title"><str>Welcome to Solr</str></arr><arr name="t_content_encoding"><str>ISO-8859-1</str></arr><arr
name="title"><str>Welcome to Solr</str></arr><arr name="t_content_type"><str>text/html;
charset=ISO-8859-1</str></arr><arr name="t_content"><str> 
   [junit4]    >  
   [junit4]    >   
   [junit4]    >   
   [junit4]    >   
   [junit4]    >   
   [junit4]    >   
   [junit4]    >   
   [junit4]    >   
   [junit4]    >   
   [junit4]    >   
   [junit4]    >  Welcome to Solr 
   [junit4]    >  
   [junit4]    >  
   [junit4]    >  
   [junit4]    >   Here is some text
   [junit4]    >  
   [junit4]    >  distinct
   [junit4]    > words 
   [junit4]    >  Here is some text in a div 
   [junit4]    >  This has a  link . 
   [junit4]    >   </str></arr><arr name="multiDefault"><str>muLti-Default</str></arr><int
name="intDefault">42</int><date name="timestamp">2017-03-03T20:19:11.892Z</date></doc></result>
   [junit4]    > </response>
   [junit4]    > 	request was:q=t_href:http&qt=standard&start=0&rows=20&version=2.2
   [junit4]    > 	at org.apache.solr.SolrTestCaseJ4.assertQ(SolrTestCaseJ4.java:912)
   [junit4]    > 	... 41 more
   [junit4]   2> NOTE: leaving temporary files on disk at: C:\Users\jenkins\workspace\Lucene-Solr-master-Windows\solr\build\contrib\solr-cell\test\J0\temp\solr.handler.extraction.ExtractingRequestHandlerTest_26E977516A9A7635-001
   [junit4]   2> NOTE: test params are: codec=Asserting(Lucene70): {extractionLiteralMV=Lucene50(blocksize=128),
stream_content_type=Lucene50(blocksize=128), multiDefault=FST50, subject=FST50, intDefault=BlockTreeOrds(blocksize=128),
t_href=BlockTreeOrds(blocksize=128), title=FST50, extractedContent=Lucene50(blocksize=128),
stream_name=BlockTreeOrds(blocksize=128), t_X-Parsed-By=Lucene50(blocksize=128), bar_s=Lucene50(blocksize=128),
Content-Encoding=Lucene50(blocksize=128), t_dc_title=Lucene50(blocksize=128), t_content_type=Lucene50(blocksize=128),
id=Lucene50(blocksize=128), extractedProducer=BlockTreeOrds(blocksize=128), text=PostingsFormat(name=LuceneVarGapFixedInterval),
Content-Type=BlockTreeOrds(blocksize=128), timestamp=BlockTreeOrds(blocksize=128), stream_size=FST50,
extractedAuthor=Lucene50(blocksize=128), extractedKeywords=BlockTreeOrds(blocksize=128), t_content_encoding=FST50,
stream_source_info=PostingsFormat(name=LuceneVarGapFixedInterval), t_content=BlockTreeOrds(blocksize=128),
resourceName=Lucene50(blocksize=128), foo_t=Lucene50(blocksize=128), foo_s=BlockTreeOrds(blocksize=128),
title_lettertok=Lucene50(blocksize=128), extractedCreator=FST50, t_meta=FST50, t_abcxyz=BlockTreeOrds(blocksize=128),
t_dc:title=FST50, wdf_nocase=Lucene50(blocksize=128), extractedDate=BlockTreeOrds(blocksize=128),
div_t=BlockTreeOrds(blocksize=128), title_stemmed=FST50, anchor_t=BlockTreeOrds(blocksize=128),
t_x_parsed_by=PostingsFormat(name=LuceneVarGapFixedInterval), zot_s=Lucene50(blocksize=128),
extractionLiteral=FST50, defaultExtr=BlockTreeOrds(blocksize=128)}, docValues:{}, maxPointsInLeafNode=672,
maxMBSortInHeap=5.047737019885842, sim=RandomSimilarity(queryNorm=false): {}, locale=bg, timezone=Etc/GMT-4
   [junit4]   2> NOTE: Windows 10 10.0 amd64/Oracle Corporation 1.8.0_121 (64-bit)/cpus=3,threads=1,free=169646824,total=257949696
   [junit4]   2> NOTE: All tests run in this JVM: [ExtractingRequestHandlerTest]
   [junit4] Completed [3/4 (1!)] on J0 in 23.72s, 16 tests, 1 error <<< FAILURES!

[...truncated 57400 lines...]


Mime
View raw message