lucene-dev mailing list archives

Site index · List index
Message view « Date » · « Thread »
Top « Date » · « Thread »
From Policeman Jenkins Server <jenk...@thetaphi.de>
Subject [JENKINS-EA] Lucene-Solr-master-Linux (64bit/jdk-9-ea+160) - Build # 19196 - Unstable!
Date Sat, 18 Mar 2017 02:51:33 GMT
Build: https://jenkins.thetaphi.de/job/Lucene-Solr-master-Linux/19196/
Java: 64bit/jdk-9-ea+160 -XX:-UseCompressedOops -XX:+UseSerialGC

1 tests failed.
FAILED:  org.apache.solr.update.TestInPlaceUpdatesDistrib.test

Error Message:
inplace_updatable_float didn't match for replica at client: https://127.0.0.1:42339/collection1 expected:<109.0> but was:<1.0>

Stack Trace:
java.lang.AssertionError: inplace_updatable_float didn't match for replica at client: https://127.0.0.1:42339/collection1 expected:<109.0> but was:<1.0>
	at __randomizedtesting.SeedInfo.seed([D5030D312D037BD7:5D5732EB83FF162F]:0)
	at org.junit.Assert.fail(Assert.java:93)
	at org.junit.Assert.failNotEquals(Assert.java:647)
	at org.junit.Assert.assertEquals(Assert.java:128)
	at org.apache.solr.update.TestInPlaceUpdatesDistrib.assertReplicaValue(TestInPlaceUpdatesDistrib.java:1005)
	at org.apache.solr.update.TestInPlaceUpdatesDistrib.outOfOrderUpdatesIndividualReplicaTest(TestInPlaceUpdatesDistrib.java:665)
	at org.apache.solr.update.TestInPlaceUpdatesDistrib.test(TestInPlaceUpdatesDistrib.java:162)
	at java.base/jdk.internal.reflect.NativeMethodAccessorImpl.invoke0(Native Method)
	at java.base/jdk.internal.reflect.NativeMethodAccessorImpl.invoke(NativeMethodAccessorImpl.java:62)
	at java.base/jdk.internal.reflect.DelegatingMethodAccessorImpl.invoke(DelegatingMethodAccessorImpl.java:43)
	at java.base/java.lang.reflect.Method.invoke(Method.java:547)
	at com.carrotsearch.randomizedtesting.RandomizedRunner.invoke(RandomizedRunner.java:1713)
	at com.carrotsearch.randomizedtesting.RandomizedRunner$8.evaluate(RandomizedRunner.java:907)
	at com.carrotsearch.randomizedtesting.RandomizedRunner$9.evaluate(RandomizedRunner.java:943)
	at com.carrotsearch.randomizedtesting.RandomizedRunner$10.evaluate(RandomizedRunner.java:957)
	at org.apache.solr.BaseDistributedSearchTestCase$ShardsRepeatRule$ShardsFixedStatement.callStatement(BaseDistributedSearchTestCase.java:985)
	at org.apache.solr.BaseDistributedSearchTestCase$ShardsRepeatRule$ShardsStatement.evaluate(BaseDistributedSearchTestCase.java:960)
	at com.carrotsearch.randomizedtesting.rules.SystemPropertiesRestoreRule$1.evaluate(SystemPropertiesRestoreRule.java:57)
	at org.apache.lucene.util.TestRuleSetupTeardownChained$1.evaluate(TestRuleSetupTeardownChained.java:49)
	at org.apache.lucene.util.AbstractBeforeAfterRule$1.evaluate(AbstractBeforeAfterRule.java:45)
	at org.apache.lucene.util.TestRuleThreadAndTestName$1.evaluate(TestRuleThreadAndTestName.java:48)
	at org.apache.lucene.util.TestRuleIgnoreAfterMaxFailures$1.evaluate(TestRuleIgnoreAfterMaxFailures.java:64)
	at org.apache.lucene.util.TestRuleMarkFailure$1.evaluate(TestRuleMarkFailure.java:47)
	at com.carrotsearch.randomizedtesting.rules.StatementAdapter.evaluate(StatementAdapter.java:36)
	at com.carrotsearch.randomizedtesting.ThreadLeakControl$StatementRunner.run(ThreadLeakControl.java:368)
	at com.carrotsearch.randomizedtesting.ThreadLeakControl.forkTimeoutingTask(ThreadLeakControl.java:817)
	at com.carrotsearch.randomizedtesting.ThreadLeakControl$3.evaluate(ThreadLeakControl.java:468)
	at com.carrotsearch.randomizedtesting.RandomizedRunner.runSingleTest(RandomizedRunner.java:916)
	at com.carrotsearch.randomizedtesting.RandomizedRunner$5.evaluate(RandomizedRunner.java:802)
	at com.carrotsearch.randomizedtesting.RandomizedRunner$6.evaluate(RandomizedRunner.java:852)
	at com.carrotsearch.randomizedtesting.RandomizedRunner$7.evaluate(RandomizedRunner.java:863)
	at com.carrotsearch.randomizedtesting.rules.StatementAdapter.evaluate(StatementAdapter.java:36)
	at com.carrotsearch.randomizedtesting.rules.SystemPropertiesRestoreRule$1.evaluate(SystemPropertiesRestoreRule.java:57)
	at org.apache.lucene.util.AbstractBeforeAfterRule$1.evaluate(AbstractBeforeAfterRule.java:45)
	at com.carrotsearch.randomizedtesting.rules.StatementAdapter.evaluate(StatementAdapter.java:36)
	at org.apache.lucene.util.TestRuleStoreClassName$1.evaluate(TestRuleStoreClassName.java:41)
	at com.carrotsearch.randomizedtesting.rules.NoShadowingOrOverridesOnMethodsRule$1.evaluate(NoShadowingOrOverridesOnMethodsRule.java:40)
	at com.carrotsearch.randomizedtesting.rules.NoShadowingOrOverridesOnMethodsRule$1.evaluate(NoShadowingOrOverridesOnMethodsRule.java:40)
	at com.carrotsearch.randomizedtesting.rules.StatementAdapter.evaluate(StatementAdapter.java:36)
	at com.carrotsearch.randomizedtesting.rules.StatementAdapter.evaluate(StatementAdapter.java:36)
	at org.apache.lucene.util.TestRuleAssertionsRequired$1.evaluate(TestRuleAssertionsRequired.java:53)
	at org.apache.lucene.util.TestRuleMarkFailure$1.evaluate(TestRuleMarkFailure.java:47)
	at org.apache.lucene.util.TestRuleIgnoreAfterMaxFailures$1.evaluate(TestRuleIgnoreAfterMaxFailures.java:64)
	at org.apache.lucene.util.TestRuleIgnoreTestSuites$1.evaluate(TestRuleIgnoreTestSuites.java:54)
	at com.carrotsearch.randomizedtesting.rules.StatementAdapter.evaluate(StatementAdapter.java:36)
	at com.carrotsearch.randomizedtesting.ThreadLeakControl$StatementRunner.run(ThreadLeakControl.java:368)
	at java.base/java.lang.Thread.run(Thread.java:844)




Build Log:
[...truncated 11116 lines...]
   [junit4] Suite: org.apache.solr.update.TestInPlaceUpdatesDistrib
   [junit4]   2> Creating dataDir: /home/jenkins/workspace/Lucene-Solr-master-Linux/solr/build/solr-core/test/J0/temp/solr.update.TestInPlaceUpdatesDistrib_D5030D312D037BD7-001/init-core-data-001
   [junit4]   2> 196680 WARN  (SUITE-TestInPlaceUpdatesDistrib-seed#[D5030D312D037BD7]-worker) [    ] o.a.s.SolrTestCaseJ4 startTrackingSearchers: numOpens=3 numCloses=3
   [junit4]   2> 196680 INFO  (SUITE-TestInPlaceUpdatesDistrib-seed#[D5030D312D037BD7]-worker) [    ] o.a.s.SolrTestCaseJ4 Using TrieFields
   [junit4]   2> 196682 INFO  (SUITE-TestInPlaceUpdatesDistrib-seed#[D5030D312D037BD7]-worker) [    ] o.a.s.SolrTestCaseJ4 Randomized ssl (true) and clientAuth (true) via: @org.apache.solr.util.RandomizeSSL(reason="", ssl=0.0/0.0, value=0.0/0.0, clientAuth=0.0/0.0)
   [junit4]   2> 196684 INFO  (SUITE-TestInPlaceUpdatesDistrib-seed#[D5030D312D037BD7]-worker) [    ] o.a.s.BaseDistributedSearchTestCase Setting hostContext system property: /
   [junit4]   2> 196686 INFO  (SUITE-TestInPlaceUpdatesDistrib-seed#[D5030D312D037BD7]-worker) [    ] o.a.s.SolrTestCaseJ4 ####initCore
   [junit4]   2> 196687 INFO  (SUITE-TestInPlaceUpdatesDistrib-seed#[D5030D312D037BD7]-worker) [    ] o.a.s.c.SolrResourceLoader [null] Added 2 libs to classloader, from paths: [/home/jenkins/workspace/Lucene-Solr-master-Linux/solr/core/src/test-files/solr/collection1/lib, /home/jenkins/workspace/Lucene-Solr-master-Linux/solr/core/src/test-files/solr/collection1/lib/classes]
   [junit4]   2> 196763 INFO  (SUITE-TestInPlaceUpdatesDistrib-seed#[D5030D312D037BD7]-worker) [    ] o.a.s.c.SolrConfig Using Lucene MatchVersion: 7.0.0
   [junit4]   2> 196775 INFO  (SUITE-TestInPlaceUpdatesDistrib-seed#[D5030D312D037BD7]-worker) [    ] o.a.s.s.IndexSchema [null] Schema name=inplace-updates
   [junit4]   2> 196778 INFO  (SUITE-TestInPlaceUpdatesDistrib-seed#[D5030D312D037BD7]-worker) [    ] o.a.s.s.IndexSchema Loaded schema inplace-updates/1.6 with uniqueid field id
   [junit4]   2> 196882 WARN  (SUITE-TestInPlaceUpdatesDistrib-seed#[D5030D312D037BD7]-worker) [    ] o.a.s.m.r.SolrJmxReporter No serviceUrl or agentId was configured, using first MBeanServer.
   [junit4]   2> 196886 INFO  (SUITE-TestInPlaceUpdatesDistrib-seed#[D5030D312D037BD7]-worker) [    ] o.a.s.m.r.SolrJmxReporter JMX monitoring enabled at server: com.sun.jmx.mbeanserver.JmxMBeanServer@18a2675e
   [junit4]   2> 196886 WARN  (SUITE-TestInPlaceUpdatesDistrib-seed#[D5030D312D037BD7]-worker) [    ] o.a.s.m.r.SolrJmxReporter No serviceUrl or agentId was configured, using first MBeanServer.
   [junit4]   2> 196890 INFO  (SUITE-TestInPlaceUpdatesDistrib-seed#[D5030D312D037BD7]-worker) [    ] o.a.s.m.r.SolrJmxReporter JMX monitoring enabled at server: com.sun.jmx.mbeanserver.JmxMBeanServer@18a2675e
   [junit4]   2> 196891 WARN  (SUITE-TestInPlaceUpdatesDistrib-seed#[D5030D312D037BD7]-worker) [    ] o.a.s.m.r.SolrJmxReporter No serviceUrl or agentId was configured, using first MBeanServer.
   [junit4]   2> 196891 INFO  (SUITE-TestInPlaceUpdatesDistrib-seed#[D5030D312D037BD7]-worker) [    ] o.a.s.m.r.SolrJmxReporter JMX monitoring enabled at server: com.sun.jmx.mbeanserver.JmxMBeanServer@18a2675e
   [junit4]   2> 196893 INFO  (coreLoadExecutor-996-thread-1) [    ] o.a.s.c.SolrResourceLoader [null] Added 2 libs to classloader, from paths: [/home/jenkins/workspace/Lucene-Solr-master-Linux/solr/core/src/test-files/solr/collection1/lib, /home/jenkins/workspace/Lucene-Solr-master-Linux/solr/core/src/test-files/solr/collection1/lib/classes]
   [junit4]   2> 196986 INFO  (coreLoadExecutor-996-thread-1) [    ] o.a.s.c.SolrConfig Using Lucene MatchVersion: 7.0.0
   [junit4]   2> 196997 INFO  (coreLoadExecutor-996-thread-1) [    ] o.a.s.s.IndexSchema [collection1] Schema name=inplace-updates
   [junit4]   2> 197001 INFO  (coreLoadExecutor-996-thread-1) [    ] o.a.s.s.IndexSchema Loaded schema inplace-updates/1.6 with uniqueid field id
   [junit4]   2> 197004 INFO  (coreLoadExecutor-996-thread-1) [    ] o.a.s.c.CoreContainer Creating SolrCore 'collection1' using configuration from instancedir /home/jenkins/workspace/Lucene-Solr-master-Linux/solr/core/src/test-files/solr/collection1
   [junit4]   2> 197004 WARN  (coreLoadExecutor-996-thread-1) [    ] o.a.s.m.r.SolrJmxReporter No serviceUrl or agentId was configured, using first MBeanServer.
   [junit4]   2> 197005 INFO  (coreLoadExecutor-996-thread-1) [    ] o.a.s.m.r.SolrJmxReporter JMX monitoring enabled at server: com.sun.jmx.mbeanserver.JmxMBeanServer@18a2675e
   [junit4]   2> 197005 INFO  (coreLoadExecutor-996-thread-1) [    ] o.a.s.c.SolrCore solr.RecoveryStrategy.Builder
   [junit4]   2> 197005 INFO  (coreLoadExecutor-996-thread-1) [    ] o.a.s.c.SolrCore [[collection1] ] Opening new SolrCore at [/home/jenkins/workspace/Lucene-Solr-master-Linux/solr/core/src/test-files/solr/collection1], dataDir=[/home/jenkins/workspace/Lucene-Solr-master-Linux/solr/build/solr-core/test/J0/temp/solr.update.TestInPlaceUpdatesDistrib_D5030D312D037BD7-001/init-core-data-001/]
   [junit4]   2> 197005 INFO  (coreLoadExecutor-996-thread-1) [    ] o.a.s.c.JmxMonitoredMap JMX monitoring is enabled. Adding Solr mbeans to JMX Server: com.sun.jmx.mbeanserver.JmxMBeanServer@18a2675e
   [junit4]   2> 197010 WARN  (coreLoadExecutor-996-thread-1) [    ] o.a.s.c.RequestHandlers INVALID paramSet a in requestHandler {type = requestHandler,name = /dump,class = DumpRequestHandler,attributes = {initParams=a, name=/dump, class=DumpRequestHandler},args = {defaults={a=A,b=B}}}
   [junit4]   2> 197140 INFO  (coreLoadExecutor-996-thread-1) [    ] o.a.s.u.UpdateHandler Using UpdateLog implementation: org.apache.solr.update.UpdateLog
   [junit4]   2> 197140 INFO  (coreLoadExecutor-996-thread-1) [    ] o.a.s.u.UpdateLog Initializing UpdateLog: dataDir= defaultSyncLevel=FLUSH numRecordsToKeep=100 maxNumLogsToKeep=10 numVersionBuckets=65536
   [junit4]   2> 197141 INFO  (coreLoadExecutor-996-thread-1) [    ] o.a.s.u.CommitTracker Hard AutoCommit: disabled
   [junit4]   2> 197141 INFO  (coreLoadExecutor-996-thread-1) [    ] o.a.s.u.CommitTracker Soft AutoCommit: disabled
   [junit4]   2> 197142 INFO  (coreLoadExecutor-996-thread-1) [    ] o.a.s.s.SolrIndexSearcher Opening [Searcher@5bde66f9[collection1] main]
   [junit4]   2> 197143 WARN  (coreLoadExecutor-996-thread-1) [    ] o.a.s.r.ManagedResourceStorage Cannot write to config directory /home/jenkins/workspace/Lucene-Solr-master-Linux/solr/core/src/test-files/solr/collection1/conf; switching to use InMemory storage instead.
   [junit4]   2> 197143 INFO  (coreLoadExecutor-996-thread-1) [    ] o.a.s.h.ReplicationHandler Commits will be reserved for  10000
   [junit4]   2> 197144 INFO  (searcherExecutor-997-thread-1) [    ] o.a.s.c.SolrCore [collection1] Registered new searcher Searcher@5bde66f9[collection1] main{ExitableDirectoryReader(UninvertingDirectoryReader())}
   [junit4]   2> 197144 INFO  (coreLoadExecutor-996-thread-1) [    ] o.a.s.u.UpdateLog Could not find max version in index or recent updates, using new clock 1562171237003689984
   [junit4]   2> 197147 INFO  (SUITE-TestInPlaceUpdatesDistrib-seed#[D5030D312D037BD7]-worker) [    ] o.a.s.SolrTestCaseJ4 ####initCore end
   [junit4]   2> 197149 INFO  (TEST-TestInPlaceUpdatesDistrib.test-seed#[D5030D312D037BD7]) [    ] o.a.s.c.ZkTestServer STARTING ZK TEST SERVER
   [junit4]   2> 197149 INFO  (Thread-432) [    ] o.a.s.c.ZkTestServer client port:0.0.0.0/0.0.0.0:0
   [junit4]   2> 197149 INFO  (Thread-432) [    ] o.a.s.c.ZkTestServer Starting server
   [junit4]   2> 197249 INFO  (TEST-TestInPlaceUpdatesDistrib.test-seed#[D5030D312D037BD7]) [    ] o.a.s.c.ZkTestServer start zk server on port:37049
   [junit4]   2> 197258 INFO  (TEST-TestInPlaceUpdatesDistrib.test-seed#[D5030D312D037BD7]) [    ] o.a.s.c.AbstractZkTestCase put /home/jenkins/workspace/Lucene-Solr-master-Linux/solr/core/src/test-files/solr/collection1/conf/solrconfig-tlog.xml to /configs/conf1/solrconfig.xml
   [junit4]   2> 197261 INFO  (TEST-TestInPlaceUpdatesDistrib.test-seed#[D5030D312D037BD7]) [    ] o.a.s.c.AbstractZkTestCase put /home/jenkins/workspace/Lucene-Solr-master-Linux/solr/core/src/test-files/solr/collection1/conf/schema-inplace-updates.xml to /configs/conf1/schema.xml
   [junit4]   2> 197264 INFO  (TEST-TestInPlaceUpdatesDistrib.test-seed#[D5030D312D037BD7]) [    ] o.a.s.c.AbstractZkTestCase put /home/jenkins/workspace/Lucene-Solr-master-Linux/solr/core/src/test-files/solr/collection1/conf/solrconfig.snippet.randomindexconfig.xml to /configs/conf1/solrconfig.snippet.randomindexconfig.xml
   [junit4]   2> 197267 INFO  (TEST-TestInPlaceUpdatesDistrib.test-seed#[D5030D312D037BD7]) [    ] o.a.s.c.AbstractZkTestCase put /home/jenkins/workspace/Lucene-Solr-master-Linux/solr/core/src/test-files/solr/collection1/conf/stopwords.txt to /configs/conf1/stopwords.txt
   [junit4]   2> 197270 INFO  (TEST-TestInPlaceUpdatesDistrib.test-seed#[D5030D312D037BD7]) [    ] o.a.s.c.AbstractZkTestCase put /home/jenkins/workspace/Lucene-Solr-master-Linux/solr/core/src/test-files/solr/collection1/conf/protwords.txt to /configs/conf1/protwords.txt
   [junit4]   2> 197273 INFO  (TEST-TestInPlaceUpdatesDistrib.test-seed#[D5030D312D037BD7]) [    ] o.a.s.c.AbstractZkTestCase put /home/jenkins/workspace/Lucene-Solr-master-Linux/solr/core/src/test-files/solr/collection1/conf/currency.xml to /configs/conf1/currency.xml
   [junit4]   2> 197276 INFO  (TEST-TestInPlaceUpdatesDistrib.test-seed#[D5030D312D037BD7]) [    ] o.a.s.c.AbstractZkTestCase put /home/jenkins/workspace/Lucene-Solr-master-Linux/solr/core/src/test-files/solr/collection1/conf/enumsConfig.xml to /configs/conf1/enumsConfig.xml
   [junit4]   2> 197279 INFO  (TEST-TestInPlaceUpdatesDistrib.test-seed#[D5030D312D037BD7]) [    ] o.a.s.c.AbstractZkTestCase put /home/jenkins/workspace/Lucene-Solr-master-Linux/solr/core/src/test-files/solr/collection1/conf/open-exchange-rates.json to /configs/conf1/open-exchange-rates.json
   [junit4]   2> 197282 INFO  (TEST-TestInPlaceUpdatesDistrib.test-seed#[D5030D312D037BD7]) [    ] o.a.s.c.AbstractZkTestCase put /home/jenkins/workspace/Lucene-Solr-master-Linux/solr/core/src/test-files/solr/collection1/conf/mapping-ISOLatin1Accent.txt to /configs/conf1/mapping-ISOLatin1Accent.txt
   [junit4]   2> 197285 INFO  (TEST-TestInPlaceUpdatesDistrib.test-seed#[D5030D312D037BD7]) [    ] o.a.s.c.AbstractZkTestCase put /home/jenkins/workspace/Lucene-Solr-master-Linux/solr/core/src/test-files/solr/collection1/conf/old_synonyms.txt to /configs/conf1/old_synonyms.txt
   [junit4]   2> 197287 INFO  (TEST-TestInPlaceUpdatesDistrib.test-seed#[D5030D312D037BD7]) [    ] o.a.s.c.AbstractZkTestCase put /home/jenkins/workspace/Lucene-Solr-master-Linux/solr/core/src/test-files/solr/collection1/conf/synonyms.txt to /configs/conf1/synonyms.txt
   [junit4]   2> 197293 WARN  (NIOServerCxn.Factory:0.0.0.0/0.0.0.0:0) [    ] o.a.z.s.NIOServerCnxn caught end of stream exception
   [junit4]   2> EndOfStreamException: Unable to read additional data from client sessionid 0x15adf2769c50002, likely client has closed socket
   [junit4]   2> 	at org.apache.zookeeper.server.NIOServerCnxn.doIO(NIOServerCnxn.java:228)
   [junit4]   2> 	at org.apache.zookeeper.server.NIOServerCnxnFactory.run(NIOServerCnxnFactory.java:208)
   [junit4]   2> 	at java.base/java.lang.Thread.run(Thread.java:844)
   [junit4]   2> 197749 INFO  (TEST-TestInPlaceUpdatesDistrib.test-seed#[D5030D312D037BD7]) [    ] o.a.s.SolrTestCaseJ4 Writing core.properties file to /home/jenkins/workspace/Lucene-Solr-master-Linux/solr/build/solr-core/test/J0/temp/solr.update.TestInPlaceUpdatesDistrib_D5030D312D037BD7-001/control-001/cores/collection1
   [junit4]   2> 197752 INFO  (TEST-TestInPlaceUpdatesDistrib.test-seed#[D5030D312D037BD7]) [    ] o.e.j.s.Server jetty-9.3.14.v20161028
   [junit4]   2> 197752 INFO  (TEST-TestInPlaceUpdatesDistrib.test-seed#[D5030D312D037BD7]) [    ] o.e.j.s.h.ContextHandler Started o.e.j.s.ServletContextHandler@3f1276b5{/,null,AVAILABLE}
   [junit4]   2> 197753 INFO  (TEST-TestInPlaceUpdatesDistrib.test-seed#[D5030D312D037BD7]) [    ] o.e.j.s.AbstractConnector Started ServerConnector@6dee3559{SSL,[ssl, http/1.1]}{127.0.0.1:36942}
   [junit4]   2> 197753 INFO  (TEST-TestInPlaceUpdatesDistrib.test-seed#[D5030D312D037BD7]) [    ] o.e.j.s.Server Started @199698ms
   [junit4]   2> 197753 INFO  (TEST-TestInPlaceUpdatesDistrib.test-seed#[D5030D312D037BD7]) [    ] o.a.s.c.s.e.JettySolrRunner Jetty properties: {hostContext=/, solr.data.dir=/home/jenkins/workspace/Lucene-Solr-master-Linux/solr/build/solr-core/test/J0/temp/solr.update.TestInPlaceUpdatesDistrib_D5030D312D037BD7-001/tempDir-001/control/data, hostPort=36942, coreRootDirectory=/home/jenkins/workspace/Lucene-Solr-master-Linux/solr/build/solr-core/test/J0/../../../../../../../../../home/jenkins/workspace/Lucene-Solr-master-Linux/solr/build/solr-core/test/J0/temp/solr.update.TestInPlaceUpdatesDistrib_D5030D312D037BD7-001/control-001/cores}
   [junit4]   2> 197754 ERROR (TEST-TestInPlaceUpdatesDistrib.test-seed#[D5030D312D037BD7]) [    ] o.a.s.s.StartupLoggingUtils Missing Java Option solr.log.dir. Logging may be missing or incomplete.
   [junit4]   2> 197754 INFO  (TEST-TestInPlaceUpdatesDistrib.test-seed#[D5030D312D037BD7]) [    ] o.a.s.s.SolrDispatchFilter  ___      _       Welcome to Apache Solr? version 7.0.0
   [junit4]   2> 197754 INFO  (TEST-TestInPlaceUpdatesDistrib.test-seed#[D5030D312D037BD7]) [    ] o.a.s.s.SolrDispatchFilter / __| ___| |_ _   Starting in cloud mode on port null
   [junit4]   2> 197754 INFO  (TEST-TestInPlaceUpdatesDistrib.test-seed#[D5030D312D037BD7]) [    ] o.a.s.s.SolrDispatchFilter \__ \/ _ \ | '_|  Install dir: null
   [junit4]   2> 197754 INFO  (TEST-TestInPlaceUpdatesDistrib.test-seed#[D5030D312D037BD7]) [    ] o.a.s.s.SolrDispatchFilter |___/\___/_|_|    Start time: 2017-03-18T02:03:07.169255Z
   [junit4]   2> 197757 INFO  (TEST-TestInPlaceUpdatesDistrib.test-seed#[D5030D312D037BD7]) [    ] o.a.s.s.SolrDispatchFilter Loading solr.xml from SolrHome (not found in ZooKeeper)
   [junit4]   2> 197757 INFO  (TEST-TestInPlaceUpdatesDistrib.test-seed#[D5030D312D037BD7]) [    ] o.a.s.c.SolrXmlConfig Loading container configuration from /home/jenkins/workspace/Lucene-Solr-master-Linux/solr/build/solr-core/test/J0/temp/solr.update.TestInPlaceUpdatesDistrib_D5030D312D037BD7-001/control-001/solr.xml
   [junit4]   2> 197763 INFO  (TEST-TestInPlaceUpdatesDistrib.test-seed#[D5030D312D037BD7]) [    ] o.a.s.c.ZkContainer Zookeeper client=127.0.0.1:37049/solr
   [junit4]   2> 197776 INFO  (TEST-TestInPlaceUpdatesDistrib.test-seed#[D5030D312D037BD7]) [    ] o.a.s.c.Overseer Overseer (id=null) closing
   [junit4]   2> 197777 INFO  (TEST-TestInPlaceUpdatesDistrib.test-seed#[D5030D312D037BD7]) [    ] o.a.s.c.OverseerElectionContext I am going to be the leader 127.0.0.1:36942_
   [junit4]   2> 197777 INFO  (TEST-TestInPlaceUpdatesDistrib.test-seed#[D5030D312D037BD7]) [    ] o.a.s.c.Overseer Overseer (id=97635702313123845-127.0.0.1:36942_-n_0000000000) starting
   [junit4]   2> 197781 INFO  (TEST-TestInPlaceUpdatesDistrib.test-seed#[D5030D312D037BD7]) [    ] o.a.s.c.ZkController Register node as live in ZooKeeper:/live_nodes/127.0.0.1:36942_
   [junit4]   2> 197782 INFO  (OverseerStateUpdate-97635702313123845-127.0.0.1:36942_-n_0000000000) [    ] o.a.s.c.c.ZkStateReader Updated live nodes from ZooKeeper... (0) -> (1)
   [junit4]   2> 197891 INFO  (TEST-TestInPlaceUpdatesDistrib.test-seed#[D5030D312D037BD7]) [    ] o.a.s.c.CorePropertiesLocator Found 1 core definitions underneath /home/jenkins/workspace/Lucene-Solr-master-Linux/solr/build/solr-core/test/J0/../../../../../../../../../home/jenkins/workspace/Lucene-Solr-master-Linux/solr/build/solr-core/test/J0/temp/solr.update.TestInPlaceUpdatesDistrib_D5030D312D037BD7-001/control-001/cores
   [junit4]   2> 197891 INFO  (TEST-TestInPlaceUpdatesDistrib.test-seed#[D5030D312D037BD7]) [    ] o.a.s.c.CorePropertiesLocator Cores are: [collection1]
   [junit4]   2> 197895 INFO  (OverseerStateUpdate-97635702313123845-127.0.0.1:36942_-n_0000000000) [    ] o.a.s.c.o.ReplicaMutator Assigning new node to shard shard=shard1
   [junit4]   2> 197909 INFO  (coreLoadExecutor-1009-thread-1) [    ] o.a.s.c.SolrConfig Using Lucene MatchVersion: 7.0.0
   [junit4]   2> 197933 INFO  (coreLoadExecutor-1009-thread-1) [    ] o.a.s.s.IndexSchema [collection1] Schema name=inplace-updates
   [junit4]   2> 197936 INFO  (coreLoadExecutor-1009-thread-1) [    ] o.a.s.s.IndexSchema Loaded schema inplace-updates/1.6 with uniqueid field id
   [junit4]   2> 197944 INFO  (coreLoadExecutor-1009-thread-1) [    ] o.a.s.c.CoreContainer Creating SolrCore 'collection1' using configuration from collection control_collection
   [junit4]   2> 197944 INFO  (coreLoadExecutor-1009-thread-1) [    ] o.a.s.c.SolrCore solr.RecoveryStrategy.Builder
   [junit4]   2> 197944 INFO  (coreLoadExecutor-1009-thread-1) [    ] o.a.s.c.SolrCore [[collection1] ] Opening new SolrCore at [/home/jenkins/workspace/Lucene-Solr-master-Linux/solr/build/solr-core/test/J0/temp/solr.update.TestInPlaceUpdatesDistrib_D5030D312D037BD7-001/control-001/cores/collection1], dataDir=[/home/jenkins/workspace/Lucene-Solr-master-Linux/solr/build/solr-core/test/J0/../../../../../../../../../home/jenkins/workspace/Lucene-Solr-master-Linux/solr/build/solr-core/test/J0/temp/solr.update.TestInPlaceUpdatesDistrib_D5030D312D037BD7-001/control-001/cores/collection1/data/]
   [junit4]   2> 197945 INFO  (coreLoadExecutor-1009-thread-1) [    ] o.a.s.c.JmxMonitoredMap JMX monitoring is enabled. Adding Solr mbeans to JMX Server: com.sun.jmx.mbeanserver.JmxMBeanServer@18a2675e
   [junit4]   2> 197953 WARN  (coreLoadExecutor-1009-thread-1) [    ] o.a.s.c.RequestHandlers INVALID paramSet a in requestHandler {type = requestHandler,name = /dump,class = DumpRequestHandler,attributes = {initParams=a, name=/dump, class=DumpRequestHandler},args = {defaults={a=A,b=B}}}
   [junit4]   2> 198154 INFO  (coreLoadExecutor-1009-thread-1) [    ] o.a.s.u.UpdateHandler Using UpdateLog implementation: org.apache.solr.update.UpdateLog
   [junit4]   2> 198154 INFO  (coreLoadExecutor-1009-thread-1) [    ] o.a.s.u.UpdateLog Initializing UpdateLog: dataDir= defaultSyncLevel=FLUSH numRecordsToKeep=100 maxNumLogsToKeep=10 numVersionBuckets=65536
   [junit4]   2> 198155 INFO  (coreLoadExecutor-1009-thread-1) [    ] o.a.s.u.CommitTracker Hard AutoCommit: disabled
   [junit4]   2> 198156 INFO  (coreLoadExecutor-1009-thread-1) [    ] o.a.s.u.CommitTracker Soft AutoCommit: disabled
   [junit4]   2> 198157 INFO  (coreLoadExecutor-1009-thread-1) [    ] o.a.s.s.SolrIndexSearcher Opening [Searcher@690b0ea0[collection1] main]
   [junit4]   2> 198158 INFO  (coreLoadExecutor-1009-thread-1) [    ] o.a.s.r.ManagedResourceStorage Configured ZooKeeperStorageIO with znodeBase: /configs/conf1
   [junit4]   2> 198158 INFO  (coreLoadExecutor-1009-thread-1) [    ] o.a.s.r.ManagedResourceStorage Loaded null at path _rest_managed.json using ZooKeeperStorageIO:path=/configs/conf1
   [junit4]   2> 198158 INFO  (coreLoadExecutor-1009-thread-1) [    ] o.a.s.h.ReplicationHandler Commits will be reserved for  10000
   [junit4]   2> 198160 INFO  (searcherExecutor-1010-thread-1) [    ] o.a.s.c.SolrCore [collection1] Registered new searcher Searcher@690b0ea0[collection1] main{ExitableDirectoryReader(UninvertingDirectoryReader())}
   [junit4]   2> 198160 INFO  (coreLoadExecutor-1009-thread-1) [    ] o.a.s.u.UpdateLog Could not find max version in index or recent updates, using new clock 1562171238069043200
   [junit4]   2> 198166 INFO  (coreZkRegister-1002-thread-1) [    ] o.a.s.c.ShardLeaderElectionContext Enough replicas found to continue.
   [junit4]   2> 198166 INFO  (coreZkRegister-1002-thread-1) [    ] o.a.s.c.ShardLeaderElectionContext I may be the new leader - try and sync
   [junit4]   2> 198166 INFO  (coreZkRegister-1002-thread-1) [    ] o.a.s.c.SyncStrategy Sync replicas to https://127.0.0.1:36942/collection1/
   [junit4]   2> 198166 INFO  (coreZkRegister-1002-thread-1) [    ] o.a.s.c.SyncStrategy Sync Success - now sync replicas to me
   [junit4]   2> 198166 INFO  (coreZkRegister-1002-thread-1) [    ] o.a.s.c.SyncStrategy https://127.0.0.1:36942/collection1/ has no replicas
   [junit4]   2> 198166 INFO  (coreZkRegister-1002-thread-1) [    ] o.a.s.c.ShardLeaderElectionContext Found all replicas participating in election, clear LIR
   [junit4]   2> 198169 INFO  (coreZkRegister-1002-thread-1) [    ] o.a.s.c.ShardLeaderElectionContext I am the new leader: https://127.0.0.1:36942/collection1/ shard1
   [junit4]   2> 198320 INFO  (coreZkRegister-1002-thread-1) [    ] o.a.s.c.ZkController I am the leader, no recovery necessary
   [junit4]   2> 198525 INFO  (TEST-TestInPlaceUpdatesDistrib.test-seed#[D5030D312D037BD7]) [    ] o.a.s.c.c.ZkStateReader Updated live nodes from ZooKeeper... (0) -> (1)
   [junit4]   2> 198526 INFO  (TEST-TestInPlaceUpdatesDistrib.test-seed#[D5030D312D037BD7]) [    ] o.a.s.c.s.i.ZkClientClusterStateProvider Cluster at 127.0.0.1:37049/solr ready
   [junit4]   2> 198526 INFO  (TEST-TestInPlaceUpdatesDistrib.test-seed#[D5030D312D037BD7]) [    ] o.a.s.c.ChaosMonkey monkey: init - expire sessions:false cause connection loss:false
   [junit4]   2> 198526 INFO  (TEST-TestInPlaceUpdatesDistrib.test-seed#[D5030D312D037BD7]) [    ] o.a.s.c.AbstractFullDistribZkTestBase Creating collection1 with stateFormat=2
   [junit4]   2> 198530 WARN  (NIOServerCxn.Factory:0.0.0.0/0.0.0.0:0) [    ] o.a.z.s.NIOServerCnxn caught end of stream exception
   [junit4]   2> EndOfStreamException: Unable to read additional data from client sessionid 0x15adf2769c50007, likely client has closed socket
   [junit4]   2> 	at org.apache.zookeeper.server.NIOServerCnxn.doIO(NIOServerCnxn.java:228)
   [junit4]   2> 	at org.apache.zookeeper.server.NIOServerCnxnFactory.run(NIOServerCnxnFactory.java:208)
   [junit4]   2> 	at java.base/java.lang.Thread.run(Thread.java:844)
   [junit4]   2> 199045 INFO  (TEST-TestInPlaceUpdatesDistrib.test-seed#[D5030D312D037BD7]) [    ] o.a.s.SolrTestCaseJ4 Writing core.properties file to /home/jenkins/workspace/Lucene-Solr-master-Linux/solr/build/solr-core/test/J0/temp/solr.update.TestInPlaceUpdatesDistrib_D5030D312D037BD7-001/shard-1-001/cores/collection1
   [junit4]   2> 199045 INFO  (TEST-TestInPlaceUpdatesDistrib.test-seed#[D5030D312D037BD7]) [    ] o.a.s.c.AbstractFullDistribZkTestBase create jetty 1 in directory /home/jenkins/workspace/Lucene-Solr-master-Linux/solr/build/solr-core/test/J0/temp/solr.update.TestInPlaceUpdatesDistrib_D5030D312D037BD7-001/shard-1-001
   [junit4]   2> 199048 INFO  (TEST-TestInPlaceUpdatesDistrib.test-seed#[D5030D312D037BD7]) [    ] o.e.j.s.Server jetty-9.3.14.v20161028
   [junit4]   2> 199049 INFO  (TEST-TestInPlaceUpdatesDistrib.test-seed#[D5030D312D037BD7]) [    ] o.e.j.s.h.ContextHandler Started o.e.j.s.ServletContextHandler@24aa3735{/,null,AVAILABLE}
   [junit4]   2> 199050 INFO  (TEST-TestInPlaceUpdatesDistrib.test-seed#[D5030D312D037BD7]) [    ] o.e.j.s.AbstractConnector Started ServerConnector@3aef6cdc{SSL,[ssl, http/1.1]}{127.0.0.1:35225}
   [junit4]   2> 199050 INFO  (TEST-TestInPlaceUpdatesDistrib.test-seed#[D5030D312D037BD7]) [    ] o.e.j.s.Server Started @200995ms
   [junit4]   2> 199050 INFO  (TEST-TestInPlaceUpdatesDistrib.test-seed#[D5030D312D037BD7]) [    ] o.a.s.c.s.e.JettySolrRunner Jetty properties: {hostContext=/, solrconfig=solrconfig.xml, solr.data.dir=/home/jenkins/workspace/Lucene-Solr-master-Linux/solr/build/solr-core/test/J0/temp/solr.update.TestInPlaceUpdatesDistrib_D5030D312D037BD7-001/tempDir-001/jetty1, hostPort=35225, coreRootDirectory=/home/jenkins/workspace/Lucene-Solr-master-Linux/solr/build/solr-core/test/J0/../../../../../../../../../home/jenkins/workspace/Lucene-Solr-master-Linux/solr/build/solr-core/test/J0/temp/solr.update.TestInPlaceUpdatesDistrib_D5030D312D037BD7-001/shard-1-001/cores}
   [junit4]   2> 199051 ERROR (TEST-TestInPlaceUpdatesDistrib.test-seed#[D5030D312D037BD7]) [    ] o.a.s.s.StartupLoggingUtils Missing Java Option solr.log.dir. Logging may be missing or incomplete.
   [junit4]   2> 199051 INFO  (TEST-TestInPlaceUpdatesDistrib.test-seed#[D5030D312D037BD7]) [    ] o.a.s.s.SolrDispatchFilter  ___      _       Welcome to Apache Solr? version 7.0.0
   [junit4]   2> 199051 INFO  (TEST-TestInPlaceUpdatesDistrib.test-seed#[D5030D312D037BD7]) [    ] o.a.s.s.SolrDispatchFilter / __| ___| |_ _   Starting in cloud mode on port null
   [junit4]   2> 199051 INFO  (TEST-TestInPlaceUpdatesDistrib.test-seed#[D5030D312D037BD7]) [    ] o.a.s.s.SolrDispatchFilter \__ \/ _ \ | '_|  Install dir: null
   [junit4]   2> 199051 INFO  (TEST-TestInPlaceUpdatesDistrib.test-seed#[D5030D312D037BD7]) [    ] o.a.s.s.SolrDispatchFilter |___/\___/_|_|    Start time: 2017-03-18T02:03:08.466513Z
   [junit4]   2> 199054 INFO  (TEST-TestInPlaceUpdatesDistrib.test-seed#[D5030D312D037BD7]) [    ] o.a.s.s.SolrDispatchFilter Loading solr.xml from SolrHome (not found in ZooKeeper)
   [junit4]   2> 199054 INFO  (TEST-TestInPlaceUpdatesDistrib.test-seed#[D5030D312D037BD7]) [    ] o.a.s.c.SolrXmlConfig Loading container configuration from /home/jenkins/workspace/Lucene-Solr-master-Linux/solr/build/solr-core/test/J0/temp/solr.update.TestInPlaceUpdatesDistrib_D5030D312D037BD7-001/shard-1-001/solr.xml
   [junit4]   2> 199061 INFO  (TEST-TestInPlaceUpdatesDistrib.test-seed#[D5030D312D037BD7]) [    ] o.a.s.c.ZkContainer Zookeeper client=127.0.0.1:37049/solr
   [junit4]   2> 199071 INFO  (TEST-TestInPlaceUpdatesDistrib.test-seed#[D5030D312D037BD7]) [    ] o.a.s.c.c.ZkStateReader Updated live nodes from ZooKeeper... (0) -> (1)
   [junit4]   2> 199072 INFO  (TEST-TestInPlaceUpdatesDistrib.test-seed#[D5030D312D037BD7]) [    ] o.a.s.c.Overseer Overseer (id=null) closing
   [junit4]   2> 199074 INFO  (TEST-TestInPlaceUpdatesDistrib.test-seed#[D5030D312D037BD7]) [    ] o.a.s.c.ZkController Register node as live in ZooKeeper:/live_nodes/127.0.0.1:35225_
   [junit4]   2> 199076 INFO  (zkCallback-397-thread-1) [    ] o.a.s.c.c.ZkStateReader Updated live nodes from ZooKeeper... (1) -> (2)
   [junit4]   2> 199077 INFO  (zkCallback-393-thread-3) [    ] o.a.s.c.c.ZkStateReader Updated live nodes from ZooKeeper... (1) -> (2)
   [junit4]   2> 199077 INFO  (zkCallback-403-thread-1) [    ] o.a.s.c.c.ZkStateReader Updated live nodes from ZooKeeper... (1) -> (2)
   [junit4]   2> 199253 INFO  (TEST-TestInPlaceUpdatesDistrib.test-seed#[D5030D312D037BD7]) [    ] o.a.s.c.CorePropertiesLocator Found 1 core definitions underneath /home/jenkins/workspace/Lucene-Solr-master-Linux/solr/build/solr-core/test/J0/../../../../../../../../../home/jenkins/workspace/Lucene-Solr-master-Linux/solr/build/solr-core/test/J0/temp/solr.update.TestInPlaceUpdatesDistrib_D5030D312D037BD7-001/shard-1-001/cores
   [junit4]   2> 199253 INFO  (TEST-TestInPlaceUpdatesDistrib.test-seed#[D5030D312D037BD7]) [    ] o.a.s.c.CorePropertiesLocator Cores are: [collection1]
   [junit4]   2> 199259 INFO  (OverseerStateUpdate-97635702313123845-127.0.0.1:36942_-n_0000000000) [    ] o.a.s.c.o.ReplicaMutator Assigning new node to shard shard=shard1
   [junit4]   2> 199361 INFO  (zkCallback-403-thread-2) [    ] o.a.s.c.c.ZkStateReader A cluster state change: [WatchedEvent state:SyncConnected type:NodeDataChanged path:/collections/collection1/state.json] for collection [collection1] has occurred - updating... (live nodes size: [2])
   [junit4]   2> 200269 INFO  (coreLoadExecutor-1020-thread-1) [    ] o.a.s.c.SolrConfig Using Lucene MatchVersion: 7.0.0
   [junit4]   2> 200281 INFO  (coreLoadExecutor-1020-thread-1) [    ] o.a.s.s.IndexSchema [collection1] Schema name=inplace-updates
   [junit4]   2> 200299 INFO  (coreLoadExecutor-1020-thread-1) [    ] o.a.s.s.IndexSchema Loaded schema inplace-updates/1.6 with uniqueid field id
   [junit4]   2> 200300 INFO  (coreLoadExecutor-1020-thread-1) [    ] o.a.s.c.CoreContainer Creating SolrCore 'collection1' using configuration from collection collection1
   [junit4]   2> 200301 INFO  (coreLoadExecutor-1020-thread-1) [    ] o.a.s.c.SolrCore solr.RecoveryStrategy.Builder
   [junit4]   2> 200301 INFO  (coreLoadExecutor-1020-thread-1) [    ] o.a.s.c.SolrCore [[collection1] ] Opening new SolrCore at [/home/jenkins/workspace/Lucene-Solr-master-Linux/solr/build/solr-core/test/J0/temp/solr.update.TestInPlaceUpdatesDistrib_D5030D312D037BD7-001/shard-1-001/cores/collection1], dataDir=[/home/jenkins/workspace/Lucene-Solr-master-Linux/solr/build/solr-core/test/J0/../../../../../../../../../home/jenkins/workspace/Lucene-Solr-master-Linux/solr/build/solr-core/test/J0/temp/solr.update.TestInPlaceUpdatesDistrib_D5030D312D037BD7-001/shard-1-001/cores/collection1/data/]
   [junit4]   2> 200301 INFO  (coreLoadExecutor-1020-thread-1) [    ] o.a.s.c.JmxMonitoredMap JMX monitoring is enabled. Adding Solr mbeans to JMX Server: com.sun.jmx.mbeanserver.JmxMBeanServer@18a2675e
   [junit4]   2> 200306 WARN  (coreLoadExecutor-1020-thread-1) [    ] o.a.s.c.RequestHandlers INVALID paramSet a in requestHandler {type = requestHandler,name = /dump,class = DumpRequestHandler,attributes = {initParams=a, name=/dump, class=DumpRequestHandler},args = {defaults={a=A,b=B}}}
   [junit4]   2> 200472 INFO  (coreLoadExecutor-1020-thread-1) [    ] o.a.s.u.UpdateHandler Using UpdateLog implementation: org.apache.solr.update.UpdateLog
   [junit4]   2> 200472 INFO  (coreLoadExecutor-1020-thread-1) [    ] o.a.s.u.UpdateLog Initializing UpdateLog: dataDir= defaultSyncLevel=FLUSH numRecordsToKeep=100 maxNumLogsToKeep=10 numVersionBuckets=65536
   [junit4]   2> 200473 INFO  (coreLoadExecutor-1020-thread-1) [    ] o.a.s.u.CommitTracker Hard AutoCommit: disabled
   [junit4]   2> 200473 INFO  (coreLoadExecutor-1020-thread-1) [    ] o.a.s.u.CommitTracker Soft AutoCommit: disabled
   [junit4]   2> 200474 INFO  (coreLoadExecutor-1020-thread-1) [    ] o.a.s.s.SolrIndexSearcher Opening [Searcher@41a08461[collection1] main]
   [junit4]   2> 200475 INFO  (coreLoadExecutor-1020-thread-1) [    ] o.a.s.r.ManagedResourceStorage Configured ZooKeeperStorageIO with znodeBase: /configs/conf1
   [junit4]   2> 200475 INFO  (coreLoadExecutor-1020-thread-1) [    ] o.a.s.r.ManagedResourceStorage Loaded null at path _rest_managed.json using ZooKeeperStorageIO:path=/configs/conf1
   [junit4]   2> 200475 INFO  (coreLoadExecutor-1020-thread-1) [    ] o.a.s.h.ReplicationHandler Commits will be reserved for  10000
   [junit4]   2> 200476 INFO  (searcherExecutor-1021-thread-1) [    ] o.a.s.c.SolrCore [collection1] Registered new searcher Searcher@41a08461[collection1] main{ExitableDirectoryReader(UninvertingDirectoryReader())}
   [junit4]   2> 200476 INFO  (coreLoadExecutor-1020-thread-1) [    ] o.a.s.u.UpdateLog Could not find max version in index or recent updates, using new clock 1562171240497545216
   [junit4]   2> 200482 INFO  (coreZkRegister-1015-thread-1) [    ] o.a.s.c.ShardLeaderElectionContext Enough replicas found to continue.
   [junit4]   2> 200482 INFO  (coreZkRegister-1015-thread-1) [    ] o.a.s.c.ShardLeaderElectionContext I may be the new leader - try and sync
   [junit4]   2> 200482 INFO  (coreZkRegister-1015-thread-1) [    ] o.a.s.c.SyncStrategy Sync replicas to https://127.0.0.1:35225/collection1/
   [junit4]   2> 200482 INFO  (coreZkRegister-1015-thread-1) [    ] o.a.s.c.SyncStrategy Sync Success - now sync replicas to me
   [junit4]   2> 200482 INFO  (coreZkRegister-1015-thread-1) [    ] o.a.s.c.SyncStrategy https://127.0.0.1:35225/collection1/ has no replicas
   [junit4]   2> 200482 INFO  (coreZkRegister-1015-thread-1) [    ] o.a.s.c.ShardLeaderElectionContext Found all replicas participating in election, clear LIR
   [junit4]   2> 200485 INFO  (coreZkRegister-1015-thread-1) [    ] o.a.s.c.ShardLeaderElectionContext I am the new leader: https://127.0.0.1:35225/collection1/ shard1
   [junit4]   2> 200587 INFO  (zkCallback-403-thread-2) [    ] o.a.s.c.c.ZkStateReader A cluster state change: [WatchedEvent state:SyncConnected type:NodeDataChanged path:/collections/collection1/state.json] for collection [collection1] has occurred - updating... (live nodes size: [2])
   [junit4]   2> 200636 INFO  (coreZkRegister-1015-thread-1) [    ] o.a.s.c.ZkController I am the leader, no recovery necessary
   [junit4]   2> 200739 INFO  (zkCallback-403-thread-2) [    ] o.a.s.c.c.ZkStateReader A cluster state change: [WatchedEvent state:SyncConnected type:NodeDataChanged path:/collections/collection1/state.json] for collection [collection1] has occurred - updating... (live nodes size: [2])
   [junit4]   2> 201398 INFO  (TEST-TestInPlaceUpdatesDistrib.test-seed#[D5030D312D037BD7]) [    ] o.a.s.SolrTestCaseJ4 Writing core.properties file to /home/jenkins/workspace/Lucene-Solr-master-Linux/solr/build/solr-core/test/J0/temp/solr.update.TestInPlaceUpdatesDistrib_D5030D312D037BD7-001/shard-2-001/cores/collection1
   [junit4]   2> 201399 INFO  (TEST-TestInPlaceUpdatesDistrib.test-seed#[D5030D312D037BD7]) [    ] o.a.s.c.AbstractFullDistribZkTestBase create jetty 2 in directory /home/jenkins/workspace/Lucene-Solr-master-Linux/solr/build/solr-core/test/J0/temp/solr.update.TestInPlaceUpdatesDistrib_D5030D312D037BD7-001/shard-2-001
   [junit4]   2> 201403 INFO  (TEST-TestInPlaceUpdatesDistrib.test-seed#[D5030D312D037BD7]) [    ] o.e.j.s.Server jetty-9.3.14.v20161028
   [junit4]   2> 201404 INFO  (TEST-TestInPlaceUpdatesDistrib.test-seed#[D5030D312D037BD7]) [    ] o.e.j.s.h.ContextHandler Started o.e.j.s.ServletContextHandler@383fb951{/,null,AVAILABLE}
   [junit4]   2> 201405 INFO  (TEST-TestInPlaceUpdatesDistrib.test-seed#[D5030D312D037BD7]) [    ] o.e.j.s.AbstractConnector Started ServerConnector@38894906{SSL,[ssl, http/1.1]}{127.0.0.1:42339}
   [junit4]   2> 201405 INFO  (TEST-TestInPlaceUpdatesDistrib.test-seed#[D5030D312D037BD7]) [    ] o.e.j.s.Server Started @203350ms
   [junit4]   2> 201405 INFO  (TEST-TestInPlaceUpdatesDistrib.test-seed#[D5030D312D037BD7]) [    ] o.a.s.c.s.e.JettySolrRunner Jetty properties: {hostContext=/, solrconfig=solrconfig.xml, solr.data.dir=/home/jenkins/workspace/Lucene-Solr-master-Linux/solr/build/solr-core/test/J0/temp/solr.update.TestInPlaceUpdatesDistrib_D5030D312D037BD7-001/tempDir-001/jetty2, hostPort=42339, coreRootDirectory=/home/jenkins/workspace/Lucene-Solr-master-Linux/solr/build/solr-core/test/J0/../../../../../../../../../home/jenkins/workspace/Lucene-Solr-master-Linux/solr/build/solr-core/test/J0/temp/solr.update.TestInPlaceUpdatesDistrib_D5030D312D037BD7-001/shard-2-001/cores}
   [junit4]   2> 201406 ERROR (TEST-TestInPlaceUpdatesDistrib.test-seed#[D5030D312D037BD7]) [    ] o.a.s.s.StartupLoggingUtils Missing Java Option solr.log.dir. Logging may be missing or incomplete.
   [junit4]   2> 201406 INFO  (TEST-TestInPlaceUpdatesDistrib.test-seed#[D5030D312D037BD7]) [    ] o.a.s.s.SolrDispatchFilter  ___      _       Welcome to Apache Solr? version 7.0.0
   [junit4]   2> 201406 INFO  (TEST-TestInPlaceUpdatesDistrib.test-seed#[D5030D312D037BD7]) [    ] o.a.s.s.SolrDispatchFilter / __| ___| |_ _   Starting in cloud mode on port null
   [junit4]   2> 201406 INFO  (TEST-TestInPlaceUpdatesDistrib.test-seed#[D5030D312D037BD7]) [    ] o.a.s.s.SolrDispatchFilter \__ \/ _ \ | '_|  Install dir: null
   [junit4]   2> 201406 INFO  (TEST-TestInPlaceUpdatesDistrib.test-seed#[D5030D312D037BD7]) [    ] o.a.s.s.SolrDispatchFilter |___/\___/_|_|    Start time: 2017-03-18T02:03:10.821447Z
   [junit4]   2> 201408 INFO  (TEST-TestInPlaceUpdatesDistrib.test-seed#[D5030D312D037BD7]) [    ] o.a.s.s.SolrDispatchFilter Loading solr.xml from SolrHome (not found in ZooKeeper)
   [junit4]   2> 201408 INFO  (TEST-TestInPlaceUpdatesDistrib.test-seed#[D5030D312D037BD7]) [    ] o.a.s.c.SolrXmlConfig Loading container configuration from /home/jenkins/workspace/Lucene-Solr-master-Linux/solr/build/solr-core/test/J0/temp/solr.update.TestInPlaceUpdatesDistrib_D5030D312D037BD7-001/shard-2-001/solr.xml
   [junit4]   2> 201419 INFO  (TEST-TestInPlaceUpdatesDistrib.test-seed#[D5030D312D037BD7]) [    ] o.a.s.c.ZkContainer Zookeeper client=127.0.0.1:37049/solr
   [junit4]   2> 201425 INFO  (TEST-TestInPlaceUpdatesDistrib.test-seed#[D5030D312D037BD7]) [    ] o.a.s.c.c.ZkStateReader Updated live nodes from ZooKeeper... (0) -> (2)
   [junit4]   2> 201426 INFO  (TEST-TestInPlaceUpdatesDistrib.test-seed#[D5030D312D037BD7]) [    ] o.a.s.c.Overseer Overseer (id=null) closing
   [junit4]   2> 201429 INFO  (TEST-TestInPlaceUpdatesDistrib.test-seed#[D5030D312D037BD7]) [    ] o.a.s.c.ZkController Register node as live in ZooKeeper:/live_nodes/127.0.0.1:42339_
   [junit4]   2> 201431 INFO  (zkCallback-397-thread-2) [    ] o.a.s.c.c.ZkStateReader Updated live nodes from ZooKeeper... (2) -> (3)
   [junit4]   2> 201435 INFO  (zkCallback-409-thread-1) [    ] o.a.s.c.c.ZkStateReader Updated live nodes from ZooKeeper... (2) -> (3)
   [junit4]   2> 201431 INFO  (zkCallback-403-thread-2) [    ] o.a.s.c.c.ZkStateReader Updated live nodes from ZooKeeper... (2) -> (3)
   [junit4]   2> 201431 INFO  (zkCallback-393-thread-2) [    ] o.a.s.c.c.ZkStateReader Updated live nodes from ZooKeeper... (2) -> (3)
   [junit4]   2> 201534 INFO  (zkCallback-403-thread-2) [    ] o.a.s.c.c.ZkStateReader A cluster state change: [WatchedEvent state:SyncConnected type:NodeDataChanged path:/collections/collection1/state.json] for collection [collection1] has occurred - updating... (live nodes size: [3])
   [junit4]   2> 201555 INFO  (TEST-TestInPlaceUpdatesDistrib.test-seed#[D5030D312D037BD7]) [    ] o.a.s.c.CorePropertiesLocator Found 1 core definitions underneath /home/jenkins/workspace/Lucene-Solr-master-Linux/solr/build/solr-core/test/J0/../../../../../../../../../home/jenkins/workspace/Lucene-Solr-master-Linux/solr/build/solr-core/test/J0/temp/solr.update.TestInPlaceUpdatesDistrib_D5030D312D037BD7-001/shard-2-001/cores
   [junit4]   2> 201555 INFO  (TEST-TestInPlaceUpdatesDistrib.test-seed#[D5030D312D037BD7]) [    ] o.a.s.c.CorePropertiesLocator Cores are: [collection1]
   [junit4]   2> 201558 INFO  (OverseerStateUpdate-97635702313123845-127.0.0.1:36942_-n_0000000000) [    ] o.a.s.c.o.ReplicaMutator Assigning new node to shard shard=shard1
   [junit4]   2> 201660 INFO  (zkCallback-403-thread-2) [    ] o.a.s.c.c.ZkStateReader A cluster state change: [WatchedEvent state:SyncConnected type:NodeDataChanged path:/collections/collection1/state.json] for collection [collection1] has occurred - updating... (live nodes size: [3])
   [junit4]   2> 201660 INFO  (zkCallback-409-thread-1) [    ] o.a.s.c.c.ZkStateReader A cluster state change: [WatchedEvent state:SyncConnected type:NodeDataChanged path:/collections/collection1/state.json] for collection [collection1] has occurred - updating... (live nodes size: [3])
   [junit4]   2> 202567 INFO  (coreLoadExecutor-1031-thread-1) [    ] o.a.s.c.SolrConfig Using Lucene MatchVersion: 7.0.0
   [junit4]   2> 202582 INFO  (coreLoadExecutor-1031-thread-1) [    ] o.a.s.s.IndexSchema [collection1] Schema name=inplace-updates
   [junit4]   2> 202585 INFO  (coreLoadExecutor-1031-thread-1) [    ] o.a.s.s.IndexSchema Loaded schema inplace-updates/1.6 with uniqueid field id
   [junit4]   2> 202587 INFO  (coreLoadExecutor-1031-thread-1) [    ] o.a.s.c.CoreContainer Creating SolrCore 'collection1' using configuration from collection collection1
   [junit4]   2> 202587 INFO  (coreLoadExecutor-1031-thread-1) [    ] o.a.s.c.SolrCore solr.RecoveryStrategy.Builder
   [junit4]   2> 202587 INFO  (coreLoadExecutor-1031-thread-1) [    ] o.a.s.c.SolrCore [[collection1] ] Opening new SolrCore at [/home/jenkins/workspace/Lucene-Solr-master-Linux/solr/build/solr-core/test/J0/temp/solr.update.TestInPlaceUpdatesDistrib_D5030D312D037BD7-001/shard-2-001/cores/collection1], dataDir=[/home/jenkins/workspace/Lucene-Solr-master-Linux/solr/build/solr-core/test/J0/../../../../../../../../../home/jenkins/workspace/Lucene-Solr-master-Linux/solr/build/solr-core/test/J0/temp/solr.update.TestInPlaceUpdatesDistrib_D5030D312D037BD7-001/shard-2-001/cores/collection1/data/]
   [junit4]   2> 202587 INFO  (coreLoadExecutor-1031-thread-1) [    ] o.a.s.c.JmxMonitoredMap JMX monitoring is enabled. Adding Solr mbeans to JMX Server: com.sun.jmx.mbeanserver.JmxMBeanServer@18a2675e
   [junit4]   2> 202596 WARN  (coreLoadExecutor-1031-thread-1) [    ] o.a.s.c.RequestHandlers INVALID paramSet a in requestHandler {type = requestHandler,name = /dump,class = DumpRequestHandler,attributes = {initParams=a, name=/dump, class=DumpRequestHandler},args = {defaults={a=A,b=B}}}
   [junit4]   2> 202801 INFO  (coreLoadExecutor-1031-thread-1) [    ] o.a.s.u.UpdateHandler Using UpdateLog implementation: org.apache.solr.update.UpdateLog
   [junit4]   2> 202801 INFO  (coreLoadExecutor-1031-thread-1) [    ] o.a.s.u.UpdateLog Initializing UpdateLog: dataDir= defaultSyncLevel=FLUSH numRecordsToKeep=100 maxNumLogsToKeep=10 numVersionBuckets=65536
   [junit4]   2> 202802 INFO  (coreLoadExecutor-1031-thread-1) [    ] o.a.s.u.CommitTracker Hard AutoCommit: disabled
   [junit4]   2> 202802 INFO  (coreLoadExecutor-1031-thread-1) [    ] o.a.s.u.CommitTracker Soft AutoCommit: disabled
   [junit4]   2> 202810 INFO  (coreLoadExecutor-1031-thread-1) [    ] o.a.s.s.SolrIndexSearcher Opening [Searcher@3c98f9da[collection1] main]
   [junit4]   2> 202812 INFO  (coreLoadExecutor-1031-thread-1) [    ] o.a.s.r.ManagedResourceStorage Configured ZooKeeperStorageIO with znodeBase: /configs/conf1
   [junit4]   2> 202812 INFO  (coreLoadExecutor-1031-thread-1) [    ] o.a.s.r.ManagedResourceStorage Loaded null at path _rest_managed.json using ZooKeeperStorageIO:path=/configs/conf1
   [junit4]   2> 202812 INFO  (coreLoadExecutor-1031-thread-1) [    ] o.a.s.h.ReplicationHandler Commits will be reserved for  10000
   [junit4]   2> 202814 INFO  (searcherExecutor-1032-thread-1) [    ] o.a.s.c.SolrCore [collection1] Registered new searcher Searcher@3c98f9da[collection1] main{ExitableDirectoryReader(UninvertingDirectoryReader())}
   [junit4]   2> 202814 INFO  (coreLoadExecutor-1031-thread-1) [    ] o.a.s.u.UpdateLog Could not find max version in index or recent updates, using new clock 1562171242949115904
   [junit4]   2> 202819 INFO  (coreZkRegister-1026-thread-1) [    ] o.a.s.c.ZkController Core needs to recover:collection1
   [junit4]   2> 202819 INFO  (updateExecutor-406-thread-1) [    ] o.a.s.u.DefaultSolrCoreState Running recovery
   [junit4]   2> 202819 INFO  (recoveryExecutor-407-thread-1) [    ] o.a.s.c.RecoveryStrategy Starting recovery process. recoveringAfterStartup=true
   [junit4]   2> 202820 INFO  (recoveryExecutor-407-thread-1) [    ] o.a.s.c.RecoveryStrategy ###### startupVersions=[[]]
   [junit4]   2> 202820 INFO  (recoveryExecutor-407-thread-1) [    ] o.a.s.c.RecoveryStrategy Begin buffering updates. core=[collection1]
   [junit4]   2> 202820 INFO  (recoveryExecutor-407-thread-1) [    ] o.a.s.u.UpdateLog Starting to buffer updates. FSUpdateLog{state=ACTIVE, tlog=null}
   [junit4]   2> 202820 INFO  (recoveryExecutor-407-thread-1) [    ] o.a.s.c.RecoveryStrategy Publishing state of core [collection1] as recovering, leader is [https://127.0.0.1:35225/collection1/] and I am [https://127.0.0.1:42339/collection1/]
   [junit4]   2> 202825 INFO  (recoveryExecutor-407-thread-1) [    ] o.a.s.c.RecoveryStrategy Sending prep recovery command to [https://127.0.0.1:35225]; [WaitForState: action=PREPRECOVERY&core=collection1&nodeName=127.0.0.1:42339_&coreNodeName=core_node2&state=recovering&checkLive=true&onlyIfLeader=true&onlyIfLeaderActive=true]
   [junit4]   2> 202873 INFO  (qtp233483421-2047) [    ] o.a.s.h.a.PrepRecoveryOp Going to wait for coreNodeName: core_node2, state: recovering, checkLive: true, onlyIfLeader: true, onlyIfLeaderActive: true
   [junit4]   2> 202873 INFO  (qtp233483421-2047) [    ] o.a.s.h.a.PrepRecoveryOp Will wait a max of 183 seconds to see collection1 (shard1 of collection1) have state: recovering
   [junit4]   2> 202873 INFO  (qtp233483421-2047) [    ] o.a.s.h.a.PrepRecoveryOp In WaitForState(recovering): collection=collection1, shard=shard1, thisCore=collection1, leaderDoesNotNeedRecovery=false, isLeader? true, live=true, checkLive=true, currentState=down, localState=active, nodeName=127.0.0.1:42339_, coreNodeName=core_node2, onlyIfActiveCheckResult=false, nodeProps: core_node2:{"core":"collection1","base_url":"https://127.0.0.1:42339","node_name":"127.0.0.1:42339_","state":"down"}
   [junit4]   2> 202941 INFO  (zkCallback-403-thread-2) [    ] o.a.s.c.c.ZkStateReader A cluster state change: [WatchedEvent state:SyncConnected type:NodeDataChanged path:/collections/collection1/state.json] for collection [collection1] has occurred - updating... (live nodes size: [3])
   [junit4]   2> 202941 INFO  (zkCallback-409-thread-1) [    ] o.a.s.c.c.ZkStateReader A cluster state change: [WatchedEvent state:SyncConnected type:NodeDataChanged path:/collections/collection1/state.json] for collection [collection1] has occurred - updating... (live nodes size: [3])
   [junit4]   2> 203827 INFO  (TEST-TestInPlaceUpdatesDistrib.test-seed#[D5030D312D037BD7]) [    ] o.a.s.SolrTestCaseJ4 Writing core.properties file to /home/jenkins/workspace/Lucene-Solr-master-Linux/solr/build/solr-core/test/J0/temp/solr.update.TestInPlaceUpdatesDistrib_D5030D312D037BD7-001/shard-3-001/cores/collection1
   [junit4]   2> 203828 INFO  (TEST-TestInPlaceUpdatesDistrib.test-seed#[D5030D312D037BD7]) [    ] o.a.s.c.AbstractFullDistribZkTestBase create jetty 3 in directory /home/jenkins/workspace/Lucene-Solr-master-Linux/solr/build/solr-core/test/J0/temp/solr.update.TestInPlaceUpdatesDistrib_D5030D312D037BD7-001/shard-3-001
   [junit4]   2> 203830 INFO  (TEST-TestInPlaceUpdatesDistrib.test-seed#[D5030D312D037BD7]) [    ] o.e.j.s.Server jetty-9.3.14.v20161028
   [junit4]   2> 203831 INFO  (TEST-TestInPlaceUpdatesDistrib.test-seed#[D5030D312D037BD7]) [    ] o.e.j.s.h.ContextHandler Started o.e.j.s.ServletContextHandler@1fb95020{/,null,AVAILABLE}
   [junit4]   2> 203832 INFO  (TEST-TestInPlaceUpdatesDistrib.test-seed#[D5030D312D037BD7]) [    ] o.e.j.s.AbstractConnector Started ServerConnector@75902cc3{SSL,[ssl, http/1.1]}{127.0.0.1:40068}
   [junit4]   2> 203832 INFO  (TEST-TestInPlaceUpdatesDistrib.test-seed#[D5030D312D037BD7]) [    ] o.e.j.s.Server Started @205777ms
   [junit4]   2> 203832 INFO  (TEST-TestInPlaceUpdatesDistrib.test-seed#[D5030D312D037BD7]) [    ] o.a.s.c.s.e.JettySolrRunner Jetty properties: {hostContext=/, solrconfig=solrconfig.xml, solr.data.dir=/home/jenkins/workspace/Lucene-Solr-master-Linux/solr/build/solr-core/test/J0/temp/solr.update.TestInPlaceUpdatesDistrib_D5030D312D037BD7-001/tempDir-001/jetty3, hostPort=40068, coreRootDirectory=/home/jenkins/workspace/Lucene-Solr-master-Linux/solr/build/solr-core/test/J0/../../../../../../../../../home/jenkins/workspace/Lucene-Solr-master-Linux/solr/build/solr-core/test/J0/temp/solr.update.TestInPlaceUpdatesDistrib_D5030D312D037BD7-001/shard-3-001/cores}
   [junit4]   2> 203832 ERROR (TEST-TestInPlaceUpdatesDistrib.test-seed#[D5030D312D037BD7]) [    ] o.a.s.s.StartupLoggingUtils Missing Java Option solr.log.dir. Logging may be missing or incomplete.
   [junit4]   2> 203833 INFO  (TEST-TestInPlaceUpdatesDistrib.test-seed#[D5030D312D037BD7]) [    ] o.a.s.s.SolrDispatchFilter  ___      _       Welcome to Apache Solr? version 7.0.0
   [junit4]   2> 203833 INFO  (TEST-TestInPlaceUpdatesDistrib.test-seed#[D5030D312D037BD7]) [    ] o.a.s.s.SolrDispatchFilter / __| ___| |_ _   Starting in cloud mode on port null
   [junit4]   2> 203833 INFO  (TEST-TestInPlaceUpdatesDistrib.test-seed#[D5030D312D037BD7]) [    ] o.a.s.s.SolrDispatchFilter \__ \/ _ \ | '_|  Install dir: null
   [junit4]   2> 203833 INFO  (TEST-TestInPlaceUpdatesDistrib.test-seed#[D5030D312D037BD7]) [    ] o.a.s.s.SolrDispatchFilter |___/\___/_|_|    Start time: 2017-03-18T02:03:13.248266Z
   [junit4]   2> 203851 INFO  (TEST-TestInPlaceUpdatesDistrib.test-seed#[D5030D312D037BD7]) [    ] o.a.s.s.SolrDispatchFilter Loading solr.xml from SolrHome (not found in ZooKeeper)
   [junit4]   2> 203851 INFO  (TEST-TestInPlaceUpdatesDistrib.test-seed#[D5030D312D037BD7]) [    ] o.a.s.c.SolrXmlConfig Loading container configuration from /home/jenkins/workspace/Lucene-Solr-master-Linux/solr/build/solr-core/test/J0/temp/solr.update.TestInPlaceUpdatesDistrib_D5030D312D037BD7-001/shard-3-001/solr.xml
   [junit4]   2> 203866 INFO  (TEST-TestInPlaceUpdatesDistrib.test-seed#[D5030D312D037BD7]) [    ] o.a.s.c.ZkContainer Zookeeper client=127.0.0.1:37049/solr
   [junit4]   2> 203870 INFO  (TEST-TestInPlaceUpdatesDistrib.test-seed#[D5030D312D037BD7]) [    ] o.a.s.c.c.ZkStateReader Updated live nodes from ZooKeeper... (0) -> (3)
   [junit4]   2> 203871 INFO  (TEST-TestInPlaceUpdatesDistrib.test-seed#[D5030D312D037BD7]) [    ] o.a.s.c.Overseer Overseer (id=null) closing
   [junit4]   2> 203873 INFO  (qtp233483421-2047) [    ] o.a.s.h.a.PrepRecoveryOp In WaitForState(recovering): collection=collection1, shard=shard1, thisCore=collection1, leaderDoesNotNeedRecovery=false, isLeader? true, live=true, checkLive=true, currentState=recovering, localState=active, nodeName=127.0.0.1:42339_, coreNodeName=core_node2, onlyIfActiveCheckResult=false, nodeProps: core_node2:{"core":"collection1","base_url":"https://127.0.0.1:42339","node_name":"127.0.0.1:42339_","state":"recovering"}
   [junit4]   2> 203874 INFO  (qtp233483421-2047) [    ] o.a.s.h.a.PrepRecoveryOp Waited coreNodeName: core_node2, state: recovering, checkLive: true, onlyIfLeader: true for: 1 seconds.
   [junit4]   2> 203874 INFO  (qtp233483421-2047) [    ] o.a.s.s.HttpSolrCall [admin] webapp=null path=/admin/cores params={nodeName=127.0.0.1:42339_&onlyIfLeaderActive=true&core=collection1&coreNodeName=core_node2&action=PREPRECOVERY&checkLive=true&state=recovering&onlyIfLeader=true&wt=javabin&version=2} status=0 QTime=1001
   [junit4]   2> 203874 INFO  (TEST-TestInPlaceUpdatesDistrib.test-seed#[D5030D312D037BD7]) [    ] o.a.s.c.ZkController Register node as live in ZooKeeper:/live_nodes/127.0.0.1:40068_
   [junit4]   2> 203877 INFO  (zkCallback-397-thread-2) [    ] o.a.s.c.c.ZkStateReader Updated live nodes from ZooKeeper... (3) -> (4)
   [junit4]   2> 203877 INFO  (zkCallback-403-thread-2) [    ] o.a.s.c.c.ZkStateReader Updated live nodes from ZooKeeper... (3) -> (4)
   [junit4]   2> 203877 INFO  (zkCallback-416-thread-1) [    ] o.a.s.c.c.ZkStateReader Updated live nodes from ZooKeeper... (3) -> (4)
   [junit4]   2> 203877 INFO  (zkCallback-409-thread-1) [    ] o.a.s.c.c.ZkStateReader Updated live nodes from ZooKeeper... (3) -> (4)
   [junit4]   2> 203878 INFO  (zkCallback-393-thread-3) [    ] o.a.s.c.c.ZkStateReader Updated live nodes from ZooKeeper... (3) -> (4)
   [junit4]   2> 203981 INFO  (zkCallback-403-thread-2) [    ] o.a.s.c.c.ZkStateReader A cluster state change: [WatchedEvent state:SyncConnected type:NodeDataChanged path:/collections/collection1/state.json] for collection [collection1] has occurred - updating... (live nodes size: [4])
   [junit4]   2> 203981 INFO  (zkCallback-409-thread-1) [    ] o.a.s.c.c.ZkStateReader A cluster state change: [WatchedEvent state:SyncConnected type:NodeDataChanged path:/collections/collection1/state.json] for collection [collection1] has occurred - updating... (live nodes size: [4])
   [junit4]   2> 203995 INFO  (TEST-TestInPlaceUpdatesDistrib.test-seed#[D5030D312D037BD7]) [    ] o.a.s.c.CorePropertiesLocator Found 1 core definitions underneath /home/jenkins/workspace/Lucene-Solr-master-Linux/solr/build/solr-core/test/J0/../../../../../../../../../home/jenkins/workspace/Lucene-Solr-master-Linux/solr/build/solr-core/test/J0/temp/solr.update.TestInPlaceUpdatesDistrib_D5030D312D037BD7-001/shard-3-001/cores
   [junit4]   2> 203996 INFO  (TEST-TestInPlaceUpdatesDistrib.test-seed#[D5030D312D037BD7]) [    ] o.a.s.c.CorePropertiesLocator Cores are: [collection1]
   [junit4]   2> 203998 INFO  (OverseerStateUpdate-97635702313123845-127.0.0.1:36942_-n_0000000000) [    ] o.a.s.c.o.ReplicaMutator Assigning new node to shard shard=shard1
   [junit4]   2> 204100 INFO  (zkCallback-416-thread-1) [    ] o.a.s.c.c.ZkStateReader A cluster state change: [WatchedEvent state:SyncConnected type:NodeDataChanged path:/collections/collection1/state.json] for collection [collection1] has occurred - updating... (live nodes size: [4])
   [junit4]   2> 204100 INFO  (zkCallback-409-thread-1) [    ] o.a.s.c.c.ZkStateReader A cluster state change: [WatchedEvent state:SyncConnected type:NodeDataChanged path:/collections/collection1/state.json] for collection [collection1] has occurred - updating... (live nodes size: [4])
   [junit4]   2> 204100 INFO  (zkCallback-403-thread-2) [    ] o.a.s.c.c.ZkStateReader A cluster state change: [WatchedEvent state:SyncConnected type:NodeDataChanged path:/collections/collection1/state.json] for collection [collection1] has occurred - updating... (live nodes size: [4])
   [junit4]   2> 204376 INFO  (recoveryExecutor-407-thread-1) [    ] o.a.s.c.RecoveryStrategy Starting Replication Recovery.
   [junit4]   2> 204376 INFO  (recoveryExecutor-407-thread-1) [    ] o.a.s.c.RecoveryStrategy Attempting to replicate from [https://127.0.0.1:35225/collection1/].
   [junit4]   2> 204386 INFO  (qtp233483421-2048) [    ] o.a.s.u.DirectUpdateHandler2 start commit{_version_=1562171244597477376,optimize=false,openSearcher=true,waitSearcher=true,expungeDeletes=false,softCommit=false,prepareCommit=false}
   [junit4]   2> 204386 INFO  (qtp233483421-2048) [    ] o.a.s.u.DirectUpdateHandler2 No uncommitted changes. Skipping IW.commit.
   [junit4]   2> 204387 INFO  (qtp233483421-2048) [    ] o.a.s.u.DirectUpdateHandler2 end_commit_flush
   [junit4]   2> 204387 INFO  (qtp233483421-2048) [    ] o.a.s.u.p.LogUpdateProcessorFactory [collection1]  webapp= path=/update params={waitSearcher=true&openSearcher=true&commit=true&softCommit=false&commit_end_point=true&wt=javabin&version=2}{commit=} 0 0
   [junit4]   2> 204405 INFO  (qtp233483421-2047) [    ] o.a.s.c.S.Request [collection1]  webapp= path=/replication params={qt=/replication&wt=javabin&version=2&command=indexversion} status=0 QTime=0
   [junit4]   2> 204406 INFO  (recoveryExecutor-407-thread-1) [    ] o.a.s.h.IndexFetcher Master's generation: 1
   [junit4]   2> 204406 INFO  (recoveryExecutor-407-thread-1) [    ] o.a.s.h.IndexFetcher Master's version: 0
   [junit4]   2> 204406 INFO  (recoveryExecutor-407-thread-1) [    ] o.a.s.h.IndexFetcher Slave's generation: 1
   [junit4]   2> 204406 INFO  (recoveryExecutor-407-thread-1) [    ] o.a.s.h.IndexFetcher Slave's version: 0
   [junit4]   2> 204406 INFO  (recoveryExecutor-407-thread-1) [    ] o.a.s.c.RecoveryStrategy Replication Recovery was successful.
   [junit4]   2> 204406 INFO  (recoveryExecutor-407-thread-1) [    ] o.a.s.c.RecoveryStrategy Registering as Active after recovery.
   [junit4]   2> 204410 INFO  (recoveryExecutor-407-thread-1) [    ] o.a.s.h.ReplicationHandler Poll scheduled at an interval of 3000ms
   [junit4]   2> 204410 WARN  (recoveryExecutor-407-thread-1) [    ] o.a.s.h.ReplicationHandler SolrCloud is enabled for core collection1 but so is old-style replication. Make sure you intend this behavior, it usually indicates a mis-configuration. Master setting is false and slave setting is true
   [junit4]   2> 204410 INFO  (indexFetcher-1044-thread-1) [    ] o.a.s.h.IndexFetcher Updated masterUrl to https://127.0.0.1:35225/collection1/
   [junit4]   2> 204412 INFO  (qtp233483421-2043) [    ] o.a.s.c.S.Request [collection1]  webapp= path=/replication params={qt=/replication&wt=javabin&version=2&command=indexversion} status=0 QTime=0
   [junit4]   2> 204413 INFO  (indexFetcher-1044-thread-1) [    ] o.a.s.h.IndexFetcher Master's generation: 1
   [junit4]   2> 204413 INFO  (indexFetcher-1044-thread-1) [    ] o.a.s.h.IndexFetcher Master's version: 0
   [junit4]   2> 204413 INFO  (indexFetcher-1044-thread-1) [    ] o.a.s.h.IndexFetcher Slave's generation: 1
   [junit4]   2> 204413 INFO  (indexFetcher-1044-thread-1) [    ] o.a.s.h.IndexFetcher Slave's version: 0
   [junit4]   2> 204413 INFO  (recoveryExecutor-407-thread-1) [    ] o.a.s.c.RecoveryStrategy Updating version bucket highest from index after successful recovery.
   [junit4]   2> 204413 INFO  (recoveryExecutor-407-thread-1) [    ] o.a.s.u.UpdateLog Could not find max version in index or recent updates, using new clock 1562171244625788928
   [junit4]   2> 204415 INFO  (recoveryExecutor-407-thread-1) [    ] o.a.s.c.RecoveryStrategy Finished recovery process, successful=[true]
   [junit4]   2> 204515 INFO  (zkCallback-403-thread-2) [    ] o.a.s.c.c.ZkStateReader A cluster state change: [WatchedEvent state:SyncConnected type:NodeDataChanged path:/collections/collection1/state.json] for collection [collection1] has occurred - updating... (live nodes size: [4])
   [junit4]   2> 204515 INFO  (zkCallback-416-thread-1) [    ] o.a.s.c.c.ZkStateReader A cluster state change: [WatchedEvent state:SyncConnected type:NodeDataChanged path:/collections/collection1/state.json] for collection [collection1] has occurred - updating... (live nodes size: [4])
   [junit4]   2> 204515 INFO  (zkCallback-409-thread-1) [    ] o.a.s.c.c.ZkStateReader A cluster state change: [WatchedEvent state:SyncConnected type:NodeDataChanged path:/collections/collection1/state.json] for collection [collection1] has occurred - updating... (live nodes size: [4])
   [junit4]   2> 205019 INFO  (coreLoadExecutor-1042-thread-1) [    ] o.a.s.c.SolrConfig Using Lucene MatchVersion: 7.0.0
   [junit4]   2> 205028 INFO  (coreLoadExecutor-1042-thread-1) [    ] o.a.s.s.IndexSchema [collection1] Schema name=inplace-updates
   [junit4]   2> 205031 INFO  (coreLoadExecutor-1042-thread-1) [    ] o.a.s.s.IndexSchema Loaded schema inplace-updates/1.6 with uniqueid field id
   [junit4]   2> 205031 INFO  (coreLoadExecutor-1042-thread-1) [    ] o.a.s.c.CoreContainer Creating SolrCore 'collection1' using configuration from collection collection1
   [junit4]   2> 205032 INFO  (coreLoadExecutor-1042-thread-1) [    ] o.a.s.c.SolrCore solr.RecoveryStrategy.Builder
   [junit4]   2> 205032 INFO  (coreLoadExecutor-1042-thread-1) [    ] o.a.s.c.SolrCore [[collection1] ] Opening new SolrCore at [/home/jenkins/workspace/Lucene-Solr-master-Linux/solr/build/solr-core/test/J0/temp/solr.update.TestInPlaceUpdatesDistrib_D5030D312D037BD7-001/shard-3-001/cores/collection1], dataDir=[/home/jenkins/workspace/Lucene-Solr-master-Linux/solr/build/solr-core/test/J0/../../../../../../../../../home/jenkins/workspace/Lucene-Solr-master-Linux/solr/build/solr-core/test/J0/temp/solr.update.TestInPlaceUpdatesDistrib_D5030D312D037BD7-001/shard-3-001/cores/collection1/data/]
   [junit4]   2> 205032 INFO  (coreLoadExecutor-1042-thread-1) [    ] o.a.s.c.JmxMonitoredMap JMX monitoring is enabled. Adding Solr mbeans to JMX Server: com.sun.jmx.mbeanserver.JmxMBeanServer@18a2675e
   [junit4]   2> 205037 WARN  (coreLoadExecutor-1042-thread-1) [    ] o.a.s.c.RequestHandlers INVALID paramSet a in requestHandler {type = requestHandler,name = /dump,class = DumpRequestHandler,attributes = {initParams=a, name=/dump, class=DumpRequestHandler},args = {defaults={a=A,b=B}}}
   [junit4]   2> 205180 INFO  (coreLoadExecutor-1042-thread-1) [    ] o.a.s.u.UpdateHandler Using UpdateLog implementation: org.apache.solr.update.UpdateLog
   [junit4]   2> 205180 INFO  (coreLoadExecutor-1042-thread-1) [    ] o.a.s.u.UpdateLog Initializing UpdateLog: dataDir= defaultSyncLevel=FLUSH numRecordsToKeep=100 maxNumLogsToKeep=10 numVersionBuckets=65536
   [junit4]   2> 205181 INFO  (coreLoadExecutor-1042-thread-1) [    ] o.a.s.u.CommitTracker Hard AutoCommit: disabled
   [junit4]   2> 205181 INFO  (coreLoadExecutor-1042-thread-1) [    ] o.a.s.u.CommitTracker Soft AutoCommit: disabled
   [junit4]   2> 205181 INFO  (coreLoadExecutor-1042-thread-1) [    ] o.a.s.s.SolrIndexSearcher Opening [Searcher@510a7d8c[collection1] main]
   [junit4]   2> 205182 INFO  (coreLoadExecutor-1042-thread-1) [    ] o.a.s.r.ManagedResourceStorage Configured ZooKeeperStorageIO with znodeBase: /configs/conf1
   [junit4]   2> 205182 INFO  (coreLoadExecutor-1042-thread-1) [    ] o.a.s.r.ManagedResourceStorage Loaded null at path _rest_managed.json using ZooKeeperStorageIO:path=/configs/conf1
   [junit4]   2> 205182 INFO  (coreLoadExecutor-1042-thread-1) [    ] o.a.s.h.ReplicationHandler Commits will be reserved for  10000
   [junit4]   2> 205183 INFO  (searcherExecutor-1045-thread-1) [    ] o.a.s.c.SolrCore [collection1] Registered new searcher Searcher@510a7d8c[collection1] main{ExitableDirectoryReader(UninvertingDirectoryReader())}
   [junit4]   2> 205183 INFO  (coreLoadExecutor-1042-thread-1) [    ] o.a.s.u.UpdateLog Could not find max version in index or recent updates, using new clock 1562171245433192448
   [junit4]   2> 205186 INFO  (coreZkRegister-1037-thread-1) [    ] o.a.s.c.ZkController Core needs to recover:collection1
   [junit4]   2> 205187 INFO  (updateExecutor-413-thread-1) [    ] o.a.s.u.DefaultSolrCoreState Running recovery
   [junit4]   2> 205187 INFO  (recoveryExecutor-414-thread-1) [    ] o.a.s.c.RecoveryStrategy Starting recovery process. recoveringAfterStartup=true
   [junit4]   2> 205187 INFO  (recoveryExecutor-414-thread-1) [    ] o.a.s.c.RecoveryStrategy ###### startupVersions=[[]]
   [junit4]   2> 205187 INFO  (recoveryExecutor-414-thread-1) [    ] o.a.s.c.RecoveryStrategy Begin buffering updates. core=[collection1]
   [junit4]   2> 205187 INFO  (recoveryExecutor-414-thread-1) [    ] o.a.s.u.UpdateLog Starting to buffer updates. FSUpdateLog{state=ACTIVE, tlog=null}
   [junit4]   2> 205187 INFO  (recoveryExecutor-414-thread-1) [    ] o.a.s.c.RecoveryStrategy Publishing state of core [collection1] as recovering, leader is [https://127.0.0.1:35225/collection1/] and I am [https://127.0.0.1:40068/collection1/]
   [junit4]   2> 205189 INFO  (recoveryExecutor-414-thread-1) [    ] o.a.s.c.RecoveryStrategy Sending prep recovery command to [https://127.0.0.1:35225]; [WaitForState: action=PREPRECOVERY&core=collection1&nodeName=127.0.0.1:40068_&coreNodeName=core_node3&state=recovering&checkLive=true&onlyIfLeader=true&onlyIfLeaderActive=true]
   [junit4]   2> 205193 INFO  (qtp233483421-2043) [    ] o.a.s.h.a.PrepRecoveryOp Going to wait for coreNodeName: core_node3, state: recovering, checkLive: true, onlyIfLeader: true, onlyIfLeaderActive: true
   [junit4]   2> 205193 INFO  (qtp233483421-2043) [    ] o.a.s.h.a.PrepRecoveryOp Will wait a max of 183 seconds to see collection1 (shard1 of collection1) have state: recovering
   [junit4]   2> 205193 INFO  (qtp233483421-2043) [    ] o.a.s.h.a.PrepRecoveryOp In WaitForState(recovering): collection=collection1, shard=shard1, thisCore=collection1, leaderDoesNotNeedRecovery=false, isLeader? true, live=true, checkLive=true, currentState=down, localState=active, nodeName=127.0.0.1:40068_, coreNodeName=core_node3, onlyIfActiveCheckResult=false, nodeProps: core_node3:{"core":"collection1","base_url":"https://127.0.0.1:40068","node_name":"127.0.0.1:40068_","state":"down"}
   [junit4]   2> 205296 INFO  (zkCallback-416-thread-1) [    ] o.a.s.c.c.ZkStateReader A cluster state change: [WatchedEvent state:SyncConnected type:NodeDataChanged path:/collections/collection1/state.json] for collection [collection1] has occurred - updating... (live nodes size: [4])
   [junit4]   2> 205296 INFO  (zkCallback-409-thread-1) [    ] o.a.s.c.c.ZkStateReader A cluster state change: [WatchedEvent state:SyncConnected type:NodeDataChanged path:/collections/collection1/state.json] for collection [collection1] has occurred - updating... (live nodes size: [4])
   [junit4]   2> 205296 INFO  (zkCallback-403-thread-2) [    ] o.a.s.c.c.ZkStateReader A cluster state change: [WatchedEvent state:SyncConnected type:NodeDataChanged path:/collections/collection1/state.json] for collection [collection1] has occurred - updating... (live nodes size: [4])
   [junit4]   2> 205586 INFO  (TEST-TestInPlaceUpdatesDistrib.test-seed#[D5030D312D037BD7]) [    ] o.a.s.SolrTestCaseJ4 ###Starting test
   [junit4]   2> 205586 INFO  (TEST-TestInPlaceUpdatesDistrib.test-seed#[D5030D312D037BD7]) [    ] o.a.s.c.AbstractDistribZkTestBase Wait for recoveries to finish - collection: collection1 failOnTimeout:true timeout (sec):330
   [junit4]   1> -
   [junit4]   1> replica:core_node1 rstate:active live:true
   [junit4]   1> replica:core_node2 rstate:active live:true
   [junit4]   1> replica:core_node3 rstate:recovering live:true
   [junit4]   2> 206193 INFO  (qtp233483421-2043) [    ] o.a.s.h.a.PrepRecoveryOp In WaitForState(recovering): collection=collection1, shard=shard1, thisCore=collection1, leaderDoesNotNeedRecovery=false, isLeader? true, live=true, checkLive=true, currentState=recovering, localState=active, nodeName=127.0.0.1:40068_, coreNodeName=core_node3, onlyIfActiveCheckResult=false, nodeProps: core_node3:{"core":"collection1","base_url":"https://127.0.0.1:40068","node_name":"127.0.0.1:40068_","state":"recovering"}
   [junit4]   2> 206194 INFO  (qtp233483421-2043) [    ] o.a.s.h.a.PrepRecoveryOp Waited coreNodeName: core_node3, state: recovering, checkLive: true, onlyIfLeader: true for: 1 seconds.
   [junit4]   2> 206194 INFO  (qtp233483421-2043) [    ] o.a.s.s.HttpSolrCall [admin] webapp=null path=/admin/cores params={nodeName=127.0.0.1:40068_&onlyIfLeaderActive=true&core=collection1&coreNodeName=core_node3&action=PREPRECOVERY&checkLive=true&state=recovering&onlyIfLeader=true&wt=javabin&version=2} status=0 QTime=1000
   [junit4]   1> -
   [junit4]   1> replica:core_node1 rstate:active live:true
   [junit4]   1> replica:core_node2 rstate:active live:true
   [junit4]   1> replica:core_node3 rstate:recovering live:true
   [junit4]   2> 206696 INFO  (recoveryExecutor-414-thread-1) [    ] o.a.s.c.RecoveryStrategy Starting Replication Recovery.
   [junit4]   2> 206696 INFO  (recoveryExecutor-414-thread-1) [    ] o.a.s.c.RecoveryStrategy Attempting to replicate from [https://127.0.0.1:35225/collection1/].
   [junit4]   2> 206703 INFO  (qtp233483421-2048) [    ] o.a.s.u.DirectUpdateHandler2 start commit{_version_=1562171247027027968,optimize=false,openSearcher=true,waitSearcher=true,expungeDeletes=false,softCommit=false,prepareCommit=false}
   [junit4]   2> 206703 INFO  (qtp233483421-2048) [    ] o.a.s.u.DirectUpdateHandler2 No uncommitted changes. Skipping IW.commit.
   [junit4]   2> 206703 INFO  (qtp233483421-2048) [    ] o.a.s.u.DirectUpdateHandler2 end_commit_flush
   [junit4]   2> 206703 INFO  (qtp233483421-2048) [    ] o.a.s.u.p.LogUpdateProcessorFactory [collection1]  webapp= path=/update params={waitSearcher=true&openSearcher=true&commit=true&softCommit=false&commit_end_point=true&wt=javabin&version=2}{commit=} 0 0
   [junit4]   2> 206712 INFO  (qtp233483421-2043) [    ] o.a.s.c.S.Request [collection1]  webapp= path=/replication params={qt=/replication&wt=javabin&version=2&command=indexversion} status=0 QTime=0
   [junit4]   2> 206713 INFO  (recoveryExecutor-414-thread-1) [    ] o.a.s.h.IndexFetcher Master's generation: 1
   [junit4]   2> 206713 INFO  (recoveryExecutor-414-thread-1) [    ] o.a.s.h.IndexFetcher Master's version: 0
   [junit4]   2> 206713 INFO  (recoveryExecutor-414-thread-1) [    ] o.a.s.h.IndexFetcher Slave's generation: 1
   [junit4]   2> 206713 INFO  (recoveryExecutor-414-thread-1) [    ] o.a.s.h.IndexFetcher Slave's version: 0
   [junit4]   2> 206713 INFO  (recoveryExecutor-414-thread-1) [    ] o.a.s.c.RecoveryStrategy Replication Recovery was successful.
   [junit4]   2> 206713 INFO  (recoveryExecutor-414-thread-1) [    ] o.a.s.c.RecoveryStrategy Registering as Active after recovery.
   [junit4]   2> 206715 INFO  (recoveryExecutor-414-thread-1) [    ] o.a.s.h.ReplicationHandler Poll scheduled at an interval of 3000ms
   [junit4]   2> 206715 WARN  (recoveryExecutor-414-thread-1) [    ] o.a.s.h.ReplicationHandler SolrCloud is enabled for core collection1 but so is old-style replication. Make sure you intend this behavior, it usually indicates a mis-configuration. Master setting is false and slave setting is true
   [junit4]   2> 206715 INFO  (indexFetcher-1051-thread-1) [    ] o.a.s.h.IndexFetcher Updated masterUrl to https://127.0.0.1:35225/collection1/
   [junit4]   2> 206717 INFO  (qtp233483421-2049) [    ] o.a.s.c.S.Request [collection1]  webapp= path=/replication params={qt=/replication&wt=javabin&version=2&command=indexversion} status=0 QTime=0
   [junit4]   2> 206717 INFO  (recoveryExecutor-414-thread-1) [    ] o.a.s.c.RecoveryStrategy Updating version bucket highest from index after successful recovery.
   [junit4]   2> 206717 INFO  (recoveryExecutor-414-thread-1) [    ] o.a.s.u.UpdateLog Could not find max version in index or recent updates, using new clock 1562171247041708032
   [junit4]   2> 206717 INFO  (indexFetcher-1051-thread-1) [    ] o.a.s.h.IndexFetcher Master's generation: 1
   [junit4]   2> 206717 INFO  (indexFetcher-1051-thread-1) [    ] o.a.s.h.IndexFetcher Master's version: 0
   [junit4]   2> 206717 INFO  (indexFetcher-1051-thread-1) [    ] o.a.s.h.IndexFetcher Slave's generation: 1
   [junit4]   2> 206717 INFO  (indexFetcher-1051-thread-1) [    ] o.a.s.h.IndexFetcher Slave's version: 0
   [junit4]   2> 206719 INFO  (recoveryExecutor-414-thread-1) [    ] o.a.s.c.RecoveryStrategy Finished recovery process, successful=[true]
   [junit4]   2> 206819 INFO  (zkCallback-416-thread-1) [    ] o.a.s.c.c.ZkStateReader A cluster state change: [WatchedEvent state:SyncConnected type:NodeDataChanged path:/collections/collection1/state.json] for collection [collection1] has occurred - updating... (live nodes size: [4])
   [junit4]   2> 206819 INFO  (zkCallback-403-thread-2) [    ] o.a.s.c.c.ZkStateReader A cluster state change: [WatchedEvent state:SyncConnected type:NodeDataChanged path:/collections/collection1/state.json] for collection [collection1] has occurred - updating... (live nodes size: [4])
   [junit4]   2> 206819 INFO  (zkCallback-409-thread-1) [    ] o.a.s.c.c.ZkStateReader A cluster state change: [WatchedEvent state:SyncConnected type:NodeDataChanged path:/collections/collection1/state.json] for collection [collection1] has occurred - updating... (live nodes size: [4])
   [junit4]   2> 207410 INFO  (indexFetcher-1044-thread-1) [    ] o.a.s.h.IndexFetcher Updated masterUrl to https://127.0.0.1:35225/collection1/
   [junit4]   2> 207410 INFO  (qtp233483421-2044) [    ] o.a.s.c.S.Request [collection1]  webapp= path=/replication params={qt=/replication&wt=javabin&version=2&command=indexversion} status=0 QTime=0
   [junit4]   2> 207411 INFO  (indexFetcher-1044-thread-1) [    ] o.a.s.h.IndexFetcher Master's generation: 1
   [junit4]   2> 207411 INFO  (indexFetcher-1044-thread-1) [    ] o.a.s.h.IndexFetcher Master's version: 0
   [junit4]   2> 207411 INFO  (indexFetcher-1044-thread-1) [    ] o.a.s.h.IndexFetcher Slave's generation: 1
   [junit4]   2> 207411 INFO  (indexFetcher-1044-thread-1) [    ] o.a.s.h.IndexFetcher Slave's version: 0
   [junit4]   1> -
   [junit4]   1> replica:core_node1 rstate:active live:true
   [junit4]   1> replica:core_node2 rstate:active live:true
   [junit4]   1> replica:core_node3 rstate:active live:true
   [junit4]   1> no one is recoverying
   [junit4]   2> 207588 INFO  (TEST-TestInPlaceUpdatesDistrib.test-seed#[D5030D312D037BD7]) [    ] o.a.s.c.AbstractDistribZkTestBase Recoveries finished - collection: collection1
   [junit4]   2> 207638 INFO  (qtp918268930-2113) [    ] o.a.s.c.S.Request [collection1]  webapp= path=/schema/fields/inplace_updatable_int params={wt=javabin&version=2} status=0 QTime=0
   [junit4]   2> 207686 INFO  (qtp311968227-2077) [    ] o.a.s.c.S.Request [collection1]  webapp= path=/schema/fields/inplace_updatable_float params={wt=javabin&version=2} status=0 QTime=0
   [junit4]   2> 207688 INFO  (qtp311968227-2079) [    ] o.a.s.c.S.Request [collection1]  webapp= path=/schema/fields/_version_ params={wt=javabin&version=2} status=0 QTime=0
   [junit4]   2> 207692 INFO  (TEST-TestInPlaceUpdatesDistrib.test-seed#[D5030D312D037BD7]) [    ] o.a.s.u.DirectUpdateHandler2 [collection1] REMOVING ALL DOCUMENTS FROM INDEX
   [junit4]   2> 207693 INFO  (TEST-TestInPlaceUpdatesDistrib.test-seed#[D5030D312D037BD7]) [    ] o.a.s.s.SolrIndexSearcher Opening [Searcher@6d04b494[collection1] realtime]
   [junit4]   2> 207693 INFO  (TEST-TestInPlaceUpdatesDistrib.test-seed#[D5030D312D037BD7]) [    ] o.a.s.u.p.LogUpdateProcessorFactory [collection1]  webapp=null path=null params={_version_=-9223372036854775807&update.distrib=FROMLEADER&versions=true&wt=json&indent=true}{deleteByQuery=*:* (-9223372036854775807)} 0 1
   [junit4]   2> 207700 INFO  (qtp233483421-2049) [    ] o.a.s.u.p.LogUpdateProcessorFactory [collection1]  webapp= path=/update params={update.distrib=FROMLEADER&_version_=-9223372036854775807&distrib.from=https://127.0.0.1:35225collection1/&wt=javabin&version=2}{deleteByQuery=*:* (-9223372036854775807)} 0 1
   [junit4]   2> 207724 INFO  (qtp233483421-2049) [    ] o.a.s.u.DirectUpdateHandler2 start commit{_version_=1562171248097624064,optimize=false,openSearcher=true,waitSearcher=true,expungeDeletes=false,softCommit=false,prepareCommit=false}
   [junit4]   2> 207729 INFO  (qtp233483421-2049) [    ] o.a.s.u.DirectUpdateHandler2 No uncommitted changes. Skipping IW.commit.
   [junit4]   2> 207729 INFO  (qtp233483421-2049) [    ] o.a.s.u.DirectUpdateHandler2 end_commit_flush
   [junit4]   2> 207729 INFO  (qtp233483421-2049) [    ] o.a.s.u.p.LogUpdateProcessorFactory [collection1]  webapp= path=/update params={update.distrib=FROMLEADER&waitSearcher=true&openSearcher=true&commit=true&softCommit=false&distrib.from=https://127.0.0.1:35225/collection1/&commit_end_point=true&wt=javabin&version=2&expungeDeletes=false}{commit=} 0 5
   [junit4]   2> 207781 INFO  (qtp233483421-2049) [    ] o.a.s.c.S.Request [collection1]  webapp= path=/replication params={qt=/replication&wt=javabin&version=2&command=details} status=0 QTime=1
   [junit4]   2> 207787 INFO  (qtp311968227-2077) [    ] o.a.s.u.p.LogUpdateProcessorFactory [collection1]  webapp= path=/update params={update.distrib=FROMLEADER&waitSearcher=true&openSearcher=true&commit=true&softCommit=false&distrib.from=https://127.0.0.1:35225/collection1/&commit_end_point=true&wt=javabin&version=2&expungeDeletes=false}{commit=} 0 44
   [junit4]   2> 207790 INFO  (qtp233483421-2043) [    ] o.a.s.c.S.Request [collection1]  webapp= path=/replication params={qt=/replication&wt=javabin&version=2&command=details} status=0 QTime=0
   [junit4]   2> 207791 INFO  (qtp918268930-2108) [    ] o.a.s.u.p.LogUpdateProcessorFactory [collection1]  webapp= path=/update params={update.distrib=FROMLEADER&waitSearcher=true&openSearcher=true&commit=true&softCommit=false&distrib.from=https://127.0.0.1:35225/collection1/&commit_end_point=true&wt=javabin&version=2&expungeDeletes=false}{commit=} 0 38
   [junit4]   2> 207801 INFO  (qtp233483421-2042) [    ] o.a.s.u.p.LogUpdateProcessorFactory [collection1]  webapp= path=/update params={waitSearcher=true&commit=true&softCommit=false&wt=javabin&version=2}{commit=} 0 99
   [junit4]   2> 207811 INFO  (qtp311968227-2073) [    ] o.a.s.u.p.LogUpdateProcessorFactory [collection1]  webapp= path=/update params={update.distrib=FROMLEADER&_version_=-9223372036854775807&distrib.from=https://127.0.0.1:35225collection1/&wt=javabin&version=2}{deleteByQuery=*:* (-9223372036854775807)} 0 1
   [junit4]   2> 207842 INFO  (qtp233483421-2044) [    ] o.a.s.u.DirectUpdateHandler2 start commit{_version_=1562171248221356032,optimize=false,openSearcher=true,waitSearcher=true,expungeDeletes=false,softCommit=false,prepareCommit=false}
   [junit4]   2> 207842 INFO  (qtp233483421-2044) [    ] o.a.s.u.DirectUpdateHandler2 No uncommitted changes. Skipping IW.commit.
   [junit4]   2> 207842 INFO  (qtp233483421-2044) [    ] o.a.s.u.DirectUpdateHandler2 end_commit_flush
   [junit4]   2> 207842 INFO  (qtp233483421-2044) [    ] o.a.s.u.p.LogUpdateProcessorFactory [collection1]  webapp= path=/update params={update.distrib=FROMLEADER&waitSearcher=true&openSearcher=true&commit=true&softCommit=false&distrib.from=https://127.0.0.1:42339/collection1/&commit_end_point=true&wt=javabin&version=2&expungeDeletes=false}{commit=} 0 1
   [junit4]   2> 207870 INFO  (qtp233483421-2154) [    ] o.a.s.c.S.Request [collection1]  webapp= path=/replication params={qt=/replication&wt=javabin&version=2&command=details} status=0 QTime=0
   [junit4]   2> 207880 INFO  (qtp233483421-2155) [    ] o.a.s.c.S.Request [collection1]  webapp= path=/replication params={qt=/replication&wt=javabin&version=2&command=details} status=0 QTime=0
   [junit4]   2> 207885 INFO  (qtp918268930-2108) [    ] o.a.s.u.p.LogUpdateProcessorFactory [collection1]  webapp= path=/update params={update.distrib=FROMLEADER&waitSearcher=true&openSearcher=true&commit=true&softCommit=false&distrib.from=https://127.0.0.1:42339/collection1/&commit_end_point=true&wt=javabin&version=2&expungeDeletes=false}{commit=} 0 27
   [junit4]   2> 208403 INFO  (qtp233483421-2042) [    ] o.a.s.c.S.Request [collection1]  webapp= path=/replication params={qt=/replication&wt=javabin&version=2&command=details} status=0 QTime=0
   [junit4]   2> 208931 INFO  (qtp233483421-2154) [    ] o.a.s.c.S.Request [collection1]  webapp= path=/replication params={qt=/replication&wt=javabin&version=2&command=details} status=0 QTime=0
   [junit4]   2> 209445 INFO  (qtp233483421-2156) [    ] o.a.s.c.S.Request [collection1]  webapp= path=/replication params={qt=/replication&wt=javabin&version=2&command=details} status=0 QTime=4
   [junit4]   2> 209715 INFO  (indexFetcher-1051-thread-1) [    ] o.a.s.h.IndexFetcher Updated masterUrl to https://127.0.0.1:35225/collection1/
   [junit4]   2> 209715 INFO  (qtp233483421-2042) [    ] o.a.s.c.S.Request [collection1]  webapp= path=/replication params={qt=/replication&wt=javabin&version=2&command=indexversion} status=0 QTime=0
   [junit4]   2> 209716 INFO  (indexFetcher-1051-thread-1) [    ] o.a.s.h.IndexFetcher Master's generation: 1
   [junit4]   2> 209716 INFO  (indexFetcher-1051-thread-1) [    ] o.a.s.h.IndexFetcher Master's version: 0
   [junit4]   2> 209716 INFO  (indexFetcher-1051-thread-1) [    ] o.a.s.h.IndexFetcher Slave's generation: 1
   [junit4]   2> 209716 INFO  (indexFetcher-1051-thread-1) [    ] o.a.s.h.IndexFetcher Slave's version: 0
   [junit4]   2> 209955 INFO  (qtp233483421-2048) [    ] o.a.s.c.S.Request [collection1]  webapp= path=/replication params={qt=/replication&wt=javabin&version=2&command=details} status=0 QTime=0
   [junit4]   2> 210410 INFO  (indexFetcher-1044-thread-1) [    ] o.a.s.h.IndexFetcher Updated masterUrl to https://127.0.0.1:35225/collection1/
   [junit4]   2> 210410 INFO  (qtp233483421-2049) [    ] o.a.s.c.S.Request [collection1]  webapp= path=/replication params={qt=/replication&wt=javabin&version=2&command=indexversion} status=0 QTime=0
   [junit4]   2> 210411 INFO  (indexFetcher-1044-thread-1) [    ] o.a.s.h.IndexFetcher Master's generation: 1
   [junit4]   2> 210411 INFO  (indexFetcher-1044-thread-1) [    ] o.a.s.h.IndexFetcher Master's version: 0
   [junit4]   2> 210411 INFO  (indexFetcher-1044-thread-1) [    ] o.a.s.h.IndexFetcher Slave's generation: 1
   [junit4]   2> 210411 INFO  (indexFetcher-1044-thread-1) [    ] o.a.s.h.IndexFetcher Slave's version: 0
   [junit4]   2> 210466 INFO  (qtp233483421-2042) [    ] o.a.s.c.S.Request [collection1]  webapp= path=/replication params={qt=/replication&wt=javabin&version=2&command=details} status=0 QTime=0
   [junit4]   2> 210974 INFO  (qtp233483421-2156) [    ] o.a.s.c.S.Request [collection1]  webapp= path=/replication params={qt=/replication&wt=javabin&version=2&command=details} status=0 QTime=0
   [junit4]   2> 211483 INFO  (qtp233483421-2048) [    ] o.a.s.c.S.Request [collection1]  webapp= path=/replication params={qt=/replication&wt=javabin&version=2&command=details} status=0 QTime=0
   [junit4]   2> 211992 INFO  (qtp233483421-2045) [    ] o.a.s.c.S.Request [collection1]  webapp= path=/replication params={qt=/replication&wt=javabin&version=2&command=details} status=0 QTime=0
   [junit4]   2> 212509 INFO  (qtp233483421-2049) [    ] o.a.s.c.S.Request [collection1]  webapp= path=/replication params={qt=/replication&wt=javabin&version=2&command=details} status=0 QTime=1
   [junit4]   2> 212715 INFO  (indexFetcher-1051-thread-1) [    ] o.a.s.h.IndexFetcher Updated masterUrl to https://127.0.0.1:35225/collection1/
   [junit4]   2> 212716 INFO  (qtp233483421-2153) [    ] o.a.s.c.S.Request [collection1]  webapp= path=/replication params={qt=/replication&wt=javabin&version=2&command=indexversion} status=0 QTime=0
   [junit4]   2> 212716 INFO  (indexFetcher-1051-thread-1) [    ] o.a.s.h.IndexFetcher Master's generation: 1
   [junit4]   2> 212716 INFO  (indexFetcher-1051-thread-1) [    ] o.a.s.h.IndexFetcher Master's version: 0
   [junit4]   2> 212716 INFO  (indexFetcher-1051-thread-1) [    ] o.a.s.h.IndexFetcher Slave's generation: 1
   [junit4]   2> 212716 INFO  (indexFetcher-1051-thread-1) [    ] o.a.s.h.IndexFetcher Slave's version: 0
   [junit4]   2> 213022 INFO  (qtp233483421-2044) [    ] o.a.s.c.S.Request [collection1]  webapp= path=/replication params={qt=/replication&wt=javabin&version=2&command=details} status=0 QTime=0
   [junit4]   2> 213410 INFO  (indexFetcher-1044-thread-1) [    ] o.a.s.h.IndexFetcher Updated masterUrl to https://127.0.0.1:35225/collection1/
   [junit4]   2> 213410 INFO  (qtp233483421-2043) [    ] o.a.s.c.S.Request [collection1]  webapp= path=/replication params={qt=/replication&wt=javabin&version=2&command=indexversion} status=0 QTime=0
   [junit4]   2> 213411 INFO  (indexFetcher-1044-thread-1) [    ] o.a.s.h.IndexFetcher Master's generation: 1
   [junit4]   2> 213411 INFO  (indexFetcher-1044-thread-1) [    ] o.a.s.h.IndexFetcher Master's version: 0
   [junit4]   2> 213411 INFO  (indexFetcher-1044-thread-1) [    ] o.a.s.h.IndexFetcher Slave's generation: 1
   [junit4]   2> 213411 INFO  (indexFetcher-1044-thread-1) [    ] o.a.s.h.IndexFetcher Slave's version: 0
   [junit4]   2> 213545 INFO  (qtp233483421-2153) [    ] o.a.s.c.S.Request [collection1]  webapp= path=/replication params={qt=/replication&wt=javabin&version=2&command=details} status=0 QTime=1
   [junit4]   2> 214054 INFO  (qtp233483421-2156) [    ] o.a.s.c.S.Request [collection1]  webapp= path=/replication params={qt=/replication&wt=javabin&version=2&command=details} status=0 QTime=0
   [junit4]   2> 214570 INFO  (qtp233483421-2049) [    ] o.a.s.c.S.Request [collection1]  webapp= path=/replication params={qt=/replication&wt=javabin&version=2&command=details} status=0 QTime=0
   [junit4]   2> 215078 INFO  (qtp233483421-2042) [    ] o.a.s.c.S.Request [collection1]  webapp= path=/replication params={qt=/replication&wt=javabin&version=2&command=details} status=0 QTime=0
   [junit4]   2> 215585 INFO  (qtp233483421-2049) [    ] o.a.s.c.S.Request [collection1]  webapp= path=/replication params={qt=/replication&wt=javabin&version=2&command=details} status=0 QTime=0
   [junit4]   2> 215715 INFO  (indexFetcher-1051-thread-1) [    ] o.a.s.h.IndexFetcher Updated masterUrl to https://127.0.0.1:35225/collection1/
   [junit4]   2> 215715 INFO  (qtp233483421-2154) [    ] o.a.s.c.S.Request [collection1]  webapp= path=/replication params={qt=/replication&wt=javabin&version=2&command=indexversion} status=0 QTime=0
   [junit4]   2> 215716 INFO  (indexFetcher-1051-thread-1) [    ] o.a.s.h.IndexFetcher Master's generation: 1
   [junit4]   2> 215716 INFO  (indexFetcher-1051-thread-1) [    ] o.a.s.h.IndexFetcher Master's version: 0
   [junit4]   2> 215716 INFO  (indexFetcher-1051-thread-1) [    ] o.a.s.h.IndexFetcher Slave's generation: 1
   [junit4]   2> 215716 INFO  (indexFetcher-1051-thread-1) [    ] o.a.s.h.IndexFetcher Slave's version: 0
   [junit4]   2> 216093 INFO  (qtp233483421-2155) [    ] o.a.s.c.S.Request [collection1]  webapp= path=/replication params={qt=/replication&wt=javabin&version=2&command=details} status=0 QTime=0
   [junit4]   2> 216410 INFO  (indexFetcher-1044-thread-1) [    ] o.a.s.h.IndexFetcher Updated masterUrl to https://127.0.0.1:35225/collection1/
   [junit4]   2> 216410 INFO  (qtp233483421-2045) [    ] o.a.s.c.S.Request [collection1]  webapp= path=/replication params={qt=/replication&wt=javabin&version=2&command=indexversion} status=0 QTime=0
   [junit4]   2> 216411 INFO  (indexFetcher-1044-thread-1) [    ] o.a.s.h.IndexFetcher Master's generation: 1
   [junit4]   2> 216411 INFO  (indexFetcher-1044-thread-1) [    ] o.a.s.h.IndexFetcher Master's version: 0
   [junit4]   2> 216411 INFO  (indexFetcher-1044-thread-1) [    ] o.a.s.h.IndexFetcher Slave's generation: 1
   [junit4]   2> 216411 INFO  (indexFetcher-1044-thread-1) [    ] o.a.s.h.IndexFetcher Slave's version: 0
   [junit4]   2> 216602 INFO  (qtp233483421-2048) [    ] o.a.s.c.S.Request [collection1]  webapp= path=/replication params={qt=/replicatio

[...truncated too long message...]

12D037BD7]) [    ] o.e.j.s.AbstractConnector Stopped ServerConnector@38894906{SSL,[ssl, http/1.1]}{127.0.0.1:0}
   [junit4]   2> 411146 INFO  (TEST-TestInPlaceUpdatesDistrib.test-seed#[D5030D312D037BD7]) [    ] o.e.j.s.h.ContextHandler Stopped o.e.j.s.ServletContextHandler@383fb951{/,null,UNAVAILABLE}
   [junit4]   2> 411147 INFO  (TEST-TestInPlaceUpdatesDistrib.test-seed#[D5030D312D037BD7]) [    ] o.a.s.c.ChaosMonkey monkey: stop shard! 40068
   [junit4]   2> 411147 INFO  (TEST-TestInPlaceUpdatesDistrib.test-seed#[D5030D312D037BD7]) [    ] o.a.s.c.CoreContainer Shutting down CoreContainer instance=778615348
   [junit4]   2> 411147 INFO  (TEST-TestInPlaceUpdatesDistrib.test-seed#[D5030D312D037BD7]) [    ] o.a.s.m.SolrMetricManager Closing metric reporters for registry=solr.node, tag=null
   [junit4]   2> 411152 INFO  (TEST-TestInPlaceUpdatesDistrib.test-seed#[D5030D312D037BD7]) [    ] o.a.s.m.SolrMetricManager Closing metric reporters for registry=solr.cluster, tag=null
   [junit4]   2> 411154 INFO  (TEST-TestInPlaceUpdatesDistrib.test-seed#[D5030D312D037BD7]) [    ] o.a.s.c.Overseer Overseer (id=97635702313123856-127.0.0.1:40068_-n_0000000003) closing
   [junit4]   2> 411154 INFO  (OverseerStateUpdate-97635702313123856-127.0.0.1:40068_-n_0000000003) [    ] o.a.s.c.Overseer Overseer Loop exiting : 127.0.0.1:40068_
   [junit4]   2> 411169 ERROR (indexFetcher-1051-thread-1) [    ] o.a.s.h.ReplicationHandler Index fetch failed :org.apache.solr.common.SolrException: No registered leader was found after waiting for 4000ms , collection: collection1 slice: shard1
   [junit4]   2> 	at org.apache.solr.common.cloud.ZkStateReader.getLeaderRetry(ZkStateReader.java:749)
   [junit4]   2> 	at org.apache.solr.common.cloud.ZkStateReader.getLeaderRetry(ZkStateReader.java:735)
   [junit4]   2> 	at org.apache.solr.handler.IndexFetcher.getLeaderReplica(IndexFetcher.java:589)
   [junit4]   2> 	at org.apache.solr.handler.IndexFetcher.fetchLatestIndex(IndexFetcher.java:311)
   [junit4]   2> 	at org.apache.solr.handler.IndexFetcher.fetchLatestIndex(IndexFetcher.java:278)
   [junit4]   2> 	at org.apache.solr.handler.ReplicationHandler.doFetch(ReplicationHandler.java:408)
   [junit4]   2> 	at org.apache.solr.handler.ReplicationHandler.lambda$setupPolling$2(ReplicationHandler.java:1154)
   [junit4]   2> 	at java.base/java.util.concurrent.Executors$RunnableAdapter.call(Executors.java:514)
   [junit4]   2> 	at java.base/java.util.concurrent.FutureTask.runAndReset(FutureTask.java:305)
   [junit4]   2> 	at java.base/java.util.concurrent.ScheduledThreadPoolExecutor$ScheduledFutureTask.run(ScheduledThreadPoolExecutor.java:300)
   [junit4]   2> 	at java.base/java.util.concurrent.ThreadPoolExecutor.runWorker(ThreadPoolExecutor.java:1161)
   [junit4]   2> 	at java.base/java.util.concurrent.ThreadPoolExecutor$Worker.run(ThreadPoolExecutor.java:635)
   [junit4]   2> 	at java.base/java.lang.Thread.run(Thread.java:844)
   [junit4]   2> 
   [junit4]   2> 412151 WARN  (zkCallback-416-thread-3) [    ] o.a.s.c.SyncStrategy Closed, skipping sync up.
   [junit4]   2> 412151 INFO  (zkCallback-416-thread-3) [    ] o.a.s.c.SolrCore [collection1]  CLOSING SolrCore org.apache.solr.core.SolrCore@5f6e9963
   [junit4]   2> 412152 INFO  (zkCallback-416-thread-3) [    ] o.a.s.u.DirectUpdateHandler2 Committing on IndexWriter close.
   [junit4]   2> 412152 INFO  (zkCallback-416-thread-3) [    ] o.a.s.u.SolrIndexWriter Calling setCommitData with IW:org.apache.solr.update.SolrIndexWriter@5bf16e58 commitCommandVersion:0
   [junit4]   2> 412331 INFO  (zkCallback-416-thread-3) [    ] o.a.s.m.SolrMetricManager Closing metric reporters for registry=solr.core.collection1.shard1.core_node3, tag=1601083747
   [junit4]   2> 412660 WARN  (zkCallback-416-thread-4) [    ] o.a.s.c.c.ZkStateReader ZooKeeper watch triggered, but Solr cannot talk to ZK: [KeeperErrorCode = Session expired for /live_nodes]
   [junit4]   2> 412661 INFO  (TEST-TestInPlaceUpdatesDistrib.test-seed#[D5030D312D037BD7]) [    ] o.e.j.s.AbstractConnector Stopped ServerConnector@75902cc3{SSL,[ssl, http/1.1]}{127.0.0.1:0}
   [junit4]   2> 412661 INFO  (TEST-TestInPlaceUpdatesDistrib.test-seed#[D5030D312D037BD7]) [    ] o.e.j.s.h.ContextHandler Stopped o.e.j.s.ServletContextHandler@1fb95020{/,null,UNAVAILABLE}
   [junit4]   2> 412663 INFO  (TEST-TestInPlaceUpdatesDistrib.test-seed#[D5030D312D037BD7]) [    ] o.a.s.c.ZkTestServer connecting to 127.0.0.1:37049 37049
   [junit4]   2> 413094 INFO  (Thread-432) [    ] o.a.s.c.ZkTestServer connecting to 127.0.0.1:37049 37049
   [junit4]   2> 413096 WARN  (Thread-432) [    ] o.a.s.c.ZkTestServer Watch limit violations: 
   [junit4]   2> Maximum concurrent create/delete watches above limit:
   [junit4]   2> 
   [junit4]   2> 	5	/solr/aliases.json
   [junit4]   2> 	4	/solr/security.json
   [junit4]   2> 	4	/solr/configs/conf1
   [junit4]   2> 
   [junit4]   2> Maximum concurrent data watches above limit:
   [junit4]   2> 
   [junit4]   2> 	5	/solr/clusterstate.json
   [junit4]   2> 	5	/solr/clusterprops.json
   [junit4]   2> 	3	/solr/collections/collection1/state.json
   [junit4]   2> 
   [junit4]   2> Maximum concurrent children watches above limit:
   [junit4]   2> 
   [junit4]   2> 	210	/solr/overseer/collection-queue-work
   [junit4]   2> 	33	/solr/overseer/queue
   [junit4]   2> 	15	/solr/overseer/queue-work
   [junit4]   2> 	5	/solr/live_nodes
   [junit4]   2> 	5	/solr/collections
   [junit4]   2> 
   [junit4]   2> NOTE: reproduce with: ant test  -Dtestcase=TestInPlaceUpdatesDistrib -Dtests.method=test -Dtests.seed=D5030D312D037BD7 -Dtests.multiplier=3 -Dtests.slow=true -Dtests.locale=ff -Dtests.timezone=Egypt -Dtests.asserts=true -Dtests.file.encoding=US-ASCII
   [junit4] FAILURE  216s J0 | TestInPlaceUpdatesDistrib.test <<<
   [junit4]    > Throwable #1: java.lang.AssertionError: inplace_updatable_float didn't match for replica at client: https://127.0.0.1:42339/collection1 expected:<109.0> but was:<1.0>
   [junit4]    > 	at __randomizedtesting.SeedInfo.seed([D5030D312D037BD7:5D5732EB83FF162F]:0)
   [junit4]    > 	at org.apache.solr.update.TestInPlaceUpdatesDistrib.assertReplicaValue(TestInPlaceUpdatesDistrib.java:1005)
   [junit4]    > 	at org.apache.solr.update.TestInPlaceUpdatesDistrib.outOfOrderUpdatesIndividualReplicaTest(TestInPlaceUpdatesDistrib.java:665)
   [junit4]    > 	at org.apache.solr.update.TestInPlaceUpdatesDistrib.test(TestInPlaceUpdatesDistrib.java:162)
   [junit4]    > 	at java.base/jdk.internal.reflect.NativeMethodAccessorImpl.invoke0(Native Method)
   [junit4]    > 	at java.base/jdk.internal.reflect.NativeMethodAccessorImpl.invoke(NativeMethodAccessorImpl.java:62)
   [junit4]    > 	at java.base/jdk.internal.reflect.DelegatingMethodAccessorImpl.invoke(DelegatingMethodAccessorImpl.java:43)
   [junit4]    > 	at java.base/java.lang.reflect.Method.invoke(Method.java:547)
   [junit4]    > 	at org.apache.solr.BaseDistributedSearchTestCase$ShardsRepeatRule$ShardsFixedStatement.callStatement(BaseDistributedSearchTestCase.java:985)
   [junit4]    > 	at org.apache.solr.BaseDistributedSearchTestCase$ShardsRepeatRule$ShardsStatement.evaluate(BaseDistributedSearchTestCase.java:960)
   [junit4]    > 	at java.base/java.lang.Thread.run(Thread.java:844)
   [junit4]   2> 413099 INFO  (SUITE-TestInPlaceUpdatesDistrib-seed#[D5030D312D037BD7]-worker) [    ] o.a.s.SolrTestCaseJ4 ###deleteCore
   [junit4]   2> 413100 INFO  (SUITE-TestInPlaceUpdatesDistrib-seed#[D5030D312D037BD7]-worker) [    ] o.a.s.c.CoreContainer Shutting down CoreContainer instance=1872651812
   [junit4]   2> 413100 INFO  (SUITE-TestInPlaceUpdatesDistrib-seed#[D5030D312D037BD7]-worker) [    ] o.a.s.m.SolrMetricManager Closing metric reporters for registry=solr.node, tag=null
   [junit4]   2> 413101 INFO  (coreCloseExecutor-1089-thread-1) [    ] o.a.s.c.SolrCore [collection1]  CLOSING SolrCore org.apache.solr.core.SolrCore@65ae9315
   [junit4]   2> 413138 INFO  (coreCloseExecutor-1089-thread-1) [    ] o.a.s.m.SolrMetricManager Closing metric reporters for registry=solr.core.collection1, tag=1705939733
   [junit4]   2> NOTE: leaving temporary files on disk at: /home/jenkins/workspace/Lucene-Solr-master-Linux/solr/build/solr-core/test/J0/temp/solr.update.TestInPlaceUpdatesDistrib_D5030D312D037BD7-001
   [junit4]   2> Mar 18, 2017 2:06:42 AM com.carrotsearch.randomizedtesting.ThreadLeakControl checkThreadLeaks
   [junit4]   2> WARNING: Will linger awaiting termination of 1 leaked thread(s).
   [junit4]   2> NOTE: test params are: codec=Asserting(Lucene70): {id_i=PostingsFormat(name=LuceneVarGapFixedInterval), title_s=BlockTreeOrds(blocksize=128), id=Lucene50(blocksize=128), id_field_copy_that_does_not_support_in_place_update_s=BlockTreeOrds(blocksize=128)}, docValues:{inplace_updatable_float=DocValuesFormat(name=Lucene70), id_i=DocValuesFormat(name=Asserting), _version_=DocValuesFormat(name=Lucene70), id=DocValuesFormat(name=Lucene70), inplace_updatable_int_with_default=DocValuesFormat(name=Lucene70), inplace_updatable_int=DocValuesFormat(name=Asserting), inplace_updatable_float_with_default=DocValuesFormat(name=Asserting)}, maxPointsInLeafNode=1657, maxMBSortInHeap=5.562092610037441, sim=RandomSimilarity(queryNorm=false): {}, locale=ff, timezone=Egypt
   [junit4]   2> NOTE: Linux 4.4.0-66-generic amd64/Oracle Corporation 9-ea (64-bit)/cpus=12,threads=1,free=321133784,total=518979584
   [junit4]   2> NOTE: All tests run in this JVM: [BlockDirectoryTest, SimpleMLTQParserTest, TestExportWriter, TestJoin, SystemInfoHandlerTest, TestBadConfig, CopyFieldTest, TestFaceting, TestFieldCollectionResource, TestCloudManagedSchema, TestReplicationHandlerBackup, TestLazyCores, ResponseLogComponentTest, TestManagedStopFilterFactory, TestDistributedSearch, VersionInfoTest, DistribJoinFromCollectionTest, ZkStateWriterTest, TestSolrConfigHandlerConcurrent, CollectionReloadTest, TestInPlaceUpdatesDistrib]
   [junit4] Completed [106/701 (1!)] on J0 in 216.99s, 1 test, 1 failure <<< FAILURES!

[...truncated 53693 lines...]


Mime
View raw message