lucene-dev mailing list archives

Site index · List index
Message view « Date » · « Thread »
Top « Date » · « Thread »
From Apache Jenkins Server <jenk...@builds.apache.org>
Subject [JENKINS] Lucene-Solr-Tests-6.x - Build # 787 - Unstable
Date Mon, 13 Mar 2017 00:36:31 GMT
Build: https://builds.apache.org/job/Lucene-Solr-Tests-6.x/787/

1 tests failed.
FAILED:  org.apache.solr.cloud.MissingSegmentRecoveryTest.testLeaderRecovery

Error Message:
Expected a collection with one shard and two replicas null Last available state: DocCollection(MissingSegmentRecoveryTest//collections/MissingSegmentRecoveryTest/state.json/8)={   "replicationFactor":"2",   "shards":{"shard1":{       "range":"80000000-7fffffff",       "state":"active",       "replicas":{         "core_node1":{           "core":"MissingSegmentRecoveryTest_shard1_replica2",           "base_url":"https://127.0.0.1:42332/solr",           "node_name":"127.0.0.1:42332_solr",           "state":"active",           "leader":"true"},         "core_node2":{           "core":"MissingSegmentRecoveryTest_shard1_replica1",           "base_url":"https://127.0.0.1:42405/solr",           "node_name":"127.0.0.1:42405_solr",           "state":"down"}}}},   "router":{"name":"compositeId"},   "maxShardsPerNode":"1",   "autoAddReplicas":"false"}

Stack Trace:
java.lang.AssertionError: Expected a collection with one shard and two replicas
null
Last available state: DocCollection(MissingSegmentRecoveryTest//collections/MissingSegmentRecoveryTest/state.json/8)={
  "replicationFactor":"2",
  "shards":{"shard1":{
      "range":"80000000-7fffffff",
      "state":"active",
      "replicas":{
        "core_node1":{
          "core":"MissingSegmentRecoveryTest_shard1_replica2",
          "base_url":"https://127.0.0.1:42332/solr",
          "node_name":"127.0.0.1:42332_solr",
          "state":"active",
          "leader":"true"},
        "core_node2":{
          "core":"MissingSegmentRecoveryTest_shard1_replica1",
          "base_url":"https://127.0.0.1:42405/solr",
          "node_name":"127.0.0.1:42405_solr",
          "state":"down"}}}},
  "router":{"name":"compositeId"},
  "maxShardsPerNode":"1",
  "autoAddReplicas":"false"}
	at __randomizedtesting.SeedInfo.seed([14C5CB33E4BE8943:44905330BD9F3F5E]:0)
	at org.junit.Assert.fail(Assert.java:93)
	at org.apache.solr.cloud.SolrCloudTestCase.waitForState(SolrCloudTestCase.java:265)
	at org.apache.solr.cloud.MissingSegmentRecoveryTest.testLeaderRecovery(MissingSegmentRecoveryTest.java:105)
	at sun.reflect.NativeMethodAccessorImpl.invoke0(Native Method)
	at sun.reflect.NativeMethodAccessorImpl.invoke(NativeMethodAccessorImpl.java:62)
	at sun.reflect.DelegatingMethodAccessorImpl.invoke(DelegatingMethodAccessorImpl.java:43)
	at java.lang.reflect.Method.invoke(Method.java:498)
	at com.carrotsearch.randomizedtesting.RandomizedRunner.invoke(RandomizedRunner.java:1713)
	at com.carrotsearch.randomizedtesting.RandomizedRunner$8.evaluate(RandomizedRunner.java:907)
	at com.carrotsearch.randomizedtesting.RandomizedRunner$9.evaluate(RandomizedRunner.java:943)
	at com.carrotsearch.randomizedtesting.RandomizedRunner$10.evaluate(RandomizedRunner.java:957)
	at com.carrotsearch.randomizedtesting.rules.SystemPropertiesRestoreRule$1.evaluate(SystemPropertiesRestoreRule.java:57)
	at org.apache.lucene.util.TestRuleSetupTeardownChained$1.evaluate(TestRuleSetupTeardownChained.java:49)
	at org.apache.lucene.util.AbstractBeforeAfterRule$1.evaluate(AbstractBeforeAfterRule.java:45)
	at org.apache.lucene.util.TestRuleThreadAndTestName$1.evaluate(TestRuleThreadAndTestName.java:48)
	at org.apache.lucene.util.TestRuleIgnoreAfterMaxFailures$1.evaluate(TestRuleIgnoreAfterMaxFailures.java:64)
	at org.apache.lucene.util.TestRuleMarkFailure$1.evaluate(TestRuleMarkFailure.java:47)
	at com.carrotsearch.randomizedtesting.rules.StatementAdapter.evaluate(StatementAdapter.java:36)
	at com.carrotsearch.randomizedtesting.ThreadLeakControl$StatementRunner.run(ThreadLeakControl.java:368)
	at com.carrotsearch.randomizedtesting.ThreadLeakControl.forkTimeoutingTask(ThreadLeakControl.java:817)
	at com.carrotsearch.randomizedtesting.ThreadLeakControl$3.evaluate(ThreadLeakControl.java:468)
	at com.carrotsearch.randomizedtesting.RandomizedRunner.runSingleTest(RandomizedRunner.java:916)
	at com.carrotsearch.randomizedtesting.RandomizedRunner$5.evaluate(RandomizedRunner.java:802)
	at com.carrotsearch.randomizedtesting.RandomizedRunner$6.evaluate(RandomizedRunner.java:852)
	at com.carrotsearch.randomizedtesting.RandomizedRunner$7.evaluate(RandomizedRunner.java:863)
	at com.carrotsearch.randomizedtesting.rules.StatementAdapter.evaluate(StatementAdapter.java:36)
	at com.carrotsearch.randomizedtesting.rules.SystemPropertiesRestoreRule$1.evaluate(SystemPropertiesRestoreRule.java:57)
	at org.apache.lucene.util.AbstractBeforeAfterRule$1.evaluate(AbstractBeforeAfterRule.java:45)
	at com.carrotsearch.randomizedtesting.rules.StatementAdapter.evaluate(StatementAdapter.java:36)
	at org.apache.lucene.util.TestRuleStoreClassName$1.evaluate(TestRuleStoreClassName.java:41)
	at com.carrotsearch.randomizedtesting.rules.NoShadowingOrOverridesOnMethodsRule$1.evaluate(NoShadowingOrOverridesOnMethodsRule.java:40)
	at com.carrotsearch.randomizedtesting.rules.NoShadowingOrOverridesOnMethodsRule$1.evaluate(NoShadowingOrOverridesOnMethodsRule.java:40)
	at com.carrotsearch.randomizedtesting.rules.StatementAdapter.evaluate(StatementAdapter.java:36)
	at com.carrotsearch.randomizedtesting.rules.StatementAdapter.evaluate(StatementAdapter.java:36)
	at com.carrotsearch.randomizedtesting.rules.StatementAdapter.evaluate(StatementAdapter.java:36)
	at org.apache.lucene.util.TestRuleAssertionsRequired$1.evaluate(TestRuleAssertionsRequired.java:53)
	at org.apache.lucene.util.TestRuleMarkFailure$1.evaluate(TestRuleMarkFailure.java:47)
	at org.apache.lucene.util.TestRuleIgnoreAfterMaxFailures$1.evaluate(TestRuleIgnoreAfterMaxFailures.java:64)
	at org.apache.lucene.util.TestRuleIgnoreTestSuites$1.evaluate(TestRuleIgnoreTestSuites.java:54)
	at com.carrotsearch.randomizedtesting.rules.StatementAdapter.evaluate(StatementAdapter.java:36)
	at com.carrotsearch.randomizedtesting.ThreadLeakControl$StatementRunner.run(ThreadLeakControl.java:368)
	at java.lang.Thread.run(Thread.java:745)




Build Log:
[...truncated 11250 lines...]
   [junit4] Suite: org.apache.solr.cloud.MissingSegmentRecoveryTest
   [junit4]   2> Creating dataDir: /x1/jenkins/jenkins-slave/workspace/Lucene-Solr-Tests-6.x/solr/build/solr-core/test/J0/temp/solr.cloud.MissingSegmentRecoveryTest_14C5CB33E4BE8943-001/init-core-data-001
   [junit4]   2> 255425 WARN  (SUITE-MissingSegmentRecoveryTest-seed#[14C5CB33E4BE8943]-worker) [    ] o.a.s.SolrTestCaseJ4 startTrackingSearchers: numOpens=1 numCloses=1
   [junit4]   2> 255428 INFO  (SUITE-MissingSegmentRecoveryTest-seed#[14C5CB33E4BE8943]-worker) [    ] o.a.s.SolrTestCaseJ4 Using TrieFields
   [junit4]   2> 255429 INFO  (SUITE-MissingSegmentRecoveryTest-seed#[14C5CB33E4BE8943]-worker) [    ] o.a.s.SolrTestCaseJ4 Randomized ssl (true) and clientAuth (false) via: @org.apache.solr.util.RandomizeSSL(reason=, ssl=NaN, value=NaN, clientAuth=NaN)
   [junit4]   2> 255439 INFO  (SUITE-MissingSegmentRecoveryTest-seed#[14C5CB33E4BE8943]-worker) [    ] o.a.s.c.MiniSolrCloudCluster Starting cluster of 2 servers in /x1/jenkins/jenkins-slave/workspace/Lucene-Solr-Tests-6.x/solr/build/solr-core/test/J0/temp/solr.cloud.MissingSegmentRecoveryTest_14C5CB33E4BE8943-001/tempDir-001
   [junit4]   2> 255439 INFO  (SUITE-MissingSegmentRecoveryTest-seed#[14C5CB33E4BE8943]-worker) [    ] o.a.s.c.ZkTestServer STARTING ZK TEST SERVER
   [junit4]   2> 255454 INFO  (Thread-307) [    ] o.a.s.c.ZkTestServer client port:0.0.0.0/0.0.0.0:0
   [junit4]   2> 255454 INFO  (Thread-307) [    ] o.a.s.c.ZkTestServer Starting server
   [junit4]   2> 255676 INFO  (SUITE-MissingSegmentRecoveryTest-seed#[14C5CB33E4BE8943]-worker) [    ] o.a.s.c.ZkTestServer start zk server on port:43844
   [junit4]   2> 255699 INFO  (jetty-launcher-384-thread-1) [    ] o.e.j.s.Server jetty-9.3.14.v20161028
   [junit4]   2> 255737 INFO  (jetty-launcher-384-thread-2) [    ] o.e.j.s.Server jetty-9.3.14.v20161028
   [junit4]   2> 255741 INFO  (jetty-launcher-384-thread-1) [    ] o.e.j.s.h.ContextHandler Started o.e.j.s.ServletContextHandler@4e4e246f{/solr,null,AVAILABLE}
   [junit4]   2> 255742 INFO  (jetty-launcher-384-thread-1) [    ] o.e.j.s.AbstractConnector Started ServerConnector@5caa5980{SSL,[ssl, http/1.1]}{127.0.0.1:42405}
   [junit4]   2> 255742 INFO  (jetty-launcher-384-thread-1) [    ] o.e.j.s.Server Started @259336ms
   [junit4]   2> 255742 INFO  (jetty-launcher-384-thread-1) [    ] o.a.s.c.s.e.JettySolrRunner Jetty properties: {hostContext=/solr, hostPort=42405}
   [junit4]   2> 255743 ERROR (jetty-launcher-384-thread-1) [    ] o.a.s.s.StartupLoggingUtils Missing Java Option solr.log.dir. Logging may be missing or incomplete.
   [junit4]   2> 255743 INFO  (jetty-launcher-384-thread-1) [    ] o.a.s.s.SolrDispatchFilter  ___      _       Welcome to Apache Solr™ version 6.5.0
   [junit4]   2> 255743 INFO  (jetty-launcher-384-thread-1) [    ] o.a.s.s.SolrDispatchFilter / __| ___| |_ _   Starting in cloud mode on port null
   [junit4]   2> 255743 INFO  (jetty-launcher-384-thread-1) [    ] o.a.s.s.SolrDispatchFilter \__ \/ _ \ | '_|  Install dir: null
   [junit4]   2> 255743 INFO  (jetty-launcher-384-thread-1) [    ] o.a.s.s.SolrDispatchFilter |___/\___/_|_|    Start time: 2017-03-12T23:48:25.688Z
   [junit4]   2> 255772 INFO  (jetty-launcher-384-thread-2) [    ] o.e.j.s.h.ContextHandler Started o.e.j.s.ServletContextHandler@53ca2202{/solr,null,AVAILABLE}
   [junit4]   2> 255773 INFO  (jetty-launcher-384-thread-2) [    ] o.e.j.s.AbstractConnector Started ServerConnector@1e044d43{SSL,[ssl, http/1.1]}{127.0.0.1:42332}
   [junit4]   2> 255773 INFO  (jetty-launcher-384-thread-2) [    ] o.e.j.s.Server Started @259366ms
   [junit4]   2> 255773 INFO  (jetty-launcher-384-thread-2) [    ] o.a.s.c.s.e.JettySolrRunner Jetty properties: {hostContext=/solr, hostPort=42332}
   [junit4]   2> 255773 ERROR (jetty-launcher-384-thread-2) [    ] o.a.s.s.StartupLoggingUtils Missing Java Option solr.log.dir. Logging may be missing or incomplete.
   [junit4]   2> 255773 INFO  (jetty-launcher-384-thread-2) [    ] o.a.s.s.SolrDispatchFilter  ___      _       Welcome to Apache Solr™ version 6.5.0
   [junit4]   2> 255773 INFO  (jetty-launcher-384-thread-2) [    ] o.a.s.s.SolrDispatchFilter / __| ___| |_ _   Starting in cloud mode on port null
   [junit4]   2> 255773 INFO  (jetty-launcher-384-thread-2) [    ] o.a.s.s.SolrDispatchFilter \__ \/ _ \ | '_|  Install dir: null
   [junit4]   2> 255773 INFO  (jetty-launcher-384-thread-2) [    ] o.a.s.s.SolrDispatchFilter |___/\___/_|_|    Start time: 2017-03-12T23:48:25.718Z
   [junit4]   2> 255778 INFO  (jetty-launcher-384-thread-1) [    ] o.a.s.s.SolrDispatchFilter solr.xml found in ZooKeeper. Loading...
   [junit4]   2> 255779 INFO  (jetty-launcher-384-thread-2) [    ] o.a.s.s.SolrDispatchFilter solr.xml found in ZooKeeper. Loading...
   [junit4]   2> 255787 INFO  (jetty-launcher-384-thread-1) [    ] o.a.s.u.UpdateShardHandler Creating UpdateShardHandler HTTP client with params: socketTimeout=340000&connTimeout=45000&retry=true
   [junit4]   2> 255788 INFO  (jetty-launcher-384-thread-1) [    ] o.a.s.c.ZkContainer Zookeeper client=127.0.0.1:43844/solr
   [junit4]   2> 255790 INFO  (jetty-launcher-384-thread-2) [    ] o.a.s.u.UpdateShardHandler Creating UpdateShardHandler HTTP client with params: socketTimeout=340000&connTimeout=45000&retry=true
   [junit4]   2> 255791 INFO  (jetty-launcher-384-thread-2) [    ] o.a.s.c.ZkContainer Zookeeper client=127.0.0.1:43844/solr
   [junit4]   2> 255799 WARN  (NIOServerCxn.Factory:0.0.0.0/0.0.0.0:0) [    ] o.a.z.s.NIOServerCnxn caught end of stream exception
   [junit4]   2> EndOfStreamException: Unable to read additional data from client sessionid 0x15ac4ec4ec00003, likely client has closed socket
   [junit4]   2> 	at org.apache.zookeeper.server.NIOServerCnxn.doIO(NIOServerCnxn.java:228)
   [junit4]   2> 	at org.apache.zookeeper.server.NIOServerCnxnFactory.run(NIOServerCnxnFactory.java:208)
   [junit4]   2> 	at java.lang.Thread.run(Thread.java:745)
   [junit4]   2> 255812 INFO  (jetty-launcher-384-thread-2) [n:127.0.0.1:42332_solr    ] o.a.s.c.Overseer Overseer (id=null) closing
   [junit4]   2> 255812 INFO  (jetty-launcher-384-thread-2) [n:127.0.0.1:42332_solr    ] o.a.s.c.OverseerElectionContext I am going to be the leader 127.0.0.1:42332_solr
   [junit4]   2> 255813 INFO  (jetty-launcher-384-thread-2) [n:127.0.0.1:42332_solr    ] o.a.s.c.Overseer Overseer (id=97606861154418693-127.0.0.1:42332_solr-n_0000000000) starting
   [junit4]   2> 255819 INFO  (jetty-launcher-384-thread-2) [n:127.0.0.1:42332_solr    ] o.a.s.c.ZkController Register node as live in ZooKeeper:/live_nodes/127.0.0.1:42332_solr
   [junit4]   2> 255824 INFO  (zkCallback-395-thread-1-processing-n:127.0.0.1:42332_solr) [n:127.0.0.1:42332_solr    ] o.a.s.c.c.ZkStateReader Updated live nodes from ZooKeeper... (0) -> (1)
   [junit4]   2> 255832 INFO  (jetty-launcher-384-thread-1) [n:127.0.0.1:42405_solr    ] o.a.s.c.Overseer Overseer (id=null) closing
   [junit4]   2> 255835 INFO  (jetty-launcher-384-thread-1) [n:127.0.0.1:42405_solr    ] o.a.s.c.ZkController Register node as live in ZooKeeper:/live_nodes/127.0.0.1:42405_solr
   [junit4]   2> 255837 INFO  (zkCallback-395-thread-1-processing-n:127.0.0.1:42332_solr) [n:127.0.0.1:42332_solr    ] o.a.s.c.c.ZkStateReader Updated live nodes from ZooKeeper... (1) -> (2)
   [junit4]   2> 255846 INFO  (zkCallback-396-thread-2-processing-n:127.0.0.1:42405_solr) [n:127.0.0.1:42405_solr    ] o.a.s.c.c.ZkStateReader Updated live nodes from ZooKeeper... (0) -> (2)
   [junit4]   2> 255904 INFO  (jetty-launcher-384-thread-2) [n:127.0.0.1:42332_solr    ] o.a.s.c.CorePropertiesLocator Found 0 core definitions underneath /x1/jenkins/jenkins-slave/workspace/Lucene-Solr-Tests-6.x/solr/build/solr-core/test/J0/temp/solr.cloud.MissingSegmentRecoveryTest_14C5CB33E4BE8943-001/tempDir-001/node2/.
   [junit4]   2> 255908 INFO  (jetty-launcher-384-thread-1) [n:127.0.0.1:42405_solr    ] o.a.s.c.CorePropertiesLocator Found 0 core definitions underneath /x1/jenkins/jenkins-slave/workspace/Lucene-Solr-Tests-6.x/solr/build/solr-core/test/J0/temp/solr.cloud.MissingSegmentRecoveryTest_14C5CB33E4BE8943-001/tempDir-001/node1/.
   [junit4]   2> 255973 INFO  (SUITE-MissingSegmentRecoveryTest-seed#[14C5CB33E4BE8943]-worker) [    ] o.a.s.c.c.ZkStateReader Updated live nodes from ZooKeeper... (0) -> (2)
   [junit4]   2> 255974 INFO  (SUITE-MissingSegmentRecoveryTest-seed#[14C5CB33E4BE8943]-worker) [    ] o.a.s.c.s.i.ZkClientClusterStateProvider Cluster at 127.0.0.1:43844/solr ready
   [junit4]   2> 255988 INFO  (TEST-MissingSegmentRecoveryTest.testLeaderRecovery-seed#[14C5CB33E4BE8943]) [    ] o.a.s.SolrTestCaseJ4 ###Starting testLeaderRecovery
   [junit4]   2> 256124 INFO  (qtp1588007903-1820) [n:127.0.0.1:42332_solr    ] o.a.s.h.a.CollectionsHandler Invoked Collection Action :create with params replicationFactor=2&collection.configName=conf&maxShardsPerNode=1&name=MissingSegmentRecoveryTest&action=CREATE&numShards=1&wt=javabin&version=2 and sendToOCPQueue=true
   [junit4]   2> 256126 INFO  (OverseerThreadFactory-686-thread-1-processing-n:127.0.0.1:42332_solr) [n:127.0.0.1:42332_solr    ] o.a.s.c.CreateCollectionCmd Create collection MissingSegmentRecoveryTest
   [junit4]   2> 256270 INFO  (qtp1588007903-1818) [n:127.0.0.1:42332_solr    ] o.a.s.h.a.CoreAdminOperation core create command qt=/admin/cores&collection.configName=conf&newCollection=true&name=MissingSegmentRecoveryTest_shard1_replica2&action=CREATE&numShards=1&collection=MissingSegmentRecoveryTest&shard=shard1&wt=javabin&version=2
   [junit4]   2> 256324 INFO  (qtp753748761-1807) [n:127.0.0.1:42405_solr    ] o.a.s.h.a.CoreAdminOperation core create command qt=/admin/cores&collection.configName=conf&newCollection=true&name=MissingSegmentRecoveryTest_shard1_replica1&action=CREATE&numShards=1&collection=MissingSegmentRecoveryTest&shard=shard1&wt=javabin&version=2
   [junit4]   2> 256428 INFO  (zkCallback-395-thread-4-processing-n:127.0.0.1:42332_solr) [n:127.0.0.1:42332_solr    ] o.a.s.c.c.ZkStateReader A cluster state change: [WatchedEvent state:SyncConnected type:NodeDataChanged path:/collections/MissingSegmentRecoveryTest/state.json] for collection [MissingSegmentRecoveryTest] has occurred - updating... (live nodes size: [2])
   [junit4]   2> 256428 INFO  (zkCallback-396-thread-1-processing-n:127.0.0.1:42405_solr) [n:127.0.0.1:42405_solr    ] o.a.s.c.c.ZkStateReader A cluster state change: [WatchedEvent state:SyncConnected type:NodeDataChanged path:/collections/MissingSegmentRecoveryTest/state.json] for collection [MissingSegmentRecoveryTest] has occurred - updating... (live nodes size: [2])
   [junit4]   2> 257284 INFO  (qtp1588007903-1818) [n:127.0.0.1:42332_solr c:MissingSegmentRecoveryTest s:shard1  x:MissingSegmentRecoveryTest_shard1_replica2] o.a.s.c.SolrConfig Using Lucene MatchVersion: 6.5.0
   [junit4]   2> 257291 INFO  (qtp1588007903-1818) [n:127.0.0.1:42332_solr c:MissingSegmentRecoveryTest s:shard1  x:MissingSegmentRecoveryTest_shard1_replica2] o.a.s.s.IndexSchema [MissingSegmentRecoveryTest_shard1_replica2] Schema name=minimal
   [junit4]   2> 257293 INFO  (qtp1588007903-1818) [n:127.0.0.1:42332_solr c:MissingSegmentRecoveryTest s:shard1  x:MissingSegmentRecoveryTest_shard1_replica2] o.a.s.s.IndexSchema Loaded schema minimal/1.1 with uniqueid field id
   [junit4]   2> 257294 INFO  (qtp1588007903-1818) [n:127.0.0.1:42332_solr c:MissingSegmentRecoveryTest s:shard1  x:MissingSegmentRecoveryTest_shard1_replica2] o.a.s.c.CoreContainer Creating SolrCore 'MissingSegmentRecoveryTest_shard1_replica2' using configuration from collection MissingSegmentRecoveryTest
   [junit4]   2> 257295 INFO  (qtp1588007903-1818) [n:127.0.0.1:42332_solr c:MissingSegmentRecoveryTest s:shard1  x:MissingSegmentRecoveryTest_shard1_replica2] o.a.s.c.SolrCore [[MissingSegmentRecoveryTest_shard1_replica2] ] Opening new SolrCore at [/x1/jenkins/jenkins-slave/workspace/Lucene-Solr-Tests-6.x/solr/build/solr-core/test/J0/temp/solr.cloud.MissingSegmentRecoveryTest_14C5CB33E4BE8943-001/tempDir-001/node2/MissingSegmentRecoveryTest_shard1_replica2], dataDir=[/x1/jenkins/jenkins-slave/workspace/Lucene-Solr-Tests-6.x/solr/build/solr-core/test/J0/temp/solr.cloud.MissingSegmentRecoveryTest_14C5CB33E4BE8943-001/tempDir-001/node2/./MissingSegmentRecoveryTest_shard1_replica2/data/]
   [junit4]   2> 257342 INFO  (qtp753748761-1807) [n:127.0.0.1:42405_solr c:MissingSegmentRecoveryTest s:shard1  x:MissingSegmentRecoveryTest_shard1_replica1] o.a.s.c.SolrConfig Using Lucene MatchVersion: 6.5.0
   [junit4]   2> 257349 INFO  (qtp753748761-1807) [n:127.0.0.1:42405_solr c:MissingSegmentRecoveryTest s:shard1  x:MissingSegmentRecoveryTest_shard1_replica1] o.a.s.s.IndexSchema [MissingSegmentRecoveryTest_shard1_replica1] Schema name=minimal
   [junit4]   2> 257357 INFO  (qtp753748761-1807) [n:127.0.0.1:42405_solr c:MissingSegmentRecoveryTest s:shard1  x:MissingSegmentRecoveryTest_shard1_replica1] o.a.s.s.IndexSchema Loaded schema minimal/1.1 with uniqueid field id
   [junit4]   2> 257360 INFO  (qtp753748761-1807) [n:127.0.0.1:42405_solr c:MissingSegmentRecoveryTest s:shard1  x:MissingSegmentRecoveryTest_shard1_replica1] o.a.s.c.CoreContainer Creating SolrCore 'MissingSegmentRecoveryTest_shard1_replica1' using configuration from collection MissingSegmentRecoveryTest
   [junit4]   2> 257360 INFO  (qtp753748761-1807) [n:127.0.0.1:42405_solr c:MissingSegmentRecoveryTest s:shard1  x:MissingSegmentRecoveryTest_shard1_replica1] o.a.s.c.SolrCore [[MissingSegmentRecoveryTest_shard1_replica1] ] Opening new SolrCore at [/x1/jenkins/jenkins-slave/workspace/Lucene-Solr-Tests-6.x/solr/build/solr-core/test/J0/temp/solr.cloud.MissingSegmentRecoveryTest_14C5CB33E4BE8943-001/tempDir-001/node1/MissingSegmentRecoveryTest_shard1_replica1], dataDir=[/x1/jenkins/jenkins-slave/workspace/Lucene-Solr-Tests-6.x/solr/build/solr-core/test/J0/temp/solr.cloud.MissingSegmentRecoveryTest_14C5CB33E4BE8943-001/tempDir-001/node1/./MissingSegmentRecoveryTest_shard1_replica1/data/]
   [junit4]   2> 257367 INFO  (qtp1588007903-1818) [n:127.0.0.1:42332_solr c:MissingSegmentRecoveryTest s:shard1  x:MissingSegmentRecoveryTest_shard1_replica2] o.a.s.u.UpdateHandler Using UpdateLog implementation: org.apache.solr.update.UpdateLog
   [junit4]   2> 257367 INFO  (qtp1588007903-1818) [n:127.0.0.1:42332_solr c:MissingSegmentRecoveryTest s:shard1  x:MissingSegmentRecoveryTest_shard1_replica2] o.a.s.u.UpdateLog Initializing UpdateLog: dataDir=null defaultSyncLevel=FLUSH numRecordsToKeep=100 maxNumLogsToKeep=10 numVersionBuckets=65536
   [junit4]   2> 257368 INFO  (qtp1588007903-1818) [n:127.0.0.1:42332_solr c:MissingSegmentRecoveryTest s:shard1  x:MissingSegmentRecoveryTest_shard1_replica2] o.a.s.u.CommitTracker Hard AutoCommit: disabled
   [junit4]   2> 257368 INFO  (qtp1588007903-1818) [n:127.0.0.1:42332_solr c:MissingSegmentRecoveryTest s:shard1  x:MissingSegmentRecoveryTest_shard1_replica2] o.a.s.u.CommitTracker Soft AutoCommit: disabled
   [junit4]   2> 257369 INFO  (qtp1588007903-1818) [n:127.0.0.1:42332_solr c:MissingSegmentRecoveryTest s:shard1  x:MissingSegmentRecoveryTest_shard1_replica2] o.a.s.s.SolrIndexSearcher Opening [Searcher@664394a7[MissingSegmentRecoveryTest_shard1_replica2] main]
   [junit4]   2> 257370 INFO  (qtp1588007903-1818) [n:127.0.0.1:42332_solr c:MissingSegmentRecoveryTest s:shard1  x:MissingSegmentRecoveryTest_shard1_replica2] o.a.s.r.ManagedResourceStorage Configured ZooKeeperStorageIO with znodeBase: /configs/conf
   [junit4]   2> 257370 INFO  (qtp1588007903-1818) [n:127.0.0.1:42332_solr c:MissingSegmentRecoveryTest s:shard1  x:MissingSegmentRecoveryTest_shard1_replica2] o.a.s.r.ManagedResourceStorage Loaded null at path _rest_managed.json using ZooKeeperStorageIO:path=/configs/conf
   [junit4]   2> 257370 INFO  (qtp1588007903-1818) [n:127.0.0.1:42332_solr c:MissingSegmentRecoveryTest s:shard1  x:MissingSegmentRecoveryTest_shard1_replica2] o.a.s.h.ReplicationHandler Commits will be reserved for  10000
   [junit4]   2> 257371 INFO  (searcherExecutor-691-thread-1-processing-n:127.0.0.1:42332_solr x:MissingSegmentRecoveryTest_shard1_replica2 s:shard1 c:MissingSegmentRecoveryTest) [n:127.0.0.1:42332_solr c:MissingSegmentRecoveryTest s:shard1  x:MissingSegmentRecoveryTest_shard1_replica2] o.a.s.c.SolrCore [MissingSegmentRecoveryTest_shard1_replica2] Registered new searcher Searcher@664394a7[MissingSegmentRecoveryTest_shard1_replica2] main{ExitableDirectoryReader(UninvertingDirectoryReader())}
   [junit4]   2> 257371 INFO  (qtp1588007903-1818) [n:127.0.0.1:42332_solr c:MissingSegmentRecoveryTest s:shard1  x:MissingSegmentRecoveryTest_shard1_replica2] o.a.s.u.UpdateLog Could not find max version in index or recent updates, using new clock 1561709780471382016
   [junit4]   2> 257377 INFO  (qtp1588007903-1818) [n:127.0.0.1:42332_solr c:MissingSegmentRecoveryTest s:shard1  x:MissingSegmentRecoveryTest_shard1_replica2] o.a.s.c.ShardLeaderElectionContext Waiting until we see more replicas up for shard shard1: total=2 found=1 timeoutin=9999ms
   [junit4]   2> 257396 INFO  (qtp753748761-1807) [n:127.0.0.1:42405_solr c:MissingSegmentRecoveryTest s:shard1  x:MissingSegmentRecoveryTest_shard1_replica1] o.a.s.u.UpdateHandler Using UpdateLog implementation: org.apache.solr.update.UpdateLog
   [junit4]   2> 257396 INFO  (qtp753748761-1807) [n:127.0.0.1:42405_solr c:MissingSegmentRecoveryTest s:shard1  x:MissingSegmentRecoveryTest_shard1_replica1] o.a.s.u.UpdateLog Initializing UpdateLog: dataDir=null defaultSyncLevel=FLUSH numRecordsToKeep=100 maxNumLogsToKeep=10 numVersionBuckets=65536
   [junit4]   2> 257397 INFO  (qtp753748761-1807) [n:127.0.0.1:42405_solr c:MissingSegmentRecoveryTest s:shard1  x:MissingSegmentRecoveryTest_shard1_replica1] o.a.s.u.CommitTracker Hard AutoCommit: disabled
   [junit4]   2> 257397 INFO  (qtp753748761-1807) [n:127.0.0.1:42405_solr c:MissingSegmentRecoveryTest s:shard1  x:MissingSegmentRecoveryTest_shard1_replica1] o.a.s.u.CommitTracker Soft AutoCommit: disabled
   [junit4]   2> 257400 INFO  (qtp753748761-1807) [n:127.0.0.1:42405_solr c:MissingSegmentRecoveryTest s:shard1  x:MissingSegmentRecoveryTest_shard1_replica1] o.a.s.s.SolrIndexSearcher Opening [Searcher@173bf9ba[MissingSegmentRecoveryTest_shard1_replica1] main]
   [junit4]   2> 257402 INFO  (qtp753748761-1807) [n:127.0.0.1:42405_solr c:MissingSegmentRecoveryTest s:shard1  x:MissingSegmentRecoveryTest_shard1_replica1] o.a.s.r.ManagedResourceStorage Configured ZooKeeperStorageIO with znodeBase: /configs/conf
   [junit4]   2> 257402 INFO  (qtp753748761-1807) [n:127.0.0.1:42405_solr c:MissingSegmentRecoveryTest s:shard1  x:MissingSegmentRecoveryTest_shard1_replica1] o.a.s.r.ManagedResourceStorage Loaded null at path _rest_managed.json using ZooKeeperStorageIO:path=/configs/conf
   [junit4]   2> 257402 INFO  (qtp753748761-1807) [n:127.0.0.1:42405_solr c:MissingSegmentRecoveryTest s:shard1  x:MissingSegmentRecoveryTest_shard1_replica1] o.a.s.h.ReplicationHandler Commits will be reserved for  10000
   [junit4]   2> 257403 INFO  (qtp753748761-1807) [n:127.0.0.1:42405_solr c:MissingSegmentRecoveryTest s:shard1  x:MissingSegmentRecoveryTest_shard1_replica1] o.a.s.u.UpdateLog Could not find max version in index or recent updates, using new clock 1561709780504936448
   [junit4]   2> 257403 INFO  (searcherExecutor-692-thread-1-processing-n:127.0.0.1:42405_solr x:MissingSegmentRecoveryTest_shard1_replica1 s:shard1 c:MissingSegmentRecoveryTest) [n:127.0.0.1:42405_solr c:MissingSegmentRecoveryTest s:shard1  x:MissingSegmentRecoveryTest_shard1_replica1] o.a.s.c.SolrCore [MissingSegmentRecoveryTest_shard1_replica1] Registered new searcher Searcher@173bf9ba[MissingSegmentRecoveryTest_shard1_replica1] main{ExitableDirectoryReader(UninvertingDirectoryReader())}
   [junit4]   2> 257479 INFO  (zkCallback-395-thread-2-processing-n:127.0.0.1:42332_solr) [n:127.0.0.1:42332_solr    ] o.a.s.c.c.ZkStateReader A cluster state change: [WatchedEvent state:SyncConnected type:NodeDataChanged path:/collections/MissingSegmentRecoveryTest/state.json] for collection [MissingSegmentRecoveryTest] has occurred - updating... (live nodes size: [2])
   [junit4]   2> 257480 INFO  (zkCallback-396-thread-1-processing-n:127.0.0.1:42405_solr) [n:127.0.0.1:42405_solr    ] o.a.s.c.c.ZkStateReader A cluster state change: [WatchedEvent state:SyncConnected type:NodeDataChanged path:/collections/MissingSegmentRecoveryTest/state.json] for collection [MissingSegmentRecoveryTest] has occurred - updating... (live nodes size: [2])
   [junit4]   2> 257877 INFO  (qtp1588007903-1818) [n:127.0.0.1:42332_solr c:MissingSegmentRecoveryTest s:shard1  x:MissingSegmentRecoveryTest_shard1_replica2] o.a.s.c.ShardLeaderElectionContext Enough replicas found to continue.
   [junit4]   2> 257877 INFO  (qtp1588007903-1818) [n:127.0.0.1:42332_solr c:MissingSegmentRecoveryTest s:shard1  x:MissingSegmentRecoveryTest_shard1_replica2] o.a.s.c.ShardLeaderElectionContext I may be the new leader - try and sync
   [junit4]   2> 257877 INFO  (qtp1588007903-1818) [n:127.0.0.1:42332_solr c:MissingSegmentRecoveryTest s:shard1  x:MissingSegmentRecoveryTest_shard1_replica2] o.a.s.c.SyncStrategy Sync replicas to https://127.0.0.1:42332/solr/MissingSegmentRecoveryTest_shard1_replica2/
   [junit4]   2> 257877 INFO  (qtp1588007903-1818) [n:127.0.0.1:42332_solr c:MissingSegmentRecoveryTest s:shard1  x:MissingSegmentRecoveryTest_shard1_replica2] o.a.s.u.PeerSync PeerSync: core=MissingSegmentRecoveryTest_shard1_replica2 url=https://127.0.0.1:42332/solr START replicas=[https://127.0.0.1:42405/solr/MissingSegmentRecoveryTest_shard1_replica1/] nUpdates=100
   [junit4]   2> 257878 INFO  (qtp1588007903-1818) [n:127.0.0.1:42332_solr c:MissingSegmentRecoveryTest s:shard1  x:MissingSegmentRecoveryTest_shard1_replica2] o.a.s.u.PeerSync PeerSync: core=MissingSegmentRecoveryTest_shard1_replica2 url=https://127.0.0.1:42332/solr DONE.  We have no versions.  sync failed.
   [junit4]   2> 257900 INFO  (qtp753748761-1806) [n:127.0.0.1:42405_solr c:MissingSegmentRecoveryTest s:shard1 r:core_node2 x:MissingSegmentRecoveryTest_shard1_replica1] o.a.s.c.S.Request [MissingSegmentRecoveryTest_shard1_replica1]  webapp=/solr path=/get params={distrib=false&qt=/get&fingerprint=false&getVersions=100&wt=javabin&version=2} status=0 QTime=0
   [junit4]   2> 257902 INFO  (qtp1588007903-1818) [n:127.0.0.1:42332_solr c:MissingSegmentRecoveryTest s:shard1  x:MissingSegmentRecoveryTest_shard1_replica2] o.a.s.c.SyncStrategy Leader's attempt to sync with shard failed, moving to the next candidate
   [junit4]   2> 257903 INFO  (qtp1588007903-1818) [n:127.0.0.1:42332_solr c:MissingSegmentRecoveryTest s:shard1  x:MissingSegmentRecoveryTest_shard1_replica2] o.a.s.c.ShardLeaderElectionContext We failed sync, but we have no versions - we can't sync in that case - we were active before, so become leader anyway
   [junit4]   2> 257903 INFO  (qtp1588007903-1818) [n:127.0.0.1:42332_solr c:MissingSegmentRecoveryTest s:shard1  x:MissingSegmentRecoveryTest_shard1_replica2] o.a.s.c.ShardLeaderElectionContext Found all replicas participating in election, clear LIR
   [junit4]   2> 257907 INFO  (qtp1588007903-1818) [n:127.0.0.1:42332_solr c:MissingSegmentRecoveryTest s:shard1  x:MissingSegmentRecoveryTest_shard1_replica2] o.a.s.c.ShardLeaderElectionContext I am the new leader: https://127.0.0.1:42332/solr/MissingSegmentRecoveryTest_shard1_replica2/ shard1
   [junit4]   2> 258010 INFO  (zkCallback-396-thread-1-processing-n:127.0.0.1:42405_solr) [n:127.0.0.1:42405_solr    ] o.a.s.c.c.ZkStateReader A cluster state change: [WatchedEvent state:SyncConnected type:NodeDataChanged path:/collections/MissingSegmentRecoveryTest/state.json] for collection [MissingSegmentRecoveryTest] has occurred - updating... (live nodes size: [2])
   [junit4]   2> 258011 INFO  (zkCallback-395-thread-3-processing-n:127.0.0.1:42332_solr) [n:127.0.0.1:42332_solr    ] o.a.s.c.c.ZkStateReader A cluster state change: [WatchedEvent state:SyncConnected type:NodeDataChanged path:/collections/MissingSegmentRecoveryTest/state.json] for collection [MissingSegmentRecoveryTest] has occurred - updating... (live nodes size: [2])
   [junit4]   2> 258058 INFO  (qtp1588007903-1818) [n:127.0.0.1:42332_solr c:MissingSegmentRecoveryTest s:shard1  x:MissingSegmentRecoveryTest_shard1_replica2] o.a.s.c.ZkController I am the leader, no recovery necessary
   [junit4]   2> 258060 INFO  (qtp1588007903-1818) [n:127.0.0.1:42332_solr c:MissingSegmentRecoveryTest s:shard1  x:MissingSegmentRecoveryTest_shard1_replica2] o.a.s.s.HttpSolrCall [admin] webapp=null path=/admin/cores params={qt=/admin/cores&collection.configName=conf&newCollection=true&name=MissingSegmentRecoveryTest_shard1_replica2&action=CREATE&numShards=1&collection=MissingSegmentRecoveryTest&shard=shard1&wt=javabin&version=2} status=0 QTime=1790
   [junit4]   2> 258172 INFO  (zkCallback-396-thread-1-processing-n:127.0.0.1:42405_solr) [n:127.0.0.1:42405_solr    ] o.a.s.c.c.ZkStateReader A cluster state change: [WatchedEvent state:SyncConnected type:NodeDataChanged path:/collections/MissingSegmentRecoveryTest/state.json] for collection [MissingSegmentRecoveryTest] has occurred - updating... (live nodes size: [2])
   [junit4]   2> 258172 INFO  (zkCallback-395-thread-2-processing-n:127.0.0.1:42332_solr) [n:127.0.0.1:42332_solr    ] o.a.s.c.c.ZkStateReader A cluster state change: [WatchedEvent state:SyncConnected type:NodeDataChanged path:/collections/MissingSegmentRecoveryTest/state.json] for collection [MissingSegmentRecoveryTest] has occurred - updating... (live nodes size: [2])
   [junit4]   2> 258411 INFO  (qtp753748761-1807) [n:127.0.0.1:42405_solr c:MissingSegmentRecoveryTest s:shard1  x:MissingSegmentRecoveryTest_shard1_replica1] o.a.s.s.HttpSolrCall [admin] webapp=null path=/admin/cores params={qt=/admin/cores&collection.configName=conf&newCollection=true&name=MissingSegmentRecoveryTest_shard1_replica1&action=CREATE&numShards=1&collection=MissingSegmentRecoveryTest&shard=shard1&wt=javabin&version=2} status=0 QTime=2086
   [junit4]   2> 258418 INFO  (qtp1588007903-1820) [n:127.0.0.1:42332_solr    ] o.a.s.h.a.CollectionsHandler Wait for new collection to be active for at most 30 seconds. Check all shard replicas
   [junit4]   2> 258517 INFO  (zkCallback-396-thread-1-processing-n:127.0.0.1:42405_solr) [n:127.0.0.1:42405_solr    ] o.a.s.c.c.ZkStateReader A cluster state change: [WatchedEvent state:SyncConnected type:NodeDataChanged path:/collections/MissingSegmentRecoveryTest/state.json] for collection [MissingSegmentRecoveryTest] has occurred - updating... (live nodes size: [2])
   [junit4]   2> 258517 INFO  (zkCallback-395-thread-4-processing-n:127.0.0.1:42332_solr) [n:127.0.0.1:42332_solr    ] o.a.s.c.c.ZkStateReader A cluster state change: [WatchedEvent state:SyncConnected type:NodeDataChanged path:/collections/MissingSegmentRecoveryTest/state.json] for collection [MissingSegmentRecoveryTest] has occurred - updating... (live nodes size: [2])
   [junit4]   2> 259418 INFO  (qtp1588007903-1820) [n:127.0.0.1:42332_solr    ] o.a.s.s.HttpSolrCall [admin] webapp=null path=/admin/collections params={replicationFactor=2&collection.configName=conf&maxShardsPerNode=1&name=MissingSegmentRecoveryTest&action=CREATE&numShards=1&wt=javabin&version=2} status=0 QTime=3293
   [junit4]   2> 259453 INFO  (qtp753748761-1802) [n:127.0.0.1:42405_solr c:MissingSegmentRecoveryTest s:shard1 r:core_node2 x:MissingSegmentRecoveryTest_shard1_replica1] o.a.s.u.p.LogUpdateProcessorFactory [MissingSegmentRecoveryTest_shard1_replica1]  webapp=/solr path=/update params={update.distrib=FROMLEADER&distrib.from=https://127.0.0.1:42332/solr/MissingSegmentRecoveryTest_shard1_replica2/&wt=javabin&version=2}{add=[0 (1561709782633545728), 1 (1561709782638788608), 2 (1561709782639837184), 3 (1561709782639837185), 4 (1561709782639837186), 5 (1561709782639837187), 6 (1561709782639837188), 7 (1561709782639837189), 8 (1561709782639837190), 9 (1561709782639837191)]} 0 3
   [junit4]   2> 259453 INFO  (qtp1588007903-1815) [n:127.0.0.1:42332_solr c:MissingSegmentRecoveryTest s:shard1 r:core_node1 x:MissingSegmentRecoveryTest_shard1_replica2] o.a.s.u.p.LogUpdateProcessorFactory [MissingSegmentRecoveryTest_shard1_replica2]  webapp=/solr path=/update params={wt=javabin&version=2}{add=[0 (1561709782633545728), 1 (1561709782638788608), 2 (1561709782639837184), 3 (1561709782639837185), 4 (1561709782639837186), 5 (1561709782639837187), 6 (1561709782639837188), 7 (1561709782639837189), 8 (1561709782639837190), 9 (1561709782639837191)]} 0 20
   [junit4]   2> 259467 INFO  (qtp753748761-1801) [n:127.0.0.1:42405_solr c:MissingSegmentRecoveryTest s:shard1 r:core_node2 x:MissingSegmentRecoveryTest_shard1_replica1] o.a.s.u.DirectUpdateHandler2 start commit{,optimize=false,openSearcher=true,waitSearcher=true,expungeDeletes=false,softCommit=false,prepareCommit=false}
   [junit4]   2> 259467 INFO  (qtp753748761-1801) [n:127.0.0.1:42405_solr c:MissingSegmentRecoveryTest s:shard1 r:core_node2 x:MissingSegmentRecoveryTest_shard1_replica1] o.a.s.u.SolrIndexWriter Calling setCommitData with IW:org.apache.solr.update.SolrIndexWriter@3a60adb0
   [junit4]   2> 259472 INFO  (qtp1588007903-1815) [n:127.0.0.1:42332_solr c:MissingSegmentRecoveryTest s:shard1 r:core_node1 x:MissingSegmentRecoveryTest_shard1_replica2] o.a.s.u.DirectUpdateHandler2 start commit{,optimize=false,openSearcher=true,waitSearcher=true,expungeDeletes=false,softCommit=false,prepareCommit=false}
   [junit4]   2> 259472 INFO  (qtp1588007903-1815) [n:127.0.0.1:42332_solr c:MissingSegmentRecoveryTest s:shard1 r:core_node1 x:MissingSegmentRecoveryTest_shard1_replica2] o.a.s.u.SolrIndexWriter Calling setCommitData with IW:org.apache.solr.update.SolrIndexWriter@17119bef
   [junit4]   2> 259520 INFO  (qtp1588007903-1815) [n:127.0.0.1:42332_solr c:MissingSegmentRecoveryTest s:shard1 r:core_node1 x:MissingSegmentRecoveryTest_shard1_replica2] o.a.s.s.SolrIndexSearcher Opening [Searcher@897f69c[MissingSegmentRecoveryTest_shard1_replica2] main]
   [junit4]   2> 259521 INFO  (searcherExecutor-691-thread-1-processing-n:127.0.0.1:42332_solr x:MissingSegmentRecoveryTest_shard1_replica2 s:shard1 c:MissingSegmentRecoveryTest r:core_node1) [n:127.0.0.1:42332_solr c:MissingSegmentRecoveryTest s:shard1 r:core_node1 x:MissingSegmentRecoveryTest_shard1_replica2] o.a.s.c.SolrCore [MissingSegmentRecoveryTest_shard1_replica2] Registered new searcher Searcher@897f69c[MissingSegmentRecoveryTest_shard1_replica2] main{ExitableDirectoryReader(UninvertingDirectoryReader(Uninverting(_0(6.5.0):C10)))}
   [junit4]   2> 259521 INFO  (qtp1588007903-1815) [n:127.0.0.1:42332_solr c:MissingSegmentRecoveryTest s:shard1 r:core_node1 x:MissingSegmentRecoveryTest_shard1_replica2] o.a.s.u.DirectUpdateHandler2 end_commit_flush
   [junit4]   2> 259521 INFO  (qtp1588007903-1815) [n:127.0.0.1:42332_solr c:MissingSegmentRecoveryTest s:shard1 r:core_node1 x:MissingSegmentRecoveryTest_shard1_replica2] o.a.s.u.p.LogUpdateProcessorFactory [MissingSegmentRecoveryTest_shard1_replica2]  webapp=/solr path=/update params={update.distrib=FROMLEADER&waitSearcher=true&openSearcher=true&commit=true&softCommit=false&distrib.from=https://127.0.0.1:42332/solr/MissingSegmentRecoveryTest_shard1_replica2/&commit_end_point=true&wt=javabin&version=2&expungeDeletes=false}{commit=} 0 49
   [junit4]   2> 259522 INFO  (qtp753748761-1801) [n:127.0.0.1:42405_solr c:MissingSegmentRecoveryTest s:shard1 r:core_node2 x:MissingSegmentRecoveryTest_shard1_replica1] o.a.s.s.SolrIndexSearcher Opening [Searcher@54255aa8[MissingSegmentRecoveryTest_shard1_replica1] main]
   [junit4]   2> 259522 INFO  (searcherExecutor-692-thread-1-processing-n:127.0.0.1:42405_solr x:MissingSegmentRecoveryTest_shard1_replica1 s:shard1 c:MissingSegmentRecoveryTest r:core_node2) [n:127.0.0.1:42405_solr c:MissingSegmentRecoveryTest s:shard1 r:core_node2 x:MissingSegmentRecoveryTest_shard1_replica1] o.a.s.c.SolrCore [MissingSegmentRecoveryTest_shard1_replica1] Registered new searcher Searcher@54255aa8[MissingSegmentRecoveryTest_shard1_replica1] main{ExitableDirectoryReader(UninvertingDirectoryReader(Uninverting(_0(6.5.0):C10)))}
   [junit4]   2> 259522 INFO  (qtp753748761-1801) [n:127.0.0.1:42405_solr c:MissingSegmentRecoveryTest s:shard1 r:core_node2 x:MissingSegmentRecoveryTest_shard1_replica1] o.a.s.u.DirectUpdateHandler2 end_commit_flush
   [junit4]   2> 259522 INFO  (qtp753748761-1801) [n:127.0.0.1:42405_solr c:MissingSegmentRecoveryTest s:shard1 r:core_node2 x:MissingSegmentRecoveryTest_shard1_replica1] o.a.s.u.p.LogUpdateProcessorFactory [MissingSegmentRecoveryTest_shard1_replica1]  webapp=/solr path=/update params={update.distrib=FROMLEADER&waitSearcher=true&openSearcher=true&commit=true&softCommit=false&distrib.from=https://127.0.0.1:42332/solr/MissingSegmentRecoveryTest_shard1_replica2/&commit_end_point=true&wt=javabin&version=2&expungeDeletes=false}{commit=} 0 55
   [junit4]   2> 259523 INFO  (qtp1588007903-1811) [n:127.0.0.1:42332_solr c:MissingSegmentRecoveryTest s:shard1 r:core_node1 x:MissingSegmentRecoveryTest_shard1_replica2] o.a.s.u.p.LogUpdateProcessorFactory [MissingSegmentRecoveryTest_shard1_replica2]  webapp=/solr path=/update params={_stateVer_=MissingSegmentRecoveryTest:5&waitSearcher=true&commit=true&softCommit=false&wt=javabin&version=2}{commit=} 0 62
   [junit4]   2> 259531 INFO  (TEST-MissingSegmentRecoveryTest.testLeaderRecovery-seed#[14C5CB33E4BE8943]) [    ] o.e.j.s.AbstractConnector Stopped ServerConnector@5caa5980{SSL,[ssl, http/1.1]}{127.0.0.1:0}
   [junit4]   2> 259531 INFO  (TEST-MissingSegmentRecoveryTest.testLeaderRecovery-seed#[14C5CB33E4BE8943]) [    ] o.a.s.c.CoreContainer Shutting down CoreContainer instance=916095656
   [junit4]   2> 259534 INFO  (coreCloseExecutor-701-thread-1) [n:127.0.0.1:42405_solr c:MissingSegmentRecoveryTest s:shard1 r:core_node2 x:MissingSegmentRecoveryTest_shard1_replica1] o.a.s.c.SolrCore [MissingSegmentRecoveryTest_shard1_replica1]  CLOSING SolrCore org.apache.solr.core.SolrCore@4dff2d0f
   [junit4]   2> 259538 INFO  (coreCloseExecutor-701-thread-1) [n:127.0.0.1:42405_solr c:MissingSegmentRecoveryTest s:shard1 r:core_node2 x:MissingSegmentRecoveryTest_shard1_replica1] o.a.s.m.SolrMetricManager Closing metric reporters for: solr.core.MissingSegmentRecoveryTest.shard1.replica1
   [junit4]   2> 259549 INFO  (zkCallback-395-thread-1-processing-n:127.0.0.1:42332_solr) [n:127.0.0.1:42332_solr    ] o.a.s.c.c.ZkStateReader Updated live nodes from ZooKeeper... (2) -> (1)
   [junit4]   2> 259549 INFO  (zkCallback-402-thread-1) [    ] o.a.s.c.c.ZkStateReader Updated live nodes from ZooKeeper... (2) -> (1)
   [junit4]   2> 259634 INFO  (zkCallback-395-thread-1-processing-n:127.0.0.1:42332_solr) [n:127.0.0.1:42332_solr    ] o.a.s.c.c.ZkStateReader A cluster state change: [WatchedEvent state:SyncConnected type:NodeDataChanged path:/collections/MissingSegmentRecoveryTest/state.json] for collection [MissingSegmentRecoveryTest] has occurred - updating... (live nodes size: [1])
   [junit4]   2> 260129 INFO  (OverseerCollectionConfigSetProcessor-97606861154418693-127.0.0.1:42332_solr-n_0000000000) [n:127.0.0.1:42332_solr    ] o.a.s.c.OverseerTaskQueue Response ZK path: /overseer/collection-queue-work/qnr-0000000000 doesn't exist.  Requestor may have disconnected from ZooKeeper
   [junit4]   2> 261047 WARN  (zkCallback-396-thread-1-processing-n:127.0.0.1:42405_solr) [n:127.0.0.1:42405_solr    ] o.a.s.c.c.ZkStateReader ZooKeeper watch triggered, but Solr cannot talk to ZK: [KeeperErrorCode = Session expired for /live_nodes]
   [junit4]   2> 261048 INFO  (TEST-MissingSegmentRecoveryTest.testLeaderRecovery-seed#[14C5CB33E4BE8943]) [    ] o.a.s.m.SolrMetricManager Closing metric reporters for: solr.node
   [junit4]   2> 261048 INFO  (TEST-MissingSegmentRecoveryTest.testLeaderRecovery-seed#[14C5CB33E4BE8943]) [    ] o.e.j.s.h.ContextHandler Stopped o.e.j.s.ServletContextHandler@4e4e246f{/solr,null,UNAVAILABLE}
   [junit4]   2> 261051 INFO  (TEST-MissingSegmentRecoveryTest.testLeaderRecovery-seed#[14C5CB33E4BE8943]) [    ] o.e.j.s.Server jetty-9.3.14.v20161028
   [junit4]   2> 261135 INFO  (TEST-MissingSegmentRecoveryTest.testLeaderRecovery-seed#[14C5CB33E4BE8943]) [    ] o.e.j.s.h.ContextHandler Started o.e.j.s.ServletContextHandler@51207529{/solr,null,AVAILABLE}
   [junit4]   2> 261136 INFO  (TEST-MissingSegmentRecoveryTest.testLeaderRecovery-seed#[14C5CB33E4BE8943]) [    ] o.e.j.s.AbstractConnector Started ServerConnector@78d8cad1{SSL,[ssl, http/1.1]}{127.0.0.1:42405}
   [junit4]   2> 261136 INFO  (TEST-MissingSegmentRecoveryTest.testLeaderRecovery-seed#[14C5CB33E4BE8943]) [    ] o.e.j.s.Server Started @264729ms
   [junit4]   2> 261136 INFO  (TEST-MissingSegmentRecoveryTest.testLeaderRecovery-seed#[14C5CB33E4BE8943]) [    ] o.a.s.c.s.e.JettySolrRunner Jetty properties: {hostContext=/solr, hostPort=42405}
   [junit4]   2> 261136 ERROR (TEST-MissingSegmentRecoveryTest.testLeaderRecovery-seed#[14C5CB33E4BE8943]) [    ] o.a.s.s.StartupLoggingUtils Missing Java Option solr.log.dir. Logging may be missing or incomplete.
   [junit4]   2> 261136 INFO  (TEST-MissingSegmentRecoveryTest.testLeaderRecovery-seed#[14C5CB33E4BE8943]) [    ] o.a.s.s.SolrDispatchFilter  ___      _       Welcome to Apache Solr™ version 6.5.0
   [junit4]   2> 261136 INFO  (TEST-MissingSegmentRecoveryTest.testLeaderRecovery-seed#[14C5CB33E4BE8943]) [    ] o.a.s.s.SolrDispatchFilter / __| ___| |_ _   Starting in cloud mode on port null
   [junit4]   2> 261136 INFO  (TEST-MissingSegmentRecoveryTest.testLeaderRecovery-seed#[14C5CB33E4BE8943]) [    ] o.a.s.s.SolrDispatchFilter \__ \/ _ \ | '_|  Install dir: null
   [junit4]   2> 261136 INFO  (TEST-MissingSegmentRecoveryTest.testLeaderRecovery-seed#[14C5CB33E4BE8943]) [    ] o.a.s.s.SolrDispatchFilter |___/\___/_|_|    Start time: 2017-03-12T23:48:31.081Z
   [junit4]   2> 261163 INFO  (TEST-MissingSegmentRecoveryTest.testLeaderRecovery-seed#[14C5CB33E4BE8943]) [    ] o.a.s.s.SolrDispatchFilter solr.xml found in ZooKeeper. Loading...
   [junit4]   2> 261172 INFO  (TEST-MissingSegmentRecoveryTest.testLeaderRecovery-seed#[14C5CB33E4BE8943]) [    ] o.a.s.u.UpdateShardHandler Creating UpdateShardHandler HTTP client with params: socketTimeout=340000&connTimeout=45000&retry=true
   [junit4]   2> 261173 INFO  (TEST-MissingSegmentRecoveryTest.testLeaderRecovery-seed#[14C5CB33E4BE8943]) [    ] o.a.s.c.ZkContainer Zookeeper client=127.0.0.1:43844/solr
   [junit4]   2> 261199 INFO  (TEST-MissingSegmentRecoveryTest.testLeaderRecovery-seed#[14C5CB33E4BE8943]) [n:127.0.0.1:42405_solr    ] o.a.s.c.c.ZkStateReader Updated live nodes from ZooKeeper... (0) -> (1)
   [junit4]   2> 261201 INFO  (TEST-MissingSegmentRecoveryTest.testLeaderRecovery-seed#[14C5CB33E4BE8943]) [n:127.0.0.1:42405_solr    ] o.a.s.c.Overseer Overseer (id=null) closing
   [junit4]   2> 261203 INFO  (TEST-MissingSegmentRecoveryTest.testLeaderRecovery-seed#[14C5CB33E4BE8943]) [n:127.0.0.1:42405_solr    ] o.a.s.c.ZkController Register node as live in ZooKeeper:/live_nodes/127.0.0.1:42405_solr
   [junit4]   2> 261204 INFO  (zkCallback-395-thread-2-processing-n:127.0.0.1:42332_solr) [n:127.0.0.1:42332_solr    ] o.a.s.c.c.ZkStateReader A cluster state change: [WatchedEvent state:SyncConnected type:NodeDataChanged path:/collections/MissingSegmentRecoveryTest/state.json] for collection [MissingSegmentRecoveryTest] has occurred - updating... (live nodes size: [1])
   [junit4]   2> 261205 INFO  (zkCallback-395-thread-1-processing-n:127.0.0.1:42332_solr) [n:127.0.0.1:42332_solr    ] o.a.s.c.c.ZkStateReader Updated live nodes from ZooKeeper... (1) -> (2)
   [junit4]   2> 261205 INFO  (zkCallback-402-thread-1) [    ] o.a.s.c.c.ZkStateReader Updated live nodes from ZooKeeper... (1) -> (2)
   [junit4]   2> 261241 INFO  (zkCallback-407-thread-1-processing-n:127.0.0.1:42405_solr) [n:127.0.0.1:42405_solr    ] o.a.s.c.c.ZkStateReader Updated live nodes from ZooKeeper... (1) -> (2)
   [junit4]   2> 261272 INFO  (TEST-MissingSegmentRecoveryTest.testLeaderRecovery-seed#[14C5CB33E4BE8943]) [n:127.0.0.1:42405_solr    ] o.a.s.c.CorePropertiesLocator Found 1 core definitions underneath /x1/jenkins/jenkins-slave/workspace/Lucene-Solr-Tests-6.x/solr/build/solr-core/test/J0/temp/solr.cloud.MissingSegmentRecoveryTest_14C5CB33E4BE8943-001/tempDir-001/node1/.
   [junit4]   2> 261272 INFO  (TEST-MissingSegmentRecoveryTest.testLeaderRecovery-seed#[14C5CB33E4BE8943]) [n:127.0.0.1:42405_solr    ] o.a.s.c.CorePropertiesLocator Cores are: [MissingSegmentRecoveryTest_shard1_replica1]
   [junit4]   2> 261303 INFO  (coreLoadExecutor-708-thread-1-processing-n:127.0.0.1:42405_solr) [n:127.0.0.1:42405_solr c:MissingSegmentRecoveryTest s:shard1 r:core_node2 x:MissingSegmentRecoveryTest_shard1_replica1] o.a.s.c.SolrConfig Using Lucene MatchVersion: 6.5.0
   [junit4]   2> 261316 INFO  (coreLoadExecutor-708-thread-1-processing-n:127.0.0.1:42405_solr) [n:127.0.0.1:42405_solr c:MissingSegmentRecoveryTest s:shard1 r:core_node2 x:MissingSegmentRecoveryTest_shard1_replica1] o.a.s.s.IndexSchema [MissingSegmentRecoveryTest_shard1_replica1] Schema name=minimal
   [junit4]   2> 261318 INFO  (coreLoadExecutor-708-thread-1-processing-n:127.0.0.1:42405_solr) [n:127.0.0.1:42405_solr c:MissingSegmentRecoveryTest s:shard1 r:core_node2 x:MissingSegmentRecoveryTest_shard1_replica1] o.a.s.s.IndexSchema Loaded schema minimal/1.1 with uniqueid field id
   [junit4]   2> 261318 INFO  (coreLoadExecutor-708-thread-1-processing-n:127.0.0.1:42405_solr) [n:127.0.0.1:42405_solr c:MissingSegmentRecoveryTest s:shard1 r:core_node2 x:MissingSegmentRecoveryTest_shard1_replica1] o.a.s.c.CoreContainer Creating SolrCore 'MissingSegmentRecoveryTest_shard1_replica1' using configuration from collection MissingSegmentRecoveryTest
   [junit4]   2> 261319 INFO  (coreLoadExecutor-708-thread-1-processing-n:127.0.0.1:42405_solr) [n:127.0.0.1:42405_solr c:MissingSegmentRecoveryTest s:shard1 r:core_node2 x:MissingSegmentRecoveryTest_shard1_replica1] o.a.s.c.SolrCore [[MissingSegmentRecoveryTest_shard1_replica1] ] Opening new SolrCore at [/x1/jenkins/jenkins-slave/workspace/Lucene-Solr-Tests-6.x/solr/build/solr-core/test/J0/temp/solr.cloud.MissingSegmentRecoveryTest_14C5CB33E4BE8943-001/tempDir-001/node1/MissingSegmentRecoveryTest_shard1_replica1], dataDir=[/x1/jenkins/jenkins-slave/workspace/Lucene-Solr-Tests-6.x/solr/build/solr-core/test/J0/temp/solr.cloud.MissingSegmentRecoveryTest_14C5CB33E4BE8943-001/tempDir-001/node1/./MissingSegmentRecoveryTest_shard1_replica1/data/]
   [junit4]   2> 261383 INFO  (zkCallback-407-thread-1-processing-n:127.0.0.1:42405_solr) [n:127.0.0.1:42405_solr    ] o.a.s.c.c.ZkStateReader A cluster state change: [WatchedEvent state:SyncConnected type:NodeDataChanged path:/collections/MissingSegmentRecoveryTest/state.json] for collection [MissingSegmentRecoveryTest] has occurred - updating... (live nodes size: [2])
   [junit4]   2> 261384 INFO  (zkCallback-395-thread-1-processing-n:127.0.0.1:42332_solr) [n:127.0.0.1:42332_solr    ] o.a.s.c.c.ZkStateReader A cluster state change: [WatchedEvent state:SyncConnected type:NodeDataChanged path:/collections/MissingSegmentRecoveryTest/state.json] for collection [MissingSegmentRecoveryTest] has occurred - updating... (live nodes size: [2])
   [junit4]   2> 261397 INFO  (coreLoadExecutor-708-thread-1-processing-n:127.0.0.1:42405_solr) [n:127.0.0.1:42405_solr c:MissingSegmentRecoveryTest s:shard1 r:core_node2 x:MissingSegmentRecoveryTest_shard1_replica1] o.a.s.u.UpdateHandler Using UpdateLog implementation: org.apache.solr.update.UpdateLog
   [junit4]   2> 261397 INFO  (coreLoadExecutor-708-thread-1-processing-n:127.0.0.1:42405_solr) [n:127.0.0.1:42405_solr c:MissingSegmentRecoveryTest s:shard1 r:core_node2 x:MissingSegmentRecoveryTest_shard1_replica1] o.a.s.u.UpdateLog Initializing UpdateLog: dataDir=null defaultSyncLevel=FLUSH numRecordsToKeep=100 maxNumLogsToKeep=10 numVersionBuckets=65536
   [junit4]   2> 261398 INFO  (coreLoadExecutor-708-thread-1-processing-n:127.0.0.1:42405_solr) [n:127.0.0.1:42405_solr c:MissingSegmentRecoveryTest s:shard1 r:core_node2 x:MissingSegmentRecoveryTest_shard1_replica1] o.a.s.u.CommitTracker Hard AutoCommit: disabled
   [junit4]   2> 261398 INFO  (coreLoadExecutor-708-thread-1-processing-n:127.0.0.1:42405_solr) [n:127.0.0.1:42405_solr c:MissingSegmentRecoveryTest s:shard1 r:core_node2 x:MissingSegmentRecoveryTest_shard1_replica1] o.a.s.u.CommitTracker Soft AutoCommit: disabled
   [junit4]   2> 261400 INFO  (coreLoadExecutor-708-thread-1-processing-n:127.0.0.1:42405_solr) [n:127.0.0.1:42405_solr c:MissingSegmentRecoveryTest s:shard1 r:core_node2 x:MissingSegmentRecoveryTest_shard1_replica1] o.a.s.c.SolrCore [MissingSegmentRecoveryTest_shard1_replica1]  CLOSING SolrCore org.apache.solr.core.SolrCore@49a7b14a
   [junit4]   2> 261405 INFO  (coreLoadExecutor-708-thread-1-processing-n:127.0.0.1:42405_solr) [n:127.0.0.1:42405_solr c:MissingSegmentRecoveryTest s:shard1 r:core_node2 x:MissingSegmentRecoveryTest_shard1_replica1] o.a.s.m.SolrMetricManager Closing metric reporters for: solr.core.MissingSegmentRecoveryTest.shard1.replica1
   [junit4]   2> 261406 INFO  (coreLoadExecutor-708-thread-1-processing-n:127.0.0.1:42405_solr) [n:127.0.0.1:42405_solr c:MissingSegmentRecoveryTest s:shard1 r:core_node2 x:MissingSegmentRecoveryTest_shard1_replica1] o.a.s.c.CoreContainer Found active leader, will attempt to create fresh core and recover.
   [junit4]   2> 261407 INFO  (coreLoadExecutor-708-thread-1-processing-n:127.0.0.1:42405_solr) [n:127.0.0.1:42405_solr c:MissingSegmentRecoveryTest s:shard1 r:core_node2 x:MissingSegmentRecoveryTest_shard1_replica1] o.a.s.c.SolrCore Updating index properties... index=index.20170313014831352
   [junit4]   2> 261410 INFO  (coreLoadExecutor-708-thread-1-processing-n:127.0.0.1:42405_solr) [n:127.0.0.1:42405_solr c:MissingSegmentRecoveryTest s:shard1 r:core_node2 x:MissingSegmentRecoveryTest_shard1_replica1] o.a.s.c.SolrCore [[MissingSegmentRecoveryTest_shard1_replica1] ] Opening new SolrCore at [/x1/jenkins/jenkins-slave/workspace/Lucene-Solr-Tests-6.x/solr/build/solr-core/test/J0/temp/solr.cloud.MissingSegmentRecoveryTest_14C5CB33E4BE8943-001/tempDir-001/node1/MissingSegmentRecoveryTest_shard1_replica1], dataDir=[/x1/jenkins/jenkins-slave/workspace/Lucene-Solr-Tests-6.x/solr/build/solr-core/test/J0/temp/solr.cloud.MissingSegmentRecoveryTest_14C5CB33E4BE8943-001/tempDir-001/node1/./MissingSegmentRecoveryTest_shard1_replica1/data/]
   [junit4]   2> 261420 INFO  (OldIndexDirectoryCleanupThreadForCore-MissingSegmentRecoveryTest_shard1_replica1) [n:127.0.0.1:42405_solr c:MissingSegmentRecoveryTest s:shard1 r:core_node2 x:MissingSegmentRecoveryTest_shard1_replica1] o.a.s.c.DirectoryFactory Found 1 old index directories to clean-up under /x1/jenkins/jenkins-slave/workspace/Lucene-Solr-Tests-6.x/solr/build/solr-core/test/J0/temp/solr.cloud.MissingSegmentRecoveryTest_14C5CB33E4BE8943-001/tempDir-001/node1/./MissingSegmentRecoveryTest_shard1_replica1/data/ afterReload=false
   [junit4]   2> 261421 INFO  (OldIndexDirectoryCleanupThreadForCore-MissingSegmentRecoveryTest_shard1_replica1) [n:127.0.0.1:42405_solr c:MissingSegmentRecoveryTest s:shard1 r:core_node2 x:MissingSegmentRecoveryTest_shard1_replica1] o.a.s.c.DirectoryFactory Deleted old index directory: /x1/jenkins/jenkins-slave/workspace/Lucene-Solr-Tests-6.x/solr/build/solr-core/test/J0/temp/solr.cloud.MissingSegmentRecoveryTest_14C5CB33E4BE8943-001/tempDir-001/node1/./MissingSegmentRecoveryTest_shard1_replica1/data/index.20170313014831352
   [junit4]   2> 261451 INFO  (OldIndexDirectoryCleanupThreadForCore-MissingSegmentRecoveryTest_shard1_replica1) [n:127.0.0.1:42405_solr c:MissingSegmentRecoveryTest s:shard1 r:core_node2 x:MissingSegmentRecoveryTest_shard1_replica1] o.a.s.c.DirectoryFactory Found 1 old index directories to clean-up under /x1/jenkins/jenkins-slave/workspace/Lucene-Solr-Tests-6.x/solr/build/solr-core/test/J0/temp/solr.cloud.MissingSegmentRecoveryTest_14C5CB33E4BE8943-001/tempDir-001/node1/./MissingSegmentRecoveryTest_shard1_replica1/data/ afterReload=false
   [junit4]   2> 261462 INFO  (OldIndexDirectoryCleanupThreadForCore-MissingSegmentRecoveryTest_shard1_replica1) [n:127.0.0.1:42405_solr c:MissingSegmentRecoveryTest s:shard1 r:core_node2 x:MissingSegmentRecoveryTest_shard1_replica1] o.a.s.c.DirectoryFactory Deleted old index directory: /x1/jenkins/jenkins-slave/workspace/Lucene-Solr-Tests-6.x/solr/build/solr-core/test/J0/temp/solr.cloud.MissingSegmentRecoveryTest_14C5CB33E4BE8943-001/tempDir-001/node1/./MissingSegmentRecoveryTest_shard1_replica1/data/index
   [junit4]   2> 261490 INFO  (coreLoadExecutor-708-thread-1-processing-n:127.0.0.1:42405_solr) [n:127.0.0.1:42405_solr c:MissingSegmentRecoveryTest s:shard1 r:core_node2 x:MissingSegmentRecoveryTest_shard1_replica1] o.a.s.u.UpdateHandler Using UpdateLog implementation: org.apache.solr.update.UpdateLog
   [junit4]   2> 261490 INFO  (coreLoadExecutor-708-thread-1-processing-n:127.0.0.1:42405_solr) [n:127.0.0.1:42405_solr c:MissingSegmentRecoveryTest s:shard1 r:core_node2 x:MissingSegmentRecoveryTest_shard1_replica1] o.a.s.u.UpdateLog Initializing UpdateLog: dataDir=null defaultSyncLevel=FLUSH numRecordsToKeep=100 maxNumLogsToKeep=10 numVersionBuckets=65536
   [junit4]   2> 261491 INFO  (coreLoadExecutor-708-thread-1-processing-n:127.0.0.1:42405_solr) [n:127.0.0.1:42405_solr c:MissingSegmentRecoveryTest s:shard1 r:core_node2 x:MissingSegmentRecoveryTest_shard1_replica1] o.a.s.u.CommitTracker Hard AutoCommit: disabled
   [junit4]   2> 261491 INFO  (coreLoadExecutor-708-thread-1-processing-n:127.0.0.1:42405_solr) [n:127.0.0.1:42405_solr c:MissingSegmentRecoveryTest s:shard1 r:core_node2 x:MissingSegmentRecoveryTest_shard1_replica1] o.a.s.u.CommitTracker Soft AutoCommit: disabled
   [junit4]   2> 261493 INFO  (coreLoadExecutor-708-thread-1-processing-n:127.0.0.1:42405_solr) [n:127.0.0.1:42405_solr c:MissingSegmentRecoveryTest s:shard1 r:core_node2 x:MissingSegmentRecoveryTest_shard1_replica1] o.a.s.c.SolrCore [MissingSegmentRecoveryTest_shard1_replica1]  CLOSING SolrCore org.apache.solr.core.SolrCore@311a0fa8
   [junit4]   2> 261493 INFO  (coreLoadExecutor-708-thread-1-processing-n:127.0.0.1:42405_solr) [n:127.0.0.1:42405_solr c:MissingSegmentRecoveryTest s:shard1 r:core_node2 x:MissingSegmentRecoveryTest_shard1_replica1] o.a.s.m.SolrMetricManager Closing metric reporters for: solr.core.MissingSegmentRecoveryTest.shard1.replica1
   [junit4]   2> 261494 ERROR (coreContainerWorkExecutor-704-thread-1-processing-n:127.0.0.1:42405_solr) [n:127.0.0.1:42405_solr    ] o.a.s.c.CoreContainer Error waiting for SolrCore to be created
   [junit4]   2> java.util.concurrent.ExecutionException: org.apache.solr.common.SolrException: Unable to create core [MissingSegmentRecoveryTest_shard1_replica1]
   [junit4]   2> 	at java.util.concurrent.FutureTask.report(FutureTask.java:122)
   [junit4]   2> 	at java.util.concurrent.FutureTask.get(FutureTask.java:192)
   [junit4]   2> 	at org.apache.solr.core.CoreContainer.lambda$load$4(CoreContainer.java:580)
   [junit4]   2> 	at com.codahale.metrics.InstrumentedExecutorService$InstrumentedRunnable.run(InstrumentedExecutorService.java:176)
   [junit4]   2> 	at java.util.concurrent.Executors$RunnableAdapter.call(Executors.java:511)
   [junit4]   2> 	at java.util.concurrent.FutureTask.run(FutureTask.java:266)
   [junit4]   2> 	at org.apache.solr.common.util.ExecutorUtil$MDCAwareThreadPoolExecutor.lambda$execute$0(ExecutorUtil.java:229)
   [junit4]   2> 	at java.util.concurrent.ThreadPoolExecutor.runWorker(ThreadPoolExecutor.java:1142)
   [junit4]   2> 	at java.util.concurrent.ThreadPoolExecutor$Worker.run(ThreadPoolExecutor.java:617)
   [junit4]   2> 	at java.lang.Thread.run(Thread.java:745)
   [junit4]   2> Caused by: org.apache.solr.common.SolrException: Unable to create core [MissingSegmentRecoveryTest_shard1_replica1]
   [junit4]   2> 	at org.apache.solr.core.CoreContainer.create(CoreContainer.java:932)
   [junit4]   2> 	at org.apache.solr.core.CoreContainer.lambda$load$3(CoreContainer.java:552)
   [junit4]   2> 	at com.codahale.metrics.InstrumentedExecutorService$InstrumentedCallable.call(InstrumentedExecutorService.java:197)
   [junit4]   2> 	... 5 more
   [junit4]   2> Caused by: org.apache.solr.common.SolrException: Error opening new searcher
   [junit4]   2> 	at org.apache.solr.core.SolrCore.<init>(SolrCore.java:947)
   [junit4]   2> 	at org.apache.solr.core.SolrCore.<init>(SolrCore.java:811)
   [junit4]   2> 	at org.apache.solr.core.CoreContainer.processCoreCreateException(CoreContainer.java:991)
   [junit4]   2> 	at org.apache.solr.core.CoreContainer.create(CoreContainer.java:919)
   [junit4]   2> 	... 7 more
   [junit4]   2> 	Suppressed: org.apache.solr.common.SolrException: Error opening new searcher
   [junit4]   2> 		at org.apache.solr.core.SolrCore.<init>(SolrCore.java:947)
   [junit4]   2> 		at org.apache.solr.core.SolrCore.<init>(SolrCore.java:811)
   [junit4]   2> 		at org.apache.solr.core.CoreContainer.create(CoreContainer.java:917)
   [junit4]   2> 		... 7 more
   [junit4]   2> 	Caused by: org.apache.solr.common.SolrException: Error opening new searcher
   [junit4]   2> 		at org.apache.solr.core.SolrCore.openNewSearcher(SolrCore.java:1991)
   [junit4]   2> 		at org.apache.solr.core.SolrCore.getSearcher(SolrCore.java:2111)
   [junit4]   2> 		at org.apache.solr.core.SolrCore.initSearcher(SolrCore.java:1036)
   [junit4]   2> 		at org.apache.solr.core.SolrCore.<init>(SolrCore.java:920)
   [junit4]   2> 		... 9 more
   [junit4]   2> 	Caused by: org.apache.lucene.index.CorruptIndexException: Unexpected file read error while reading index. (resource=BufferedChecksumIndexInput(MMapIndexInput(path="/x1/jenkins/jenkins-slave/workspace/Lucene-Solr-Tests-6.x/solr/build/solr-core/test/J0/temp/solr.cloud.MissingSegmentRecoveryTest_14C5CB33E4BE8943-001/tempDir-001/node1/MissingSegmentRecoveryTest_shard1_replica1/data/index/segments_2")))
   [junit4]   2> 		at org.apache.lucene.index.SegmentInfos.readCommit(SegmentInfos.java:290)
   [junit4]   2> 		at org.apache.lucene.index.IndexWriter.<init>(IndexWriter.java:928)
   [junit4]   2> 		at org.apache.solr.update.SolrIndexWriter.<init>(SolrIndexWriter.java:125)
   [junit4]   2> 		at org.apache.solr.update.SolrIndexWriter.create(SolrIndexWriter.java:100)
   [junit4]   2> 		at org.apache.solr.update.DefaultSolrCoreState.createMainIndexWriter(DefaultSolrCoreState.java:240)
   [junit4]   2> 		at org.apache.solr.update.DefaultSolrCoreState.getIndexWriter(DefaultSolrCoreState.java:114)
   [junit4]   2> 		at org.apache.solr.core.SolrCore.openNewSearcher(SolrCore.java:1952)
   [junit4]   2> 		... 12 more
   [junit4]   2> 	Caused by: java.io.EOFException: read past EOF: MMapIndexInput(path="/x1/jenkins/jenkins-slave/workspace/Lucene-Solr-Tests-6.x/solr/build/solr-core/test/J0/temp/solr.cloud.MissingSegmentRecoveryTest_14C5CB33E4BE8943-001/tempDir-001/node1/MissingSegmentRecoveryTest_shard1_replica1/data/index/segments_2")
   [junit4]   2> 		at org.apache.lucene.store.ByteBufferIndexInput.readByte(ByteBufferIndexInput.java:75)
   [junit4]   2> 		at org.apache.lucene.store.BufferedChecksumIndexInput.readByte(BufferedChecksumIndexInput.java:41)
   [junit4]   2> 		at org.apache.lucene.store.DataInput.readInt(DataInput.java:101)
   [junit4]   2> 		at org.apache.lucene.index.SegmentInfos.readCommit(SegmentInfos.java:300)
   [junit4]   2> 		at org.apache.lucene.index.SegmentInfos.readCommit(SegmentInfos.java:288)
   [junit4]   2> 		... 18 more
   [junit4]   2> Caused by: org.apache.solr.common.SolrException: Error opening new searcher
   [junit4]   2> 	at org.apache.solr.core.SolrCore.openNewSearcher(SolrCore.java:1991)
   [junit4]   2> 	at org.apache.solr.core.SolrCore.getSearcher(SolrCore.java:2111)
   [junit4]   2> 	at org.apache.solr.core.SolrCore.initSearcher(SolrCore.java:1036)
   [junit4]   2> 	at org.apache.solr.core.SolrCore.<init>(SolrCore.java:920)
   [junit4]   2> 	... 10 more
   [junit4]   2> Caused by: org.apache.lucene.index.IndexNotFoundException: no segments* file found in LockValidatingDirectoryWrapper(MMapDirectory@/x1/jenkins/jenkins-slave/workspace/Lucene-Solr-Tests-6.x/solr/build/solr-core/test/J0/temp/solr.cloud.MissingSegmentRecoveryTest_14C5CB33E4BE8943-001/tempDir-001/node1/MissingSegmentRecoveryTest_shard1_replica1/data/index.20170313014831352 lockFactory=org.apache.lucene.store.NativeFSLockFactory@27ba38f8): files: [write.lock]
   [junit4]   2> 	at org.apache.lucene.index.IndexWriter.<init>(IndexWriter.java:923)
   [junit4]   2> 	at org.apache.solr.update.SolrIndexWriter.<init>(SolrIndexWriter.java:125)
   [junit4]   2> 	at org.apache.solr.update.SolrIndexWriter.create(SolrIndexWriter.java:100)
   [junit4]   2> 	at org.apache.solr.update.DefaultSolrCoreState.createMainIndexWriter(DefaultSolrCoreState.java:240)
   [junit4]   2> 	at org.apache.solr.update.DefaultSolrCoreState.getIndexWriter(DefaultSolrCoreState.java:114)
   [junit4]   2> 	at org.apache.solr.core.SolrCore.openNewSearcher(SolrCore.java:1952)
   [junit4]   2> 	... 13 more
   [junit4]   2> 351839 INFO  (qtp1588007903-1818) [n:127.0.0.1:42332_solr    ] o.a.s.h.a.CollectionsHandler Invoked Collection Action :delete with params name=MissingSegmentRecoveryTest&action=DELETE&wt=javabin&version=2 and sendToOCPQueue=true
   [junit4]   2> 351852 INFO  (OverseerThreadFactory-686-thread-2-processing-n:127.0.0.1:42332_solr) [n:127.0.0.1:42332_solr    ] o.a.s.c.OverseerCollectionMessageHandler Executing Collection Cmd : action=UNLOAD&deleteInstanceDir=true&deleteDataDir=true
   [junit4]   2> 351872 INFO  (qtp1588007903-1819) [n:127.0.0.1:42332_solr    ] o.a.s.m.SolrMetricManager Closing metric reporters for: solr.core.MissingSegmentRecoveryTest.shard1.replica2
   [junit4]   2> 351872 INFO  (qtp1588007903-1819) [n:127.0.0.1:42332_solr    ] o.a.s.c.SolrCore [MissingSegmentRecoveryTest_shard1_replica2]  CLOSING SolrCore org.apache.solr.core.SolrCore@3a77cc6c
   [junit4]   2> 351892 INFO  (qtp1588007903-1819) [n:127.0.0.1:42332_solr    ] o.a.s.m.SolrMetricManager Closing metric reporters for: solr.core.MissingSegmentRecoveryTest.shard1.replica2
   [junit4]   2> 351903 INFO  (qtp1588007903-1819) [n:127.0.0.1:42332_solr    ] o.a.s.s.HttpSolrCall [admin] webapp=null path=/admin/cores params={deleteInstanceDir=true&core=MissingSegmentRecoveryTest_shard1_replica2&qt=/admin/cores&deleteDataDir=true&action=UNLOAD&wt=javabin&version=2} status=0 QTime=31
   [junit4]   2> 351906 INFO  (zkCallback-407-thread-2-processing-n:127.0.0.1:42405_solr) [n:127.0.0.1:42405_solr    ] o.a.s.c.c.ZkStateReader A cluster state change: [WatchedEvent state:SyncConnected type:NodeDataChanged path:/collections/MissingSegmentRecoveryTest/state.json] for collection [MissingSegmentRecoveryTest] has occurred - updating... (live nodes size: [2])
   [junit4]   2> 351929 INFO  (qtp869140915-1883) [n:127.0.0.1:42405_solr    ] o.a.s.s.HttpSolrCall [admin] webapp=null path=/admin/cores params={deleteInstanceDir=true&core=MissingSegmentRecoveryTest_shard1_replica1&qt=/admin/cores&deleteDataDir=true&action=UNLOAD&wt=javabin&version=2} status=0 QTime=2
   [junit4]   2> 352034 INFO  (zkCallback-407-thread-2-processing-n:127.0.0.1:42405_solr) [n:127.0.0.1:42405_solr    ] o.a.s.c.c.ZkStateReader A cluster state change: [WatchedEvent state:SyncConnected type:NodeDeleted path:/collections/MissingSegmentRecoveryTest/state.json] for collection [MissingSegmentRecoveryTest] has occurred - updating... (live nodes size: [2])
   [junit4]   2> 352635 INFO  (qtp1588007903-1818) [n:127.0.0.1:42332_solr    ] o.a.s.s.HttpSolrCall [admin] webapp=null path=/admin/collections params={name=MissingSegmentRecoveryTest&action=DELETE&wt=javabin&version=2} status=0 QTime=795
   [junit4]   2> 352636 INFO  (TEST-MissingSegmentRecoveryTest.testLeaderRecovery-seed#[14C5CB33E4BE8943]) [    ] o.a.s.SolrTestCaseJ4 ###Ending testLeaderRecovery
   [junit4]   2> NOTE: reproduce with: ant test  -Dtestcase=MissingSegmentRecoveryTest -Dtests.method=testLeaderRecovery -Dtests.seed=14C5CB33E4BE8943 -Dtests.multiplier=2 -Dtests.slow=true -Dtests.locale=en-CA -Dtests.timezone=CAT -Dtests.asserts=true -Dtests.file.encoding=UTF-8
   [junit4] FAILURE 96.7s J0 | MissingSegmentRecoveryTest.testLeaderRecovery <<<
   [junit4]    > Throwable #1: java.lang.AssertionError: Expected a collection with one shard and two replicas
   [junit4]    > null
   [junit4]    > Last available state: DocCollection(MissingSegmentRecoveryTest//collections/MissingSegmentRecoveryTest/state.json/8)={
   [junit4]    >   "replicationFactor":"2",
   [junit4]    >   "shards":{"shard1":{
   [junit4]    >       "range":"80000000-7fffffff",
   [junit4]    >       "state":"active",
   [junit4]    >       "replicas":{
   [junit4]    >         "core_node1":{
   [junit4]    >           "core":"MissingSegmentRecoveryTest_shard1_replica2",
   [junit4]    >           "base_url":"https://127.0.0.1:42332/solr",
   [junit4]    >           "node_name":"127.0.0.1:42332_solr",
   [junit4]    >           "state":"active",
   [junit4]    >           "leader":"true"},
   [junit4]    >         "core_node2":{
   [junit4]    >           "core":"MissingSegmentRecoveryTest_shard1_replica1",
   [junit4]    >           "base_url":"https://127.0.0.1:42405/solr",
   [junit4]    >           "node_name":"127.0.0.1:42405_solr",
   [junit4]    >           "state":"down"}}}},
   [junit4]    >   "router":{"name":"compositeId"},
   [junit4]    >   "maxShardsPerNode":"1",
   [junit4]    >   "autoAddReplicas":"false"}
   [junit4]    > 	at __randomizedtesting.SeedInfo.seed([14C5CB33E4BE8943:44905330BD9F3F5E]:0)
   [junit4]    > 	at org.apache.solr.cloud.SolrCloudTestCase.waitForState(SolrCloudTestCase.java:265)
   [junit4]    > 	at org.apache.solr.cloud.MissingSegmentRecoveryTest.testLeaderRecovery(MissingSegmentRecoveryTest.java:105)
   [junit4]    > 	at java.lang.Thread.run(Thread.java:745)
   [junit4]   2> 352641 INFO  (jetty-closer-385-thread-2) [    ] o.e.j.s.AbstractConnector Stopped ServerConnector@78d8cad1{SSL,[ssl, http/1.1]}{127.0.0.1:42405}
   [junit4]   2> 352641 INFO  (jetty-closer-385-thread-2) [    ] o.a.s.c.CoreContainer Shutting down CoreContainer instance=1784054072
   [junit4]   2> 352642 INFO  (jetty-closer-385-thread-1) [    ] o.e.j.s.AbstractConnector Stopped ServerConnector@1e044d43{SSL,[ssl, http/1.1]}{127.0.0.1:0}
   [junit4]   2> 352643 INFO  (jetty-closer-385-thread-1) [    ] o.a.s.c.CoreContainer Shutting down CoreContainer instance=608751549
   [junit4]   2> 352645 INFO  (jetty-closer-385-thread-1) [    ] o.a.s.c.Overseer Overseer (id=97606861154418693-127.0.0.1:42332_solr-n_0000000000) closing
   [junit4]   2> 352646 INFO  (OverseerStateUpdate-97606861154418693-127.0.0.1:42332_solr-n_0000000000) [n:127.0.0.1:42332_solr    ] o.a.s.c.Overseer Overseer Loop exiting : 127.0.0.1:42332_solr
   [junit4]   2> 354147 WARN  (zkCallback-395-thread-18-processing-n:127.0.0.1:42332_solr) [n:127.0.0.1:42332_solr    ] o.a.s.c.c.ZkStateReader ZooKeeper watch triggered, but Solr cannot talk to ZK: [KeeperErrorCode = Session expired for /live_nodes]
   [junit4]   2> 354147 WARN  (zkCallback-407-thread-3-processing-n:127.0.0.1:42405_solr) [n:127.0.0.1:42405_solr    ] o.a.s.c.c.ZkStateReader ZooKeeper watch triggered, but Solr cannot talk to ZK: [KeeperErrorCode = Session expired for /live_nodes]
   [junit4]   2> 354147 INFO  (jetty-closer-385-thread-1) [    ] o.a.s.m.SolrMetricManager Closing metric reporters for: solr.node
   [junit4]   2> 354148 INFO  (jetty-closer-385-thread-2) [    ] o.a.s.m.SolrMetricManager Closing metric reporters for: solr.node
   [junit4]   2> 354148 INFO  (jetty-closer-385-thread-1) [    ] o.e.j.s.h.ContextHandler Stopped o.e.j.s.ServletContextHandler@53ca2202{/solr,null,UNAVAILABLE}
   [junit4]   2> 354149 INFO  (jetty-closer-385-thread-2) [    ] o.e.j.s.h.ContextHandler Stopped o.e.j.s.ServletContextHandler@51207529{/solr,null,UNAVAILABLE}
   [junit4]   2> 354149 INFO  (SUITE-MissingSegmentRecoveryTest-seed#[14C5CB33E4BE8943]-worker) [    ] o.a.s.c.ZkTestServer connecting to 127.0.0.1:43844 43844
   [junit4]   2> 354259 INFO  (Thread-307) [    ] o.a.s.c.ZkTestServer connecting to 127.0.0.1:43844 43844
   [junit4]   2> 354260 WARN  (Thread-307) [    ] o.a.s.c.ZkTestServer Watch limit violations: 
   [junit4]   2> Maximum concurrent create/delete watches above limit:
   [junit4]   2> 
   [junit4]   2> 	4	/solr/aliases.json
   [junit4]   2> 	3	/solr/security.json
   [junit4]   2> 	2	/solr/configs/conf
   [junit4]   2> 
   [junit4]   2> Maximum concurrent data watches above limit:
   [junit4]   2> 
   [junit4]   2> 	4	/solr/clusterstate.json
   [junit4]   2> 	4	/solr/collections/MissingSegmentRecoveryTest/state.json
   [junit4]   2> 	4	/solr/clusterprops.json
   [junit4]   2> 	2	/solr/overseer_elect/election/97606861154418693-127.0.0.1:42332_solr-n_0000000000
   [junit4]   2> 
   [junit4]   2> Maximum concurrent children watches above limit:
   [junit4]   2> 
   [junit4]   2> 	93	/solr/overseer/collection-queue-work
   [junit4]   2> 	16	/solr/overseer/queue
   [junit4]   2> 	4	/solr/collections
   [junit4]   2> 	3	/solr/live_nodes
   [junit4]   2> 	3	/solr/overseer/queue-work
   [junit4]   2> 
   [junit4]   2> 354260 INFO  (SUITE-MissingSegmentRecoveryTest-seed#[14C5CB33E4BE8943]-worker) [    ] o.a.s.SolrTestCaseJ4 ###deleteCore
   [junit4]   2> NOTE: leaving temporary files on disk at: /x1/jenkins/jenkins-slave/workspace/Lucene-Solr-Tests-6.x/solr/build/solr-core/test/J0/temp/solr.cloud.MissingSegmentRecoveryTest_14C5CB33E4BE8943-001
   [junit4]   2> Mar 12, 2017 11:50:04 PM com.carrotsearch.randomizedtesting.ThreadLeakControl checkThreadLeaks
   [junit4]   2> WARNING: Will linger awaiting termination of 1 leaked thread(s).
   [junit4]   2> NOTE: test params are: codec=Asserting(Lucene62): {_version_=Lucene50(blocksize=128), id=FSTOrd50}, docValues:{}, maxPointsInLeafNode=1957, maxMBSortInHeap=6.611101914797952, sim=RandomSimilarity(queryNorm=false,coord=crazy): {}, locale=en-CA, timezone=CAT
   [junit4]   2> NOTE: Linux 3.13.0-85-generic amd64/Oracle Corporation 1.8.0_121 (64-bit)/cpus=4,threads=1,free=166030616,total=416808960
   [junit4]   2> NOTE: All tests run in this JVM: [TestFunctionQuery, TestJsonFacets, TestIntervalFaceting, TestDynamicLoading, SortSpecParsingTest, TestPseudoReturnFields, HdfsChaosMonkeySafeLeaderTest, TestFastWriter, DeleteNodeTest, CdcrReplicationHandlerTest, SynonymTokenizerTest, HighlighterMaxOffsetTest, BaseCdcrDistributedZkTest, SolrMetricReporterTest, ChaosMonkeyNothingIsSafeTest, LeaderElectionContextKeyTest, JvmMetricsTest, TestXmlQParser, TestShardHandlerFactory, TestSSLRandomization, TestFieldCacheSanityChecker, AddBlockUpdateTest, TestDFISimilarityFactory, MissingSegmentRecoveryTest]
   [junit4] Completed [98/697 (1!)] on J0 in 99.91s, 1 test, 1 failure <<< FAILURES!

[...truncated 64600 lines...]



Mime
View raw message