lucene-dev mailing list archives

Site index · List index
Message view « Date » · « Thread »
Top « Date » · « Thread »
From Policeman Jenkins Server <jenk...@thetaphi.de>
Subject [JENKINS-EA] Lucene-Solr-master-Linux (64bit/jdk-9-ea+155) - Build # 18949 - Still Unstable!
Date Sun, 12 Feb 2017 18:53:26 GMT
Build: https://jenkins.thetaphi.de/job/Lucene-Solr-master-Linux/18949/
Java: 64bit/jdk-9-ea+155 -XX:+UseCompressedOops -XX:+UseG1GC

2 tests failed.
FAILED:  org.apache.solr.handler.admin.TestApiFramework.testFramework

Error Message:
Could not initialize class org.easymock.internal.ClassProxyFactory$2

Stack Trace:
java.lang.NoClassDefFoundError: Could not initialize class org.easymock.internal.ClassProxyFactory$2
	at __randomizedtesting.SeedInfo.seed([7D9EC94F5DE52E79:6AE803685B31C244]:0)
	at org.easymock.internal.ClassProxyFactory.createEnhancer(ClassProxyFactory.java:259)
	at org.easymock.internal.ClassProxyFactory.createProxy(ClassProxyFactory.java:174)
	at org.easymock.internal.MocksControl.createMock(MocksControl.java:60)
	at org.easymock.EasyMock.createMock(EasyMock.java:104)
	at org.apache.solr.handler.admin.TestCoreAdminApis.getCoreContainerMock(TestCoreAdminApis.java:76)
	at org.apache.solr.handler.admin.TestApiFramework.testFramework(TestApiFramework.java:59)
	at java.base/jdk.internal.reflect.NativeMethodAccessorImpl.invoke0(Native Method)
	at java.base/jdk.internal.reflect.NativeMethodAccessorImpl.invoke(NativeMethodAccessorImpl.java:62)
	at java.base/jdk.internal.reflect.DelegatingMethodAccessorImpl.invoke(DelegatingMethodAccessorImpl.java:43)
	at java.base/java.lang.reflect.Method.invoke(Method.java:543)
	at com.carrotsearch.randomizedtesting.RandomizedRunner.invoke(RandomizedRunner.java:1713)
	at com.carrotsearch.randomizedtesting.RandomizedRunner$8.evaluate(RandomizedRunner.java:907)
	at com.carrotsearch.randomizedtesting.RandomizedRunner$9.evaluate(RandomizedRunner.java:943)
	at com.carrotsearch.randomizedtesting.RandomizedRunner$10.evaluate(RandomizedRunner.java:957)
	at com.carrotsearch.randomizedtesting.rules.SystemPropertiesRestoreRule$1.evaluate(SystemPropertiesRestoreRule.java:57)
	at org.apache.lucene.util.TestRuleSetupTeardownChained$1.evaluate(TestRuleSetupTeardownChained.java:49)
	at org.apache.lucene.util.AbstractBeforeAfterRule$1.evaluate(AbstractBeforeAfterRule.java:45)
	at org.apache.lucene.util.TestRuleThreadAndTestName$1.evaluate(TestRuleThreadAndTestName.java:48)
	at org.apache.lucene.util.TestRuleIgnoreAfterMaxFailures$1.evaluate(TestRuleIgnoreAfterMaxFailures.java:64)
	at org.apache.lucene.util.TestRuleMarkFailure$1.evaluate(TestRuleMarkFailure.java:47)
	at com.carrotsearch.randomizedtesting.rules.StatementAdapter.evaluate(StatementAdapter.java:36)
	at com.carrotsearch.randomizedtesting.ThreadLeakControl$StatementRunner.run(ThreadLeakControl.java:368)
	at com.carrotsearch.randomizedtesting.ThreadLeakControl.forkTimeoutingTask(ThreadLeakControl.java:817)
	at com.carrotsearch.randomizedtesting.ThreadLeakControl$3.evaluate(ThreadLeakControl.java:468)
	at com.carrotsearch.randomizedtesting.RandomizedRunner.runSingleTest(RandomizedRunner.java:916)
	at com.carrotsearch.randomizedtesting.RandomizedRunner$5.evaluate(RandomizedRunner.java:802)
	at com.carrotsearch.randomizedtesting.RandomizedRunner$6.evaluate(RandomizedRunner.java:852)
	at com.carrotsearch.randomizedtesting.RandomizedRunner$7.evaluate(RandomizedRunner.java:863)
	at com.carrotsearch.randomizedtesting.rules.StatementAdapter.evaluate(StatementAdapter.java:36)
	at com.carrotsearch.randomizedtesting.rules.SystemPropertiesRestoreRule$1.evaluate(SystemPropertiesRestoreRule.java:57)
	at org.apache.lucene.util.AbstractBeforeAfterRule$1.evaluate(AbstractBeforeAfterRule.java:45)
	at com.carrotsearch.randomizedtesting.rules.StatementAdapter.evaluate(StatementAdapter.java:36)
	at org.apache.lucene.util.TestRuleStoreClassName$1.evaluate(TestRuleStoreClassName.java:41)
	at com.carrotsearch.randomizedtesting.rules.NoShadowingOrOverridesOnMethodsRule$1.evaluate(NoShadowingOrOverridesOnMethodsRule.java:40)
	at com.carrotsearch.randomizedtesting.rules.NoShadowingOrOverridesOnMethodsRule$1.evaluate(NoShadowingOrOverridesOnMethodsRule.java:40)
	at com.carrotsearch.randomizedtesting.rules.StatementAdapter.evaluate(StatementAdapter.java:36)
	at com.carrotsearch.randomizedtesting.rules.StatementAdapter.evaluate(StatementAdapter.java:36)
	at org.apache.lucene.util.TestRuleAssertionsRequired$1.evaluate(TestRuleAssertionsRequired.java:53)
	at org.apache.lucene.util.TestRuleMarkFailure$1.evaluate(TestRuleMarkFailure.java:47)
	at org.apache.lucene.util.TestRuleIgnoreAfterMaxFailures$1.evaluate(TestRuleIgnoreAfterMaxFailures.java:64)
	at org.apache.lucene.util.TestRuleIgnoreTestSuites$1.evaluate(TestRuleIgnoreTestSuites.java:54)
	at com.carrotsearch.randomizedtesting.rules.StatementAdapter.evaluate(StatementAdapter.java:36)
	at com.carrotsearch.randomizedtesting.ThreadLeakControl$StatementRunner.run(ThreadLeakControl.java:368)
	at java.base/java.lang.Thread.run(Thread.java:844)


FAILED:  org.apache.solr.handler.admin.TestCoreAdminApis.testCalls

Error Message:


Stack Trace:
java.lang.ExceptionInInitializerError
	at __randomizedtesting.SeedInfo.seed([7D9EC94F5DE52E79:4F5FD624D8699DDE]:0)
	at net.sf.cglib.core.KeyFactory$Generator.generateClass(KeyFactory.java:166)
	at net.sf.cglib.core.DefaultGeneratorStrategy.generate(DefaultGeneratorStrategy.java:25)
	at net.sf.cglib.core.AbstractClassGenerator.create(AbstractClassGenerator.java:216)
	at net.sf.cglib.core.KeyFactory$Generator.create(KeyFactory.java:144)
	at net.sf.cglib.core.KeyFactory.create(KeyFactory.java:116)
	at net.sf.cglib.core.KeyFactory.create(KeyFactory.java:108)
	at net.sf.cglib.core.KeyFactory.create(KeyFactory.java:104)
	at net.sf.cglib.proxy.Enhancer.<clinit>(Enhancer.java:69)
	at org.easymock.internal.ClassProxyFactory.createEnhancer(ClassProxyFactory.java:259)
	at org.easymock.internal.ClassProxyFactory.createProxy(ClassProxyFactory.java:174)
	at org.easymock.internal.MocksControl.createMock(MocksControl.java:60)
	at org.easymock.EasyMock.createMock(EasyMock.java:104)
	at org.apache.solr.handler.admin.TestCoreAdminApis.getCoreContainerMock(TestCoreAdminApis.java:76)
	at org.apache.solr.handler.admin.TestCoreAdminApis.testCalls(TestCoreAdminApis.java:43)
	at java.base/jdk.internal.reflect.NativeMethodAccessorImpl.invoke0(Native Method)
	at java.base/jdk.internal.reflect.NativeMethodAccessorImpl.invoke(NativeMethodAccessorImpl.java:62)
	at java.base/jdk.internal.reflect.DelegatingMethodAccessorImpl.invoke(DelegatingMethodAccessorImpl.java:43)
	at java.base/java.lang.reflect.Method.invoke(Method.java:543)
	at com.carrotsearch.randomizedtesting.RandomizedRunner.invoke(RandomizedRunner.java:1713)
	at com.carrotsearch.randomizedtesting.RandomizedRunner$8.evaluate(RandomizedRunner.java:907)
	at com.carrotsearch.randomizedtesting.RandomizedRunner$9.evaluate(RandomizedRunner.java:943)
	at com.carrotsearch.randomizedtesting.RandomizedRunner$10.evaluate(RandomizedRunner.java:957)
	at com.carrotsearch.randomizedtesting.rules.SystemPropertiesRestoreRule$1.evaluate(SystemPropertiesRestoreRule.java:57)
	at org.apache.lucene.util.TestRuleSetupTeardownChained$1.evaluate(TestRuleSetupTeardownChained.java:49)
	at org.apache.lucene.util.AbstractBeforeAfterRule$1.evaluate(AbstractBeforeAfterRule.java:45)
	at org.apache.lucene.util.TestRuleThreadAndTestName$1.evaluate(TestRuleThreadAndTestName.java:48)
	at org.apache.lucene.util.TestRuleIgnoreAfterMaxFailures$1.evaluate(TestRuleIgnoreAfterMaxFailures.java:64)
	at org.apache.lucene.util.TestRuleMarkFailure$1.evaluate(TestRuleMarkFailure.java:47)
	at com.carrotsearch.randomizedtesting.rules.StatementAdapter.evaluate(StatementAdapter.java:36)
	at com.carrotsearch.randomizedtesting.ThreadLeakControl$StatementRunner.run(ThreadLeakControl.java:368)
	at com.carrotsearch.randomizedtesting.ThreadLeakControl.forkTimeoutingTask(ThreadLeakControl.java:817)
	at com.carrotsearch.randomizedtesting.ThreadLeakControl$3.evaluate(ThreadLeakControl.java:468)
	at com.carrotsearch.randomizedtesting.RandomizedRunner.runSingleTest(RandomizedRunner.java:916)
	at com.carrotsearch.randomizedtesting.RandomizedRunner$5.evaluate(RandomizedRunner.java:802)
	at com.carrotsearch.randomizedtesting.RandomizedRunner$6.evaluate(RandomizedRunner.java:852)
	at com.carrotsearch.randomizedtesting.RandomizedRunner$7.evaluate(RandomizedRunner.java:863)
	at com.carrotsearch.randomizedtesting.rules.StatementAdapter.evaluate(StatementAdapter.java:36)
	at com.carrotsearch.randomizedtesting.rules.SystemPropertiesRestoreRule$1.evaluate(SystemPropertiesRestoreRule.java:57)
	at org.apache.lucene.util.AbstractBeforeAfterRule$1.evaluate(AbstractBeforeAfterRule.java:45)
	at com.carrotsearch.randomizedtesting.rules.StatementAdapter.evaluate(StatementAdapter.java:36)
	at org.apache.lucene.util.TestRuleStoreClassName$1.evaluate(TestRuleStoreClassName.java:41)
	at com.carrotsearch.randomizedtesting.rules.NoShadowingOrOverridesOnMethodsRule$1.evaluate(NoShadowingOrOverridesOnMethodsRule.java:40)
	at com.carrotsearch.randomizedtesting.rules.NoShadowingOrOverridesOnMethodsRule$1.evaluate(NoShadowingOrOverridesOnMethodsRule.java:40)
	at com.carrotsearch.randomizedtesting.rules.StatementAdapter.evaluate(StatementAdapter.java:36)
	at com.carrotsearch.randomizedtesting.rules.StatementAdapter.evaluate(StatementAdapter.java:36)
	at org.apache.lucene.util.TestRuleAssertionsRequired$1.evaluate(TestRuleAssertionsRequired.java:53)
	at org.apache.lucene.util.TestRuleMarkFailure$1.evaluate(TestRuleMarkFailure.java:47)
	at org.apache.lucene.util.TestRuleIgnoreAfterMaxFailures$1.evaluate(TestRuleIgnoreAfterMaxFailures.java:64)
	at org.apache.lucene.util.TestRuleIgnoreTestSuites$1.evaluate(TestRuleIgnoreTestSuites.java:54)
	at com.carrotsearch.randomizedtesting.rules.StatementAdapter.evaluate(StatementAdapter.java:36)
	at com.carrotsearch.randomizedtesting.ThreadLeakControl$StatementRunner.run(ThreadLeakControl.java:368)
	at java.base/java.lang.Thread.run(Thread.java:844)
Caused by: java.lang.reflect.InaccessibleObjectException: Unable to make protected final java.lang.Class
java.lang.ClassLoader.defineClass(java.lang.String,byte[],int,int,java.security.ProtectionDomain)
throws java.lang.ClassFormatError accessible: module java.base does not "opens java.lang"
to unnamed module @277f88ee
	at java.base/java.lang.reflect.AccessibleObject.checkCanSetAccessible(AccessibleObject.java:207)
	at java.base/java.lang.reflect.Method.checkCanSetAccessible(Method.java:192)
	at java.base/java.lang.reflect.Method.setAccessible(Method.java:186)
	at net.sf.cglib.core.ReflectUtils$2.run(ReflectUtils.java:56)
	at java.base/java.security.AccessController.doPrivileged(Native Method)
	at net.sf.cglib.core.ReflectUtils.<clinit>(ReflectUtils.java:46)
	... 52 more




Build Log:
[...truncated 11590 lines...]
   [junit4] Suite: org.apache.solr.handler.admin.TestCoreAdminApis
   [junit4]   2> Creating dataDir: /home/jenkins/workspace/Lucene-Solr-master-Linux/solr/build/solr-core/test/J2/temp/solr.handler.admin.TestCoreAdminApis_7D9EC94F5DE52E79-001/init-core-data-001
   [junit4]   2> 755335 INFO  (SUITE-TestCoreAdminApis-seed#[7D9EC94F5DE52E79]-worker)
[    ] o.a.s.SolrTestCaseJ4 Using TrieFields
   [junit4]   2> 755338 INFO  (SUITE-TestCoreAdminApis-seed#[7D9EC94F5DE52E79]-worker)
[    ] o.a.s.SolrTestCaseJ4 Randomized ssl (true) and clientAuth (false) via: @org.apache.solr.util.RandomizeSSL(reason="",
ssl=0.0/0.0, value=0.0/0.0, clientAuth=0.0/0.0)
   [junit4]   2> 755341 INFO  (TEST-TestCoreAdminApis.testCalls-seed#[7D9EC94F5DE52E79])
[    ] o.a.s.SolrTestCaseJ4 ###Starting testCalls
   [junit4]   2> 755395 INFO  (TEST-TestCoreAdminApis.testCalls-seed#[7D9EC94F5DE52E79])
[    ] o.a.s.SolrTestCaseJ4 ###Ending testCalls
   [junit4]   2> NOTE: reproduce with: ant test  -Dtestcase=TestCoreAdminApis -Dtests.method=testCalls
-Dtests.seed=7D9EC94F5DE52E79 -Dtests.multiplier=3 -Dtests.slow=true -Dtests.locale=hy-AM
-Dtests.timezone=America/Indiana/Tell_City -Dtests.asserts=true -Dtests.file.encoding=UTF-8
   [junit4] ERROR   0.06s J2 | TestCoreAdminApis.testCalls <<<
   [junit4]    > Throwable #1: java.lang.ExceptionInInitializerError
   [junit4]    > 	at __randomizedtesting.SeedInfo.seed([7D9EC94F5DE52E79:4F5FD624D8699DDE]:0)
   [junit4]    > 	at net.sf.cglib.core.KeyFactory$Generator.generateClass(KeyFactory.java:166)
   [junit4]    > 	at net.sf.cglib.core.DefaultGeneratorStrategy.generate(DefaultGeneratorStrategy.java:25)
   [junit4]    > 	at net.sf.cglib.core.AbstractClassGenerator.create(AbstractClassGenerator.java:216)
   [junit4]    > 	at net.sf.cglib.core.KeyFactory$Generator.create(KeyFactory.java:144)
   [junit4]    > 	at net.sf.cglib.core.KeyFactory.create(KeyFactory.java:116)
   [junit4]    > 	at net.sf.cglib.core.KeyFactory.create(KeyFactory.java:108)
   [junit4]    > 	at net.sf.cglib.core.KeyFactory.create(KeyFactory.java:104)
   [junit4]    > 	at net.sf.cglib.proxy.Enhancer.<clinit>(Enhancer.java:69)
   [junit4]    > 	at org.easymock.internal.ClassProxyFactory.createEnhancer(ClassProxyFactory.java:259)
   [junit4]    > 	at org.easymock.internal.ClassProxyFactory.createProxy(ClassProxyFactory.java:174)
   [junit4]    > 	at org.easymock.internal.MocksControl.createMock(MocksControl.java:60)
   [junit4]    > 	at org.easymock.EasyMock.createMock(EasyMock.java:104)
   [junit4]    > 	at org.apache.solr.handler.admin.TestCoreAdminApis.getCoreContainerMock(TestCoreAdminApis.java:76)
   [junit4]    > 	at org.apache.solr.handler.admin.TestCoreAdminApis.testCalls(TestCoreAdminApis.java:43)
   [junit4]    > 	at java.base/jdk.internal.reflect.NativeMethodAccessorImpl.invoke0(Native
Method)
   [junit4]    > 	at java.base/jdk.internal.reflect.NativeMethodAccessorImpl.invoke(NativeMethodAccessorImpl.java:62)
   [junit4]    > 	at java.base/jdk.internal.reflect.DelegatingMethodAccessorImpl.invoke(DelegatingMethodAccessorImpl.java:43)
   [junit4]    > 	at java.base/java.lang.reflect.Method.invoke(Method.java:543)
   [junit4]    > 	at java.base/java.lang.Thread.run(Thread.java:844)
   [junit4]    > Caused by: java.lang.reflect.InaccessibleObjectException: Unable to make
protected final java.lang.Class java.lang.ClassLoader.defineClass(java.lang.String,byte[],int,int,java.security.ProtectionDomain)
throws java.lang.ClassFormatError accessible: module java.base does not "opens java.lang"
to unnamed module @277f88ee
   [junit4]    > 	at java.base/java.lang.reflect.AccessibleObject.checkCanSetAccessible(AccessibleObject.java:207)
   [junit4]    > 	at java.base/java.lang.reflect.Method.checkCanSetAccessible(Method.java:192)
   [junit4]    > 	at java.base/java.lang.reflect.Method.setAccessible(Method.java:186)
   [junit4]    > 	at net.sf.cglib.core.ReflectUtils$2.run(ReflectUtils.java:56)
   [junit4]    > 	at java.base/java.security.AccessController.doPrivileged(Native Method)
   [junit4]    > 	at net.sf.cglib.core.ReflectUtils.<clinit>(ReflectUtils.java:46)
   [junit4]    > 	... 52 more
   [junit4]   2> 755397 INFO  (SUITE-TestCoreAdminApis-seed#[7D9EC94F5DE52E79]-worker)
[    ] o.a.s.SolrTestCaseJ4 ###deleteCore
   [junit4]   2> NOTE: leaving temporary files on disk at: /home/jenkins/workspace/Lucene-Solr-master-Linux/solr/build/solr-core/test/J2/temp/solr.handler.admin.TestCoreAdminApis_7D9EC94F5DE52E79-001
   [junit4]   2> NOTE: test params are: codec=CheapBastard, sim=RandomSimilarity(queryNorm=false):
{}, locale=hy-AM, timezone=America/Indiana/Tell_City
   [junit4]   2> NOTE: Linux 4.4.0-53-generic amd64/Oracle Corporation 9-ea (64-bit)/cpus=12,threads=1,free=435834800,total=536870912
   [junit4]   2> NOTE: All tests run in this JVM: [AnalyticsMergeStrategyTest, TlogReplayBufferedWhileIndexingTest,
TestManagedSchemaThreadSafety, ClassificationUpdateProcessorFactoryTest, UpdateParamsTest,
BlockJoinFacetDistribTest, CoreMergeIndexesAdminHandlerTest, TestComplexPhraseLeadingWildcard,
TestCSVResponseWriter, TestDocTermOrds, TestIBSimilarityFactory, WrapperMergePolicyFactoryTest,
PreAnalyzedFieldManagedSchemaCloudTest, TestCloudManagedSchema, CustomCollectionTest, FullHLLTest,
SolrXmlInZkTest, TestTolerantSearch, TestDocBasedVersionConstraints, SimpleCollectionCreateDeleteTest,
SubstringBytesRefFilterTest, TestRestoreCore, TestImpersonationWithHadoopAuth, TestPHPSerializedResponseWriter,
FullSolrCloudDistribCmdsTest, TestClassicSimilarityFactory, SparseHLLTest, TestOrdValues,
TestExtendedDismaxParser, SuggesterWFSTTest, TestSolrJ, ShowFileRequestHandlerTest, TestSort,
RequestHandlersTest, SynonymTokenizerTest, TestPivotHelperCode, TestLeaderElectionWithEmptyReplica,
TestSolrQueryParserDefaultOperatorResource, OverseerRolesTest, TestGroupingSearch, TestConfigSets,
TestSubQueryTransformer, TestFieldCacheVsDocValues, SecurityConfHandlerTest, ResourceLoaderTest,
TestMacroExpander, BaseCdcrDistributedZkTest, BooleanFieldTest, TestFastOutputStream, TestDownShardTolerantSearch,
TestPerFieldSimilarityWithDefaultOverride, TestSmileRequest, TermVectorComponentDistributedTest,
SolrGraphiteReporterTest, TestQuerySenderNoQuery, TestBulkSchemaAPI, HdfsUnloadDistributedZkTest,
UUIDUpdateProcessorFallbackTest, BasicDistributedZk2Test, ReplaceNodeTest, PrimitiveFieldTypeTest,
TestCoreDiscovery, DistributedFacetPivotSmallAdvancedTest, HighlighterMaxOffsetTest, LukeRequestHandlerTest,
TestCollationFieldDocValues, TestSolrCloudWithSecureImpersonation, ShufflingReplicaListTransformerTest,
TestTestInjection, AddBlockUpdateTest, TestBlendedInfixSuggestions, BadIndexSchemaTest, PKIAuthenticationIntegrationTest,
MissingSegmentRecoveryTest, TestZkChroot, TestDefaultSearchFieldResource, TestLMDirichletSimilarityFactory,
TestTrieFacet, URLClassifyProcessorTest, TestStressLiveNodes, SuggesterTSTTest, TestConfig,
ResponseHeaderTest, TestIndexSearcher, DateFieldTest, TestCollationField, TestSolrQueryParser,
VersionInfoTest, DirectUpdateHandlerTest, TestRandomFlRTGCloud, TestCloudInspectUtil, TestJsonFacetRefinement,
TestShardHandlerFactory, CloneFieldUpdateProcessorFactoryTest, ConfigSetsAPITest, LeaderInitiatedRecoveryOnCommitTest,
PeerSyncReplicationTest, CoreSorterTest, JvmMetricsTest, TestSchemaSimilarityResource, TestDocSet,
DistributedQueryComponentCustomSortTest, TestReloadDeadlock, StatsComponentTest, TestConfigOverlay,
BlobRepositoryCloudTest, SolrTestCaseJ4Test, TestFieldCollectionResource, TestFieldSortValues,
TestJavabinTupleStreamParser, GraphQueryTest, TestCoreAdminApis]
   [junit4] Completed [268/694 (1!)] on J2 in 0.12s, 1 test, 1 error <<< FAILURES!

[...truncated 1096 lines...]
   [junit4] Suite: org.apache.solr.handler.admin.TestApiFramework
   [junit4]   2> Creating dataDir: /home/jenkins/workspace/Lucene-Solr-master-Linux/solr/build/solr-core/test/J2/temp/solr.handler.admin.TestApiFramework_7D9EC94F5DE52E79-001/init-core-data-001
   [junit4]   2> 2115254 INFO  (SUITE-TestApiFramework-seed#[7D9EC94F5DE52E79]-worker)
[    ] o.a.s.SolrTestCaseJ4 Using PointFields
   [junit4]   2> 2115255 INFO  (SUITE-TestApiFramework-seed#[7D9EC94F5DE52E79]-worker)
[    ] o.a.s.SolrTestCaseJ4 Randomized ssl (true) and clientAuth (true) via: @org.apache.solr.util.RandomizeSSL(reason="",
ssl=0.0/0.0, value=0.0/0.0, clientAuth=0.0/0.0)
   [junit4]   2> 2115258 INFO  (TEST-TestApiFramework.testFramework-seed#[7D9EC94F5DE52E79])
[    ] o.a.s.SolrTestCaseJ4 ###Starting testFramework
   [junit4]   2> 2115259 INFO  (TEST-TestApiFramework.testFramework-seed#[7D9EC94F5DE52E79])
[    ] o.a.s.SolrTestCaseJ4 ###Ending testFramework
   [junit4]   2> NOTE: reproduce with: ant test  -Dtestcase=TestApiFramework -Dtests.method=testFramework
-Dtests.seed=7D9EC94F5DE52E79 -Dtests.multiplier=3 -Dtests.slow=true -Dtests.locale=fur-IT
-Dtests.timezone=Asia/Macau -Dtests.asserts=true -Dtests.file.encoding=UTF-8
   [junit4] ERROR   0.00s J2 | TestApiFramework.testFramework <<<
   [junit4]    > Throwable #1: java.lang.NoClassDefFoundError: Could not initialize class
org.easymock.internal.ClassProxyFactory$2
   [junit4]    > 	at __randomizedtesting.SeedInfo.seed([7D9EC94F5DE52E79:6AE803685B31C244]:0)
   [junit4]    > 	at org.easymock.internal.ClassProxyFactory.createEnhancer(ClassProxyFactory.java:259)
   [junit4]    > 	at org.easymock.internal.ClassProxyFactory.createProxy(ClassProxyFactory.java:174)
   [junit4]    > 	at org.easymock.internal.MocksControl.createMock(MocksControl.java:60)
   [junit4]    > 	at org.easymock.EasyMock.createMock(EasyMock.java:104)
   [junit4]    > 	at org.apache.solr.handler.admin.TestCoreAdminApis.getCoreContainerMock(TestCoreAdminApis.java:76)
   [junit4]    > 	at org.apache.solr.handler.admin.TestApiFramework.testFramework(TestApiFramework.java:59)
   [junit4]    > 	at java.base/jdk.internal.reflect.NativeMethodAccessorImpl.invoke0(Native
Method)
   [junit4]    > 	at java.base/jdk.internal.reflect.NativeMethodAccessorImpl.invoke(NativeMethodAccessorImpl.java:62)
   [junit4]    > 	at java.base/jdk.internal.reflect.DelegatingMethodAccessorImpl.invoke(DelegatingMethodAccessorImpl.java:43)
   [junit4]    > 	at java.base/java.lang.reflect.Method.invoke(Method.java:543)
   [junit4]    > 	at java.base/java.lang.Thread.run(Thread.java:844)
   [junit4]   2> 2115260 INFO  (TEST-TestApiFramework.testTrailingTemplatePaths-seed#[7D9EC94F5DE52E79])
[    ] o.a.s.SolrTestCaseJ4 ###Starting testTrailingTemplatePaths
   [junit4]   2> 2115261 INFO  (TEST-TestApiFramework.testTrailingTemplatePaths-seed#[7D9EC94F5DE52E79])
[    ] o.a.s.SolrTestCaseJ4 ###Ending testTrailingTemplatePaths
   [junit4]   2> 2115261 INFO  (SUITE-TestApiFramework-seed#[7D9EC94F5DE52E79]-worker)
[    ] o.a.s.SolrTestCaseJ4 ###deleteCore
   [junit4]   2> NOTE: leaving temporary files on disk at: /home/jenkins/workspace/Lucene-Solr-master-Linux/solr/build/solr-core/test/J2/temp/solr.handler.admin.TestApiFramework_7D9EC94F5DE52E79-001
   [junit4]   2> NOTE: test params are: codec=Asserting(Lucene70): {}, docValues:{}, maxPointsInLeafNode=1164,
maxMBSortInHeap=6.274211925064918, sim=RandomSimilarity(queryNorm=true): {}, locale=fur-IT,
timezone=Asia/Macau
   [junit4]   2> NOTE: Linux 4.4.0-53-generic amd64/Oracle Corporation 9-ea (64-bit)/cpus=12,threads=1,free=188432312,total=536870912
   [junit4]   2> NOTE: All tests run in this JVM: [AnalyticsMergeStrategyTest, TlogReplayBufferedWhileIndexingTest,
TestManagedSchemaThreadSafety, ClassificationUpdateProcessorFactoryTest, UpdateParamsTest,
BlockJoinFacetDistribTest, CoreMergeIndexesAdminHandlerTest, TestComplexPhraseLeadingWildcard,
TestCSVResponseWriter, TestDocTermOrds, TestIBSimilarityFactory, WrapperMergePolicyFactoryTest,
PreAnalyzedFieldManagedSchemaCloudTest, TestCloudManagedSchema, CustomCollectionTest, FullHLLTest,
SolrXmlInZkTest, TestTolerantSearch, TestDocBasedVersionConstraints, SimpleCollectionCreateDeleteTest,
SubstringBytesRefFilterTest, TestRestoreCore, TestImpersonationWithHadoopAuth, TestPHPSerializedResponseWriter,
FullSolrCloudDistribCmdsTest, TestClassicSimilarityFactory, SparseHLLTest, TestOrdValues,
TestExtendedDismaxParser, SuggesterWFSTTest, TestSolrJ, ShowFileRequestHandlerTest, TestSort,
RequestHandlersTest, SynonymTokenizerTest, TestPivotHelperCode, TestLeaderElectionWithEmptyReplica,
TestSolrQueryParserDefaultOperatorResource, OverseerRolesTest, TestGroupingSearch, TestConfigSets,
TestSubQueryTransformer, TestFieldCacheVsDocValues, SecurityConfHandlerTest, ResourceLoaderTest,
TestMacroExpander, BaseCdcrDistributedZkTest, BooleanFieldTest, TestFastOutputStream, TestDownShardTolerantSearch,
TestPerFieldSimilarityWithDefaultOverride, TestSmileRequest, TermVectorComponentDistributedTest,
SolrGraphiteReporterTest, TestQuerySenderNoQuery, TestBulkSchemaAPI, HdfsUnloadDistributedZkTest,
UUIDUpdateProcessorFallbackTest, BasicDistributedZk2Test, ReplaceNodeTest, PrimitiveFieldTypeTest,
TestCoreDiscovery, DistributedFacetPivotSmallAdvancedTest, HighlighterMaxOffsetTest, LukeRequestHandlerTest,
TestCollationFieldDocValues, TestSolrCloudWithSecureImpersonation, ShufflingReplicaListTransformerTest,
TestTestInjection, AddBlockUpdateTest, TestBlendedInfixSuggestions, BadIndexSchemaTest, PKIAuthenticationIntegrationTest,
MissingSegmentRecoveryTest, TestZkChroot, TestDefaultSearchFieldResource, TestLMDirichletSimilarityFactory,
TestTrieFacet, URLClassifyProcessorTest, TestStressLiveNodes, SuggesterTSTTest, TestConfig,
ResponseHeaderTest, TestIndexSearcher, DateFieldTest, TestCollationField, TestSolrQueryParser,
VersionInfoTest, DirectUpdateHandlerTest, TestRandomFlRTGCloud, TestCloudInspectUtil, TestJsonFacetRefinement,
TestShardHandlerFactory, CloneFieldUpdateProcessorFactoryTest, ConfigSetsAPITest, LeaderInitiatedRecoveryOnCommitTest,
PeerSyncReplicationTest, CoreSorterTest, JvmMetricsTest, TestSchemaSimilarityResource, TestDocSet,
DistributedQueryComponentCustomSortTest, TestReloadDeadlock, StatsComponentTest, TestConfigOverlay,
BlobRepositoryCloudTest, SolrTestCaseJ4Test, TestFieldCollectionResource, TestFieldSortValues,
TestJavabinTupleStreamParser, GraphQueryTest, TestCoreAdminApis, LeaderElectionContextKeyTest,
ChaosMonkeySafeLeaderTest, UnloadDistributedZkTest, SyncSliceTest, OverseerTest, BasicZkTest,
RecoveryZkTest, TestReplicationHandler, TestRandomDVFaceting, TestRecovery, TestStressReorder,
HardAutoCommitTest, SimpleFacetsTest, TestSolr4Spatial, QueryElevationComponentTest, CurrencyFieldXmlFileTest,
SolrIndexSplitterTest, AnalysisAfterCoreReloadTest, CoreAdminHandlerTest, NoCacheHeaderTest,
WordBreakSolrSpellCheckerTest, SolrCoreCheckLockOnStartupTest, TestAtomicUpdateErrorCases,
DefaultValueUpdateProcessorTest, SortByFunctionTest, DocValuesMultiTest, TestSolrDeletionPolicy1,
IndexBasedSpellCheckerTest, TestReversedWildcardFilterFactory, TestOmitPositions, DocumentBuilderTest,
PathHierarchyTokenizerFactoryTest, TestIndexingPerformance, FieldAnalysisRequestHandlerTest,
SolrPluginUtilsTest, UniqFieldsUpdateProcessorFactoryTest, TestPartialUpdateDeduplication,
SearchHandlerTest, TestBinaryField, MinimalSchemaTest, TestFuzzyAnalyzedSuggestions, DirectSolrConnectionTest,
TestLuceneMatchVersion, SpellPossibilityIteratorTest, TestCodecSupport, PluginInfoTest, TestFastLRUCache,
PreAnalyzedFieldTest, TestUtils, SliceStateTest, CircularListTest, TestRTGBase, TestDistributedMissingSort,
TestEmbeddedSolrServerConstructors, TestJettySolrRunner, ConnectionReuseTest, CdcrBootstrapTest,
CreateCollectionCleanupTest, DeleteReplicaTest, DistribJoinFromCollectionTest, MigrateRouteKeyTest,
OverriddenZkACLAndCredentialsProvidersTest, OverseerTaskQueueTest, ShardSplitTest, TestHdfsBackupRestoreCore,
TestReplicationHandlerBackup, V2ApiIntegrationTest, CoreAdminRequestStatusTest, StatsReloadRaceTest,
TestApiFramework]
   [junit4] Completed [583/694 (2!)] on J2 in 0.02s, 2 tests, 1 error <<< FAILURES!

[...truncated 51965 lines...]


Mime
View raw message