lucene-dev mailing list archives

Site index · List index
Message view « Date » · « Thread »
Top « Date » · « Thread »
From Policeman Jenkins Server <jenk...@thetaphi.de>
Subject [JENKINS] Lucene-Solr-5.5-Windows (32bit/jdk1.7.0_80) - Build # 141 - Unstable!
Date Mon, 13 Feb 2017 11:15:10 GMT
Build: https://jenkins.thetaphi.de/job/Lucene-Solr-5.5-Windows/141/
Java: 32bit/jdk1.7.0_80 -server -XX:+UseParallelGC

2 tests failed.
FAILED:  org.apache.solr.cloud.DistribDocExpirationUpdateProcessorTest.test

Error Message:
There are still nodes recoverying - waited for 45 seconds

Stack Trace:
java.lang.AssertionError: There are still nodes recoverying - waited for 45 seconds
	at __randomizedtesting.SeedInfo.seed([C16B4632F6DB45A7:493F79E85827285F]:0)
	at org.junit.Assert.fail(Assert.java:93)
	at org.apache.solr.cloud.AbstractDistribZkTestBase.waitForRecoveriesToFinish(AbstractDistribZkTestBase.java:174)
	at org.apache.solr.cloud.AbstractFullDistribZkTestBase.waitForRecoveriesToFinish(AbstractFullDistribZkTestBase.java:838)
	at org.apache.solr.cloud.DistribDocExpirationUpdateProcessorTest.test(DistribDocExpirationUpdateProcessorTest.java:74)
	at sun.reflect.NativeMethodAccessorImpl.invoke0(Native Method)
	at sun.reflect.NativeMethodAccessorImpl.invoke(NativeMethodAccessorImpl.java:57)
	at sun.reflect.DelegatingMethodAccessorImpl.invoke(DelegatingMethodAccessorImpl.java:43)
	at java.lang.reflect.Method.invoke(Method.java:606)
	at com.carrotsearch.randomizedtesting.RandomizedRunner.invoke(RandomizedRunner.java:1764)
	at com.carrotsearch.randomizedtesting.RandomizedRunner$8.evaluate(RandomizedRunner.java:871)
	at com.carrotsearch.randomizedtesting.RandomizedRunner$9.evaluate(RandomizedRunner.java:907)
	at com.carrotsearch.randomizedtesting.RandomizedRunner$10.evaluate(RandomizedRunner.java:921)
	at org.apache.solr.BaseDistributedSearchTestCase$ShardsRepeatRule$ShardsFixedStatement.callStatement(BaseDistributedSearchTestCase.java:996)
	at org.apache.solr.BaseDistributedSearchTestCase$ShardsRepeatRule$ShardsStatement.evaluate(BaseDistributedSearchTestCase.java:971)
	at com.carrotsearch.randomizedtesting.rules.SystemPropertiesRestoreRule$1.evaluate(SystemPropertiesRestoreRule.java:57)
	at org.apache.lucene.util.TestRuleSetupTeardownChained$1.evaluate(TestRuleSetupTeardownChained.java:49)
	at org.apache.lucene.util.AbstractBeforeAfterRule$1.evaluate(AbstractBeforeAfterRule.java:45)
	at org.apache.lucene.util.TestRuleThreadAndTestName$1.evaluate(TestRuleThreadAndTestName.java:48)
	at org.apache.lucene.util.TestRuleIgnoreAfterMaxFailures$1.evaluate(TestRuleIgnoreAfterMaxFailures.java:64)
	at org.apache.lucene.util.TestRuleMarkFailure$1.evaluate(TestRuleMarkFailure.java:47)
	at com.carrotsearch.randomizedtesting.rules.StatementAdapter.evaluate(StatementAdapter.java:36)
	at com.carrotsearch.randomizedtesting.ThreadLeakControl$StatementRunner.run(ThreadLeakControl.java:367)
	at com.carrotsearch.randomizedtesting.ThreadLeakControl.forkTimeoutingTask(ThreadLeakControl.java:809)
	at com.carrotsearch.randomizedtesting.ThreadLeakControl$3.evaluate(ThreadLeakControl.java:460)
	at com.carrotsearch.randomizedtesting.RandomizedRunner.runSingleTest(RandomizedRunner.java:880)
	at com.carrotsearch.randomizedtesting.RandomizedRunner$5.evaluate(RandomizedRunner.java:781)
	at com.carrotsearch.randomizedtesting.RandomizedRunner$6.evaluate(RandomizedRunner.java:816)
	at com.carrotsearch.randomizedtesting.RandomizedRunner$7.evaluate(RandomizedRunner.java:827)
	at com.carrotsearch.randomizedtesting.rules.StatementAdapter.evaluate(StatementAdapter.java:36)
	at com.carrotsearch.randomizedtesting.rules.SystemPropertiesRestoreRule$1.evaluate(SystemPropertiesRestoreRule.java:57)
	at org.apache.lucene.util.AbstractBeforeAfterRule$1.evaluate(AbstractBeforeAfterRule.java:45)
	at com.carrotsearch.randomizedtesting.rules.StatementAdapter.evaluate(StatementAdapter.java:36)
	at org.apache.lucene.util.TestRuleStoreClassName$1.evaluate(TestRuleStoreClassName.java:41)
	at com.carrotsearch.randomizedtesting.rules.NoShadowingOrOverridesOnMethodsRule$1.evaluate(NoShadowingOrOverridesOnMethodsRule.java:40)
	at com.carrotsearch.randomizedtesting.rules.NoShadowingOrOverridesOnMethodsRule$1.evaluate(NoShadowingOrOverridesOnMethodsRule.java:40)
	at com.carrotsearch.randomizedtesting.rules.StatementAdapter.evaluate(StatementAdapter.java:36)
	at com.carrotsearch.randomizedtesting.rules.StatementAdapter.evaluate(StatementAdapter.java:36)
	at com.carrotsearch.randomizedtesting.rules.StatementAdapter.evaluate(StatementAdapter.java:36)
	at org.apache.lucene.util.TestRuleAssertionsRequired$1.evaluate(TestRuleAssertionsRequired.java:53)
	at org.apache.lucene.util.TestRuleMarkFailure$1.evaluate(TestRuleMarkFailure.java:47)
	at org.apache.lucene.util.TestRuleIgnoreAfterMaxFailures$1.evaluate(TestRuleIgnoreAfterMaxFailures.java:64)
	at org.apache.lucene.util.TestRuleIgnoreTestSuites$1.evaluate(TestRuleIgnoreTestSuites.java:54)
	at com.carrotsearch.randomizedtesting.rules.StatementAdapter.evaluate(StatementAdapter.java:36)
	at com.carrotsearch.randomizedtesting.ThreadLeakControl$StatementRunner.run(ThreadLeakControl.java:367)
	at java.lang.Thread.run(Thread.java:745)


FAILED:  org.apache.solr.schema.TestManagedSchemaAPI.test

Error Message:
Error from server at http://127.0.0.1:55956/solr/testschemaapi_shard1_replica1: ERROR: [doc=2] unknown field 'myNewField1'

Stack Trace:
org.apache.solr.client.solrj.impl.CloudSolrClient$RouteException: Error from server at http://127.0.0.1:55956/solr/testschemaapi_shard1_replica1: ERROR: [doc=2] unknown field 'myNewField1'
	at __randomizedtesting.SeedInfo.seed([C16B4632F6DB45A7:493F79E85827285F]:0)
	at org.apache.solr.client.solrj.impl.CloudSolrClient.directUpdate(CloudSolrClient.java:653)
	at org.apache.solr.client.solrj.impl.CloudSolrClient.sendRequest(CloudSolrClient.java:1002)
	at org.apache.solr.client.solrj.impl.CloudSolrClient.requestWithRetryOnStaleState(CloudSolrClient.java:891)
	at org.apache.solr.client.solrj.impl.CloudSolrClient.request(CloudSolrClient.java:827)
	at org.apache.solr.schema.TestManagedSchemaAPI.testAddFieldAndDocument(TestManagedSchemaAPI.java:101)
	at org.apache.solr.schema.TestManagedSchemaAPI.test(TestManagedSchemaAPI.java:69)
	at sun.reflect.NativeMethodAccessorImpl.invoke0(Native Method)
	at sun.reflect.NativeMethodAccessorImpl.invoke(NativeMethodAccessorImpl.java:57)
	at sun.reflect.DelegatingMethodAccessorImpl.invoke(DelegatingMethodAccessorImpl.java:43)
	at java.lang.reflect.Method.invoke(Method.java:606)
	at com.carrotsearch.randomizedtesting.RandomizedRunner.invoke(RandomizedRunner.java:1764)
	at com.carrotsearch.randomizedtesting.RandomizedRunner$8.evaluate(RandomizedRunner.java:871)
	at com.carrotsearch.randomizedtesting.RandomizedRunner$9.evaluate(RandomizedRunner.java:907)
	at com.carrotsearch.randomizedtesting.RandomizedRunner$10.evaluate(RandomizedRunner.java:921)
	at com.carrotsearch.randomizedtesting.rules.SystemPropertiesRestoreRule$1.evaluate(SystemPropertiesRestoreRule.java:57)
	at org.apache.lucene.util.TestRuleSetupTeardownChained$1.evaluate(TestRuleSetupTeardownChained.java:49)
	at org.apache.lucene.util.AbstractBeforeAfterRule$1.evaluate(AbstractBeforeAfterRule.java:45)
	at org.apache.lucene.util.TestRuleThreadAndTestName$1.evaluate(TestRuleThreadAndTestName.java:48)
	at org.apache.lucene.util.TestRuleIgnoreAfterMaxFailures$1.evaluate(TestRuleIgnoreAfterMaxFailures.java:64)
	at org.apache.lucene.util.TestRuleMarkFailure$1.evaluate(TestRuleMarkFailure.java:47)
	at com.carrotsearch.randomizedtesting.rules.StatementAdapter.evaluate(StatementAdapter.java:36)
	at com.carrotsearch.randomizedtesting.ThreadLeakControl$StatementRunner.run(ThreadLeakControl.java:367)
	at com.carrotsearch.randomizedtesting.ThreadLeakControl.forkTimeoutingTask(ThreadLeakControl.java:809)
	at com.carrotsearch.randomizedtesting.ThreadLeakControl$3.evaluate(ThreadLeakControl.java:460)
	at com.carrotsearch.randomizedtesting.RandomizedRunner.runSingleTest(RandomizedRunner.java:880)
	at com.carrotsearch.randomizedtesting.RandomizedRunner$5.evaluate(RandomizedRunner.java:781)
	at com.carrotsearch.randomizedtesting.RandomizedRunner$6.evaluate(RandomizedRunner.java:816)
	at com.carrotsearch.randomizedtesting.RandomizedRunner$7.evaluate(RandomizedRunner.java:827)
	at com.carrotsearch.randomizedtesting.rules.StatementAdapter.evaluate(StatementAdapter.java:36)
	at com.carrotsearch.randomizedtesting.rules.SystemPropertiesRestoreRule$1.evaluate(SystemPropertiesRestoreRule.java:57)
	at org.apache.lucene.util.AbstractBeforeAfterRule$1.evaluate(AbstractBeforeAfterRule.java:45)
	at com.carrotsearch.randomizedtesting.rules.StatementAdapter.evaluate(StatementAdapter.java:36)
	at org.apache.lucene.util.TestRuleStoreClassName$1.evaluate(TestRuleStoreClassName.java:41)
	at com.carrotsearch.randomizedtesting.rules.NoShadowingOrOverridesOnMethodsRule$1.evaluate(NoShadowingOrOverridesOnMethodsRule.java:40)
	at com.carrotsearch.randomizedtesting.rules.NoShadowingOrOverridesOnMethodsRule$1.evaluate(NoShadowingOrOverridesOnMethodsRule.java:40)
	at com.carrotsearch.randomizedtesting.rules.StatementAdapter.evaluate(StatementAdapter.java:36)
	at com.carrotsearch.randomizedtesting.rules.StatementAdapter.evaluate(StatementAdapter.java:36)
	at com.carrotsearch.randomizedtesting.rules.StatementAdapter.evaluate(StatementAdapter.java:36)
	at org.apache.lucene.util.TestRuleAssertionsRequired$1.evaluate(TestRuleAssertionsRequired.java:53)
	at org.apache.lucene.util.TestRuleMarkFailure$1.evaluate(TestRuleMarkFailure.java:47)
	at org.apache.lucene.util.TestRuleIgnoreAfterMaxFailures$1.evaluate(TestRuleIgnoreAfterMaxFailures.java:64)
	at org.apache.lucene.util.TestRuleIgnoreTestSuites$1.evaluate(TestRuleIgnoreTestSuites.java:54)
	at com.carrotsearch.randomizedtesting.rules.StatementAdapter.evaluate(StatementAdapter.java:36)
	at com.carrotsearch.randomizedtesting.ThreadLeakControl$StatementRunner.run(ThreadLeakControl.java:367)
	at java.lang.Thread.run(Thread.java:745)
Caused by: org.apache.solr.client.solrj.impl.HttpSolrClient$RemoteSolrException: Error from server at http://127.0.0.1:55956/solr/testschemaapi_shard1_replica1: ERROR: [doc=2] unknown field 'myNewField1'
	at org.apache.solr.client.solrj.impl.HttpSolrClient.executeMethod(HttpSolrClient.java:577)
	at org.apache.solr.client.solrj.impl.HttpSolrClient.request(HttpSolrClient.java:241)
	at org.apache.solr.client.solrj.impl.HttpSolrClient.request(HttpSolrClient.java:230)
	at org.apache.solr.client.solrj.impl.LBHttpSolrClient.doRequest(LBHttpSolrClient.java:372)
	at org.apache.solr.client.solrj.impl.LBHttpSolrClient.request(LBHttpSolrClient.java:325)
	at org.apache.solr.client.solrj.impl.CloudSolrClient$2.call(CloudSolrClient.java:628)
	at org.apache.solr.client.solrj.impl.CloudSolrClient$2.call(CloudSolrClient.java:625)
	at java.util.concurrent.FutureTask.run(FutureTask.java:262)
	at org.apache.solr.common.util.ExecutorUtil$MDCAwareThreadPoolExecutor$1.run(ExecutorUtil.java:231)
	at java.util.concurrent.ThreadPoolExecutor.runWorker(ThreadPoolExecutor.java:1145)
	at java.util.concurrent.ThreadPoolExecutor$Worker.run(ThreadPoolExecutor.java:615)
	... 1 more




Build Log:
[...truncated 10662 lines...]
   [junit4] Suite: org.apache.solr.schema.TestManagedSchemaAPI
   [junit4]   2> Creating dataDir: C:\Users\jenkins\workspace\Lucene-Solr-5.5-Windows\solr\build\solr-core\test\J1\temp\solr.schema.TestManagedSchemaAPI_C16B4632F6DB45A7-001\init-core-data-001
   [junit4]   2> 156617 INFO  (SUITE-TestManagedSchemaAPI-seed#[C16B4632F6DB45A7]-worker) [    ] o.a.s.SolrTestCaseJ4 Randomized ssl (false) and clientAuth (false)
   [junit4]   2> 156621 INFO  (TEST-TestManagedSchemaAPI.test-seed#[C16B4632F6DB45A7]) [    ] o.a.s.SolrTestCaseJ4 ###Starting test
   [junit4]   2> 156622 INFO  (TEST-TestManagedSchemaAPI.test-seed#[C16B4632F6DB45A7]) [    ] o.a.s.c.ZkTestServer STARTING ZK TEST SERVER
   [junit4]   2> 156623 INFO  (Thread-346) [    ] o.a.s.c.ZkTestServer client port:0.0.0.0/0.0.0.0:0
   [junit4]   2> 156623 INFO  (Thread-346) [    ] o.a.s.c.ZkTestServer Starting server
   [junit4]   2> 156723 INFO  (TEST-TestManagedSchemaAPI.test-seed#[C16B4632F6DB45A7]) [    ] o.a.s.c.ZkTestServer start zk server on port:55951
   [junit4]   2> 156723 INFO  (TEST-TestManagedSchemaAPI.test-seed#[C16B4632F6DB45A7]) [    ] o.a.s.c.c.SolrZkClient Using default ZkCredentialsProvider
   [junit4]   2> 156724 INFO  (TEST-TestManagedSchemaAPI.test-seed#[C16B4632F6DB45A7]) [    ] o.a.s.c.c.ConnectionManager Waiting for client to connect to ZooKeeper
   [junit4]   2> 156729 INFO  (zkCallback-153-thread-1) [    ] o.a.s.c.c.ConnectionManager Watcher org.apache.solr.common.cloud.ConnectionManager@1c0d34a name:ZooKeeperConnection Watcher:127.0.0.1:55951 got event WatchedEvent state:SyncConnected type:None path:null path:null type:None
   [junit4]   2> 156729 INFO  (TEST-TestManagedSchemaAPI.test-seed#[C16B4632F6DB45A7]) [    ] o.a.s.c.c.ConnectionManager Client is connected to ZooKeeper
   [junit4]   2> 156729 INFO  (TEST-TestManagedSchemaAPI.test-seed#[C16B4632F6DB45A7]) [    ] o.a.s.c.c.SolrZkClient Using default ZkACLProvider
   [junit4]   2> 156729 INFO  (TEST-TestManagedSchemaAPI.test-seed#[C16B4632F6DB45A7]) [    ] o.a.s.c.c.SolrZkClient makePath: /solr/solr.xml
   [junit4]   2> 156737 INFO  (jetty-launcher-152-thread-1) [    ] o.e.j.s.Server jetty-9.2.13.v20150730
   [junit4]   2> 156737 INFO  (jetty-launcher-152-thread-2) [    ] o.e.j.s.Server jetty-9.2.13.v20150730
   [junit4]   2> 156740 INFO  (jetty-launcher-152-thread-1) [    ] o.e.j.s.h.ContextHandler Started o.e.j.s.ServletContextHandler@96f443{/solr,null,AVAILABLE}
   [junit4]   2> 156740 INFO  (jetty-launcher-152-thread-2) [    ] o.e.j.s.h.ContextHandler Started o.e.j.s.ServletContextHandler@7e8618{/solr,null,AVAILABLE}
   [junit4]   2> 156743 INFO  (jetty-launcher-152-thread-2) [    ] o.e.j.s.ServerConnector Started ServerConnector@127fbd9{HTTP/1.1}{127.0.0.1:55956}
   [junit4]   2> 156743 INFO  (jetty-launcher-152-thread-2) [    ] o.e.j.s.Server Started @161987ms
   [junit4]   2> 156743 INFO  (jetty-launcher-152-thread-1) [    ] o.e.j.s.ServerConnector Started ServerConnector@9592ef{HTTP/1.1}{127.0.0.1:55955}
   [junit4]   2> 156743 INFO  (jetty-launcher-152-thread-2) [    ] o.a.s.c.s.e.JettySolrRunner Jetty properties: {hostPort=55956, hostContext=/solr}
   [junit4]   2> 156743 INFO  (jetty-launcher-152-thread-1) [    ] o.e.j.s.Server Started @161987ms
   [junit4]   2> 156743 INFO  (jetty-launcher-152-thread-1) [    ] o.a.s.c.s.e.JettySolrRunner Jetty properties: {hostContext=/solr, hostPort=55955}
   [junit4]   2> 156745 INFO  (jetty-launcher-152-thread-1) [    ] o.a.s.s.SolrDispatchFilter SolrDispatchFilter.init(): sun.misc.Launcher$AppClassLoader@6c9220
   [junit4]   2> 156745 INFO  (jetty-launcher-152-thread-2) [    ] o.a.s.s.SolrDispatchFilter SolrDispatchFilter.init(): sun.misc.Launcher$AppClassLoader@6c9220
   [junit4]   2> 156745 INFO  (jetty-launcher-152-thread-1) [    ] o.a.s.c.SolrResourceLoader new SolrResourceLoader for directory: 'C:\Users\jenkins\workspace\Lucene-Solr-5.5-Windows\solr\build\solr-core\test\J1\temp\solr.schema.TestManagedSchemaAPI_C16B4632F6DB45A7-001\tempDir-001\node1'
   [junit4]   2> 156745 INFO  (jetty-launcher-152-thread-2) [    ] o.a.s.c.SolrResourceLoader new SolrResourceLoader for directory: 'C:\Users\jenkins\workspace\Lucene-Solr-5.5-Windows\solr\build\solr-core\test\J1\temp\solr.schema.TestManagedSchemaAPI_C16B4632F6DB45A7-001\tempDir-001\node2'
   [junit4]   2> 156745 INFO  (jetty-launcher-152-thread-1) [    ] o.a.s.c.SolrResourceLoader JNDI not configured for solr (NoInitialContextEx)
   [junit4]   2> 156745 INFO  (jetty-launcher-152-thread-2) [    ] o.a.s.c.SolrResourceLoader JNDI not configured for solr (NoInitialContextEx)
   [junit4]   2> 156745 INFO  (jetty-launcher-152-thread-1) [    ] o.a.s.c.SolrResourceLoader solr home defaulted to 'solr/' (could not find system property or JNDI)
   [junit4]   2> 156745 INFO  (jetty-launcher-152-thread-2) [    ] o.a.s.c.SolrResourceLoader solr home defaulted to 'solr/' (could not find system property or JNDI)
   [junit4]   2> 156747 INFO  (jetty-launcher-152-thread-1) [    ] o.a.s.c.c.SolrZkClient Using default ZkCredentialsProvider
   [junit4]   2> 156747 INFO  (jetty-launcher-152-thread-2) [    ] o.a.s.c.c.SolrZkClient Using default ZkCredentialsProvider
   [junit4]   2> 156749 INFO  (jetty-launcher-152-thread-1) [    ] o.a.s.c.c.ConnectionManager Waiting for client to connect to ZooKeeper
   [junit4]   2> 156749 INFO  (jetty-launcher-152-thread-2) [    ] o.a.s.c.c.ConnectionManager Waiting for client to connect to ZooKeeper
   [junit4]   2> 156751 INFO  (zkCallback-154-thread-1) [    ] o.a.s.c.c.ConnectionManager Watcher org.apache.solr.common.cloud.ConnectionManager@13c3a4e name:ZooKeeperConnection Watcher:127.0.0.1:55951/solr got event WatchedEvent state:SyncConnected type:None path:null path:null type:None
   [junit4]   2> 156751 INFO  (jetty-launcher-152-thread-1) [    ] o.a.s.c.c.ConnectionManager Client is connected to ZooKeeper
   [junit4]   2> 156751 INFO  (zkCallback-155-thread-1) [    ] o.a.s.c.c.ConnectionManager Watcher org.apache.solr.common.cloud.ConnectionManager@525828 name:ZooKeeperConnection Watcher:127.0.0.1:55951/solr got event WatchedEvent state:SyncConnected type:None path:null path:null type:None
   [junit4]   2> 156751 INFO  (jetty-launcher-152-thread-2) [    ] o.a.s.c.c.ConnectionManager Client is connected to ZooKeeper
   [junit4]   2> 156751 INFO  (jetty-launcher-152-thread-1) [    ] o.a.s.c.c.SolrZkClient Using default ZkACLProvider
   [junit4]   2> 156751 INFO  (jetty-launcher-152-thread-2) [    ] o.a.s.c.c.SolrZkClient Using default ZkACLProvider
   [junit4]   2> 156752 INFO  (jetty-launcher-152-thread-2) [    ] o.a.s.s.SolrDispatchFilter solr.xml found in ZooKeeper. Loading...
   [junit4]   2> 156752 INFO  (jetty-launcher-152-thread-1) [    ] o.a.s.s.SolrDispatchFilter solr.xml found in ZooKeeper. Loading...
   [junit4]   2> 156798 INFO  (jetty-launcher-152-thread-2) [    ] o.a.s.c.CorePropertiesLocator Config-defined core root directory: C:\Users\jenkins\workspace\Lucene-Solr-5.5-Windows\solr\build\solr-core\test\J1\temp\solr.schema.TestManagedSchemaAPI_C16B4632F6DB45A7-001\tempDir-001\node2\.
   [junit4]   2> 156798 WARN  (NIOServerCxn.Factory:0.0.0.0/0.0.0.0:0) [    ] o.a.z.s.NIOServerCnxn caught end of stream exception
   [junit4]   2> EndOfStreamException: Unable to read additional data from client sessionid 0x15a36eb5baf0002, likely client has closed socket
   [junit4]   2> 	at org.apache.zookeeper.server.NIOServerCnxn.doIO(NIOServerCnxn.java:228)
   [junit4]   2> 	at org.apache.zookeeper.server.NIOServerCnxnFactory.run(NIOServerCnxnFactory.java:208)
   [junit4]   2> 	at java.lang.Thread.run(Thread.java:745)
   [junit4]   2> 156798 INFO  (jetty-launcher-152-thread-2) [    ] o.a.s.c.CoreContainer New CoreContainer 25857007
   [junit4]   2> 156798 INFO  (jetty-launcher-152-thread-1) [    ] o.a.s.c.CorePropertiesLocator Config-defined core root directory: C:\Users\jenkins\workspace\Lucene-Solr-5.5-Windows\solr\build\solr-core\test\J1\temp\solr.schema.TestManagedSchemaAPI_C16B4632F6DB45A7-001\tempDir-001\node1\.
   [junit4]   2> 156798 INFO  (jetty-launcher-152-thread-2) [    ] o.a.s.c.CoreContainer Loading cores into CoreContainer [instanceDir=C:\Users\jenkins\workspace\Lucene-Solr-5.5-Windows\solr\build\solr-core\test\J1\temp\solr.schema.TestManagedSchemaAPI_C16B4632F6DB45A7-001\tempDir-001\node2]
   [junit4]   2> 156799 INFO  (jetty-launcher-152-thread-1) [    ] o.a.s.c.CoreContainer New CoreContainer 26166862
   [junit4]   2> 156799 INFO  (jetty-launcher-152-thread-1) [    ] o.a.s.c.CoreContainer Loading cores into CoreContainer [instanceDir=C:\Users\jenkins\workspace\Lucene-Solr-5.5-Windows\solr\build\solr-core\test\J1\temp\solr.schema.TestManagedSchemaAPI_C16B4632F6DB45A7-001\tempDir-001\node1]
   [junit4]   2> 156799 WARN  (jetty-launcher-152-thread-2) [    ] o.a.s.c.CoreContainer Couldn't add files from C:\Users\jenkins\workspace\Lucene-Solr-5.5-Windows\solr\build\solr-core\test\J1\temp\solr.schema.TestManagedSchemaAPI_C16B4632F6DB45A7-001\tempDir-001\node2\lib to classpath: C:\Users\jenkins\workspace\Lucene-Solr-5.5-Windows\solr\build\solr-core\test\J1\temp\solr.schema.TestManagedSchemaAPI_C16B4632F6DB45A7-001\tempDir-001\node2\lib
   [junit4]   2> 156799 WARN  (jetty-launcher-152-thread-1) [    ] o.a.s.c.CoreContainer Couldn't add files from C:\Users\jenkins\workspace\Lucene-Solr-5.5-Windows\solr\build\solr-core\test\J1\temp\solr.schema.TestManagedSchemaAPI_C16B4632F6DB45A7-001\tempDir-001\node1\lib to classpath: C:\Users\jenkins\workspace\Lucene-Solr-5.5-Windows\solr\build\solr-core\test\J1\temp\solr.schema.TestManagedSchemaAPI_C16B4632F6DB45A7-001\tempDir-001\node1\lib
   [junit4]   2> 156799 INFO  (jetty-launcher-152-thread-2) [    ] o.a.s.h.c.HttpShardHandlerFactory created with socketTimeout : 90000,urlScheme : ,connTimeout : 15000,maxConnectionsPerHost : 20,maxConnections : 10000,corePoolSize : 0,maximumPoolSize : 2147483647,maxThreadIdleTime : 5,sizeOfQueue : -1,fairnessPolicy : false,useRetries : false,connectionsEvictorSleepDelay : 5000,maxConnectionIdleTime : 40000,
   [junit4]   2> 156799 INFO  (jetty-launcher-152-thread-1) [    ] o.a.s.h.c.HttpShardHandlerFactory created with socketTimeout : 90000,urlScheme : ,connTimeout : 15000,maxConnectionsPerHost : 20,maxConnections : 10000,corePoolSize : 0,maximumPoolSize : 2147483647,maxThreadIdleTime : 5,sizeOfQueue : -1,fairnessPolicy : false,useRetries : false,connectionsEvictorSleepDelay : 5000,maxConnectionIdleTime : 40000,
   [junit4]   2> 156807 INFO  (jetty-launcher-152-thread-1) [    ] o.a.s.u.UpdateShardHandler Creating UpdateShardHandler HTTP client with params: socketTimeout=340000&connTimeout=45000&retry=true
   [junit4]   2> 156807 INFO  (jetty-launcher-152-thread-2) [    ] o.a.s.u.UpdateShardHandler Creating UpdateShardHandler HTTP client with params: socketTimeout=340000&connTimeout=45000&retry=true
   [junit4]   2> 156808 INFO  (jetty-launcher-152-thread-1) [    ] o.a.s.l.LogWatcher SLF4J impl is org.slf4j.impl.Log4jLoggerFactory
   [junit4]   2> 156808 INFO  (jetty-launcher-152-thread-1) [    ] o.a.s.l.LogWatcher Registering Log Listener [Log4j (org.slf4j.impl.Log4jLoggerFactory)]
   [junit4]   2> 156808 INFO  (jetty-launcher-152-thread-2) [    ] o.a.s.l.LogWatcher SLF4J impl is org.slf4j.impl.Log4jLoggerFactory
   [junit4]   2> 156808 INFO  (jetty-launcher-152-thread-2) [    ] o.a.s.l.LogWatcher Registering Log Listener [Log4j (org.slf4j.impl.Log4jLoggerFactory)]
   [junit4]   2> 156808 INFO  (jetty-launcher-152-thread-2) [    ] o.a.s.c.ZkContainer Zookeeper client=127.0.0.1:55951/solr
   [junit4]   2> 156808 INFO  (jetty-launcher-152-thread-2) [    ] o.a.s.c.ZkController zkHost includes chroot
   [junit4]   2> 156808 INFO  (jetty-launcher-152-thread-1) [    ] o.a.s.c.ZkContainer Zookeeper client=127.0.0.1:55951/solr
   [junit4]   2> 156808 INFO  (jetty-launcher-152-thread-2) [    ] o.a.s.c.c.SolrZkClient Using default ZkCredentialsProvider
   [junit4]   2> 156808 INFO  (jetty-launcher-152-thread-1) [    ] o.a.s.c.ZkController zkHost includes chroot
   [junit4]   2> 156808 INFO  (jetty-launcher-152-thread-1) [    ] o.a.s.c.c.SolrZkClient Using default ZkCredentialsProvider
   [junit4]   2> 156809 INFO  (jetty-launcher-152-thread-2) [    ] o.a.s.c.c.ConnectionManager Waiting for client to connect to ZooKeeper
   [junit4]   2> 156809 INFO  (jetty-launcher-152-thread-1) [    ] o.a.s.c.c.ConnectionManager Waiting for client to connect to ZooKeeper
   [junit4]   2> 156821 INFO  (zkCallback-160-thread-1) [    ] o.a.s.c.c.ConnectionManager Watcher org.apache.solr.common.cloud.ConnectionManager@5756ca name:ZooKeeperConnection Watcher:127.0.0.1:55951 got event WatchedEvent state:SyncConnected type:None path:null path:null type:None
   [junit4]   2> 156821 INFO  (jetty-launcher-152-thread-2) [    ] o.a.s.c.c.ConnectionManager Client is connected to ZooKeeper
   [junit4]   2> 156821 INFO  (zkCallback-161-thread-1) [    ] o.a.s.c.c.ConnectionManager Watcher org.apache.solr.common.cloud.ConnectionManager@309cc name:ZooKeeperConnection Watcher:127.0.0.1:55951 got event WatchedEvent state:SyncConnected type:None path:null path:null type:None
   [junit4]   2> 156821 INFO  (jetty-launcher-152-thread-1) [    ] o.a.s.c.c.ConnectionManager Client is connected to ZooKeeper
   [junit4]   2> 156821 INFO  (jetty-launcher-152-thread-2) [    ] o.a.s.c.c.SolrZkClient Using default ZkACLProvider
   [junit4]   2> 156822 INFO  (jetty-launcher-152-thread-1) [    ] o.a.s.c.c.SolrZkClient Using default ZkACLProvider
   [junit4]   2> 156824 INFO  (jetty-launcher-152-thread-1) [n:127.0.0.1:55955_solr    ] o.a.s.c.ZkController Added new OnReconnect listener org.apache.solr.cloud.ZkController$6@603b69
   [junit4]   2> 156824 INFO  (jetty-launcher-152-thread-2) [n:127.0.0.1:55956_solr    ] o.a.s.c.ZkController Added new OnReconnect listener org.apache.solr.cloud.ZkController$6@1dc92b2
   [junit4]   2> 156824 WARN  (NIOServerCxn.Factory:0.0.0.0/0.0.0.0:0) [    ] o.a.z.s.NIOServerCnxn caught end of stream exception
   [junit4]   2> EndOfStreamException: Unable to read additional data from client sessionid 0x15a36eb5baf0003, likely client has closed socket
   [junit4]   2> 	at org.apache.zookeeper.server.NIOServerCnxn.doIO(NIOServerCnxn.java:228)
   [junit4]   2> 	at org.apache.zookeeper.server.NIOServerCnxnFactory.run(NIOServerCnxnFactory.java:208)
   [junit4]   2> 	at java.lang.Thread.run(Thread.java:745)
   [junit4]   2> 156825 INFO  (jetty-launcher-152-thread-1) [n:127.0.0.1:55955_solr    ] o.a.s.c.c.ConnectionManager Waiting for client to connect to ZooKeeper
   [junit4]   2> 156825 INFO  (jetty-launcher-152-thread-2) [n:127.0.0.1:55956_solr    ] o.a.s.c.c.ConnectionManager Waiting for client to connect to ZooKeeper
   [junit4]   2> 156828 INFO  (zkCallback-162-thread-1-processing-n:127.0.0.1:55955_solr) [n:127.0.0.1:55955_solr    ] o.a.s.c.c.ConnectionManager Watcher org.apache.solr.common.cloud.ConnectionManager@5a2625 name:ZooKeeperConnection Watcher:127.0.0.1:55951/solr got event WatchedEvent state:SyncConnected type:None path:null path:null type:None
   [junit4]   2> 156828 INFO  (jetty-launcher-152-thread-1) [n:127.0.0.1:55955_solr    ] o.a.s.c.c.ConnectionManager Client is connected to ZooKeeper
   [junit4]   2> 156828 INFO  (zkCallback-163-thread-1-processing-n:127.0.0.1:55956_solr) [n:127.0.0.1:55956_solr    ] o.a.s.c.c.ConnectionManager Watcher org.apache.solr.common.cloud.ConnectionManager@2af258 name:ZooKeeperConnection Watcher:127.0.0.1:55951/solr got event WatchedEvent state:SyncConnected type:None path:null path:null type:None
   [junit4]   2> 156829 INFO  (jetty-launcher-152-thread-2) [n:127.0.0.1:55956_solr    ] o.a.s.c.c.ConnectionManager Client is connected to ZooKeeper
   [junit4]   2> 156830 INFO  (jetty-launcher-152-thread-1) [n:127.0.0.1:55955_solr    ] o.a.s.c.c.SolrZkClient makePath: /overseer/queue
   [junit4]   2> 156831 INFO  (jetty-launcher-152-thread-2) [n:127.0.0.1:55956_solr    ] o.a.s.c.c.SolrZkClient makePath: /overseer/queue
   [junit4]   2> 156834 INFO  (jetty-launcher-152-thread-2) [n:127.0.0.1:55956_solr    ] o.a.s.c.c.SolrZkClient makePath: /overseer/collection-queue-work
   [junit4]   2> 156834 INFO  (jetty-launcher-152-thread-1) [n:127.0.0.1:55955_solr    ] o.a.s.c.c.SolrZkClient makePath: /overseer/collection-queue-work
   [junit4]   2> 156839 INFO  (jetty-launcher-152-thread-1) [n:127.0.0.1:55955_solr    ] o.a.s.c.c.SolrZkClient makePath: /overseer/collection-map-running
   [junit4]   2> 156839 INFO  (jetty-launcher-152-thread-2) [n:127.0.0.1:55956_solr    ] o.a.s.c.c.SolrZkClient makePath: /overseer/collection-map-running
   [junit4]   2> 156842 INFO  (jetty-launcher-152-thread-2) [n:127.0.0.1:55956_solr    ] o.a.s.c.c.SolrZkClient makePath: /overseer/collection-map-completed
   [junit4]   2> 156842 INFO  (jetty-launcher-152-thread-1) [n:127.0.0.1:55955_solr    ] o.a.s.c.c.SolrZkClient makePath: /overseer/collection-map-completed
   [junit4]   2> 156845 INFO  (jetty-launcher-152-thread-2) [n:127.0.0.1:55956_solr    ] o.a.s.c.c.SolrZkClient makePath: /overseer/collection-map-failure
   [junit4]   2> 156845 INFO  (jetty-launcher-152-thread-1) [n:127.0.0.1:55955_solr    ] o.a.s.c.c.SolrZkClient makePath: /overseer/collection-map-failure
   [junit4]   2> 156849 INFO  (jetty-launcher-152-thread-2) [n:127.0.0.1:55956_solr    ] o.a.s.c.c.SolrZkClient makePath: /live_nodes
   [junit4]   2> 156849 INFO  (jetty-launcher-152-thread-1) [n:127.0.0.1:55955_solr    ] o.a.s.c.c.SolrZkClient makePath: /live_nodes
   [junit4]   2> 156850 INFO  (jetty-launcher-152-thread-1) [n:127.0.0.1:55955_solr    ] o.a.s.c.c.SolrZkClient makePath: /collections
   [junit4]   2> 156851 INFO  (jetty-launcher-152-thread-2) [n:127.0.0.1:55956_solr    ] o.a.s.c.c.SolrZkClient makePath: /collections
   [junit4]   2> 156853 INFO  (jetty-launcher-152-thread-2) [n:127.0.0.1:55956_solr    ] o.a.s.c.c.SolrZkClient makePath: /aliases.json
   [junit4]   2> 156853 INFO  (jetty-launcher-152-thread-1) [n:127.0.0.1:55955_solr    ] o.a.s.c.c.SolrZkClient makePath: /aliases.json
   [junit4]   2> 156855 INFO  (jetty-launcher-152-thread-2) [n:127.0.0.1:55956_solr    ] o.a.s.c.c.SolrZkClient makePath: /clusterstate.json
   [junit4]   2> 156855 INFO  (jetty-launcher-152-thread-1) [n:127.0.0.1:55955_solr    ] o.a.s.c.c.SolrZkClient makePath: /clusterstate.json
   [junit4]   2> 156857 INFO  (jetty-launcher-152-thread-2) [n:127.0.0.1:55956_solr    ] o.a.s.c.c.SolrZkClient makePath: /security.json
   [junit4]   2> 156857 INFO  (jetty-launcher-152-thread-1) [n:127.0.0.1:55955_solr    ] o.a.s.c.c.SolrZkClient makePath: /security.json
   [junit4]   2> 156858 INFO  (jetty-launcher-152-thread-1) [n:127.0.0.1:55955_solr    ] o.a.s.c.ZkController Register node as live in ZooKeeper:/live_nodes/127.0.0.1:55955_solr
   [junit4]   2> 156858 INFO  (jetty-launcher-152-thread-2) [n:127.0.0.1:55956_solr    ] o.a.s.c.ZkController Register node as live in ZooKeeper:/live_nodes/127.0.0.1:55956_solr
   [junit4]   2> 156859 INFO  (jetty-launcher-152-thread-1) [n:127.0.0.1:55955_solr    ] o.a.s.c.c.SolrZkClient makePath: /live_nodes/127.0.0.1:55955_solr
   [junit4]   2> 156859 INFO  (jetty-launcher-152-thread-2) [n:127.0.0.1:55956_solr    ] o.a.s.c.c.SolrZkClient makePath: /live_nodes/127.0.0.1:55956_solr
   [junit4]   2> 156862 INFO  (jetty-launcher-152-thread-1) [n:127.0.0.1:55955_solr    ] o.a.s.c.c.SolrZkClient makePath: /overseer_elect
   [junit4]   2> 156862 INFO  (jetty-launcher-152-thread-2) [n:127.0.0.1:55956_solr    ] o.a.s.c.c.SolrZkClient makePath: /overseer_elect
   [junit4]   2> 156865 INFO  (jetty-launcher-152-thread-2) [n:127.0.0.1:55956_solr    ] o.a.s.c.c.SolrZkClient makePath: /overseer_elect/election
   [junit4]   2> 156865 INFO  (jetty-launcher-152-thread-1) [n:127.0.0.1:55955_solr    ] o.a.s.c.c.SolrZkClient makePath: /overseer_elect/election
   [junit4]   2> 156866 INFO  (jetty-launcher-152-thread-1) [n:127.0.0.1:55955_solr    ] o.a.s.c.Overseer Overseer (id=null) closing
   [junit4]   2> 156867 INFO  (jetty-launcher-152-thread-2) [n:127.0.0.1:55956_solr    ] o.a.s.c.Overseer Overseer (id=null) closing
   [junit4]   2> 156868 INFO  (jetty-launcher-152-thread-1) [n:127.0.0.1:55955_solr    ] o.a.s.c.LeaderElector Joined leadership election with path: /overseer_elect/election/97450726425296901-127.0.0.1:55955_solr-n_0000000000
   [junit4]   2> 156868 INFO  (jetty-launcher-152-thread-2) [n:127.0.0.1:55956_solr    ] o.a.s.c.LeaderElector Joined leadership election with path: /overseer_elect/election/97450726425296902-127.0.0.1:55956_solr-n_0000000001
   [junit4]   2> 156868 INFO  (jetty-launcher-152-thread-1) [n:127.0.0.1:55955_solr    ] o.a.s.c.OverseerElectionContext I am going to be the leader 127.0.0.1:55955_solr
   [junit4]   2> 156869 INFO  (jetty-launcher-152-thread-1) [n:127.0.0.1:55955_solr    ] o.a.s.c.c.SolrZkClient makePath: /overseer_elect/leader
   [junit4]   2> 156869 INFO  (jetty-launcher-152-thread-2) [n:127.0.0.1:55956_solr    ] o.a.s.c.LeaderElector Watching path /overseer_elect/election/97450726425296901-127.0.0.1:55955_solr-n_0000000000 to know if I could be the leader
   [junit4]   2> 156869 INFO  (jetty-launcher-152-thread-2) [n:127.0.0.1:55956_solr    ] o.a.s.c.c.ZkStateReader Updating cluster state from ZooKeeper... 
   [junit4]   2> 156871 INFO  (jetty-launcher-152-thread-1) [n:127.0.0.1:55955_solr    ] o.a.s.c.Overseer Overseer (id=97450726425296901-127.0.0.1:55955_solr-n_0000000000) starting
   [junit4]   2> 156874 INFO  (jetty-launcher-152-thread-1) [n:127.0.0.1:55955_solr    ] o.a.s.c.c.SolrZkClient makePath: /overseer/queue-work
   [junit4]   2> 156883 INFO  (jetty-launcher-152-thread-1) [n:127.0.0.1:55955_solr    ] o.a.s.c.OverseerAutoReplicaFailoverThread Starting OverseerAutoReplicaFailoverThread autoReplicaFailoverWorkLoopDelay=10000 autoReplicaFailoverWaitAfterExpiration=30000 autoReplicaFailoverBadNodeExpiration=60000
   [junit4]   2> 156883 INFO  (jetty-launcher-152-thread-1) [n:127.0.0.1:55955_solr    ] o.a.s.c.c.ZkStateReader Updating cluster state from ZooKeeper... 
   [junit4]   2> 156884 INFO  (OverseerCollectionConfigSetProcessor-97450726425296901-127.0.0.1:55955_solr-n_0000000000) [n:127.0.0.1:55955_solr    ] o.a.s.c.OverseerTaskProcessor Process current queue of overseer operations
   [junit4]   2> 156920 INFO  (jetty-launcher-152-thread-2) [n:127.0.0.1:55956_solr    ] o.a.s.c.CoreContainer Security conf doesn't exist. Skipping setup for authorization module.
   [junit4]   2> 156920 INFO  (jetty-launcher-152-thread-2) [n:127.0.0.1:55956_solr    ] o.a.s.c.CoreContainer No authentication plugin used.
   [junit4]   2> 156923 INFO  (jetty-launcher-152-thread-2) [n:127.0.0.1:55956_solr    ] o.a.s.c.CorePropertiesLocator Looking for core definitions underneath C:\Users\jenkins\workspace\Lucene-Solr-5.5-Windows\solr\build\solr-core\test\J1\temp\solr.schema.TestManagedSchemaAPI_C16B4632F6DB45A7-001\tempDir-001\node2\.
   [junit4]   2> 156925 INFO  (jetty-launcher-152-thread-2) [n:127.0.0.1:55956_solr    ] o.a.s.c.CorePropertiesLocator Found 0 core definitions
   [junit4]   2> 156926 INFO  (jetty-launcher-152-thread-2) [n:127.0.0.1:55956_solr    ] o.a.s.s.SolrDispatchFilter user.dir=C:\Users\jenkins\workspace\Lucene-Solr-5.5-Windows\solr\build\solr-core\test\J1
   [junit4]   2> 156928 INFO  (jetty-launcher-152-thread-2) [n:127.0.0.1:55956_solr    ] o.a.s.s.SolrDispatchFilter SolrDispatchFilter.init() done
   [junit4]   2> 156929 INFO  (OverseerStateUpdate-97450726425296901-127.0.0.1:55955_solr-n_0000000000) [n:127.0.0.1:55955_solr    ] o.a.s.c.Overseer Starting to work on the main queue
   [junit4]   2> 156968 INFO  (jetty-launcher-152-thread-1) [n:127.0.0.1:55955_solr    ] o.a.s.c.CoreContainer Security conf doesn't exist. Skipping setup for authorization module.
   [junit4]   2> 156968 INFO  (jetty-launcher-152-thread-1) [n:127.0.0.1:55955_solr    ] o.a.s.c.CoreContainer No authentication plugin used.
   [junit4]   2> 156969 INFO  (jetty-launcher-152-thread-1) [n:127.0.0.1:55955_solr    ] o.a.s.c.CorePropertiesLocator Looking for core definitions underneath C:\Users\jenkins\workspace\Lucene-Solr-5.5-Windows\solr\build\solr-core\test\J1\temp\solr.schema.TestManagedSchemaAPI_C16B4632F6DB45A7-001\tempDir-001\node1\.
   [junit4]   2> 156970 INFO  (jetty-launcher-152-thread-1) [n:127.0.0.1:55955_solr    ] o.a.s.c.CorePropertiesLocator Found 0 core definitions
   [junit4]   2> 156973 INFO  (jetty-launcher-152-thread-1) [n:127.0.0.1:55955_solr    ] o.a.s.s.SolrDispatchFilter user.dir=C:\Users\jenkins\workspace\Lucene-Solr-5.5-Windows\solr\build\solr-core\test\J1
   [junit4]   2> 156973 INFO  (jetty-launcher-152-thread-1) [n:127.0.0.1:55955_solr    ] o.a.s.s.SolrDispatchFilter SolrDispatchFilter.init() done
   [junit4]   2> 156973 INFO  (TEST-TestManagedSchemaAPI.test-seed#[C16B4632F6DB45A7]) [    ] o.a.s.c.c.SolrZkClient Using default ZkCredentialsProvider
   [junit4]   2> 156975 INFO  (TEST-TestManagedSchemaAPI.test-seed#[C16B4632F6DB45A7]) [    ] o.a.s.c.c.ConnectionManager Waiting for client to connect to ZooKeeper
   [junit4]   2> 156978 INFO  (zkCallback-164-thread-1) [    ] o.a.s.c.c.ConnectionManager Watcher org.apache.solr.common.cloud.ConnectionManager@17b491e name:ZooKeeperConnection Watcher:127.0.0.1:55951 got event WatchedEvent state:SyncConnected type:None path:null path:null type:None
   [junit4]   2> 156978 INFO  (TEST-TestManagedSchemaAPI.test-seed#[C16B4632F6DB45A7]) [    ] o.a.s.c.c.ConnectionManager Client is connected to ZooKeeper
   [junit4]   2> 156978 INFO  (TEST-TestManagedSchemaAPI.test-seed#[C16B4632F6DB45A7]) [    ] o.a.s.c.c.SolrZkClient Using default ZkACLProvider
   [junit4]   2> 156983 INFO  (TEST-TestManagedSchemaAPI.test-seed#[C16B4632F6DB45A7]) [    ] o.a.s.c.c.SolrZkClient Using default ZkCredentialsProvider
   [junit4]   2> 156984 INFO  (TEST-TestManagedSchemaAPI.test-seed#[C16B4632F6DB45A7]) [    ] o.a.s.c.c.ConnectionManager Waiting for client to connect to ZooKeeper
   [junit4]   2> 156989 INFO  (zkCallback-166-thread-1) [    ] o.a.s.c.c.ConnectionManager Watcher org.apache.solr.common.cloud.ConnectionManager@1e0a697 name:ZooKeeperConnection Watcher:127.0.0.1:55951/solr got event WatchedEvent state:SyncConnected type:None path:null path:null type:None
   [junit4]   2> 156989 INFO  (TEST-TestManagedSchemaAPI.test-seed#[C16B4632F6DB45A7]) [    ] o.a.s.c.c.ConnectionManager Client is connected to ZooKeeper
   [junit4]   2> 156989 INFO  (TEST-TestManagedSchemaAPI.test-seed#[C16B4632F6DB45A7]) [    ] o.a.s.c.c.SolrZkClient Using default ZkACLProvider
   [junit4]   2> 156990 INFO  (TEST-TestManagedSchemaAPI.test-seed#[C16B4632F6DB45A7]) [    ] o.a.s.c.c.SolrZkClient makePath: /configs/conf1/managed-schema
   [junit4]   2> 156998 INFO  (TEST-TestManagedSchemaAPI.test-seed#[C16B4632F6DB45A7]) [    ] o.a.s.c.c.SolrZkClient makePath: /configs/conf1/solrconfig.xml
   [junit4]   2> 157003 INFO  (TEST-TestManagedSchemaAPI.test-seed#[C16B4632F6DB45A7]) [    ] o.a.s.c.c.SolrZkClient Using default ZkCredentialsProvider
   [junit4]   2> 157004 INFO  (TEST-TestManagedSchemaAPI.test-seed#[C16B4632F6DB45A7]) [    ] o.a.s.c.c.ConnectionManager Waiting for client to connect to ZooKeeper
   [junit4]   2> 157007 INFO  (zkCallback-167-thread-1) [    ] o.a.s.c.c.ConnectionManager Watcher org.apache.solr.common.cloud.ConnectionManager@10e6676 name:ZooKeeperConnection Watcher:127.0.0.1:55951/solr got event WatchedEvent state:SyncConnected type:None path:null path:null type:None
   [junit4]   2> 157007 INFO  (TEST-TestManagedSchemaAPI.test-seed#[C16B4632F6DB45A7]) [    ] o.a.s.c.c.ConnectionManager Client is connected to ZooKeeper
   [junit4]   2> 157007 INFO  (TEST-TestManagedSchemaAPI.test-seed#[C16B4632F6DB45A7]) [    ] o.a.s.c.c.SolrZkClient Using default ZkACLProvider
   [junit4]   2> 157007 INFO  (TEST-TestManagedSchemaAPI.test-seed#[C16B4632F6DB45A7]) [    ] o.a.s.c.c.ZkStateReader Updating cluster state from ZooKeeper... 
   [junit4]   2> 157017 INFO  (qtp23823285-1027) [n:127.0.0.1:55955_solr    ] o.a.s.h.a.CollectionsHandler Invoked Collection Action :create with params wt=javabin&numShards=1&version=2&collection.configName=conf1&name=testschemaapi&action=CREATE&replicationFactor=2 and sendToOCPQueue=true
   [junit4]   2> 157021 INFO  (OverseerCollectionConfigSetProcessor-97450726425296901-127.0.0.1:55955_solr-n_0000000000) [n:127.0.0.1:55955_solr    ] o.a.s.c.OverseerTaskProcessor Overseer Collection Message Handler: Get the message id:/overseer/collection-queue-work/qn-0000000000 message:{
   [junit4]   2>   "name":"testschemaapi",
   [junit4]   2>   "fromApi":"true",
   [junit4]   2>   "replicationFactor":"2",
   [junit4]   2>   "collection.configName":"conf1",
   [junit4]   2>   "numShards":"1",
   [junit4]   2>   "stateFormat":"2",
   [junit4]   2>   "operation":"create"}
   [junit4]   2> 157022 INFO  (OverseerThreadFactory-554-thread-1-processing-n:127.0.0.1:55955_solr) [n:127.0.0.1:55955_solr    ] o.a.s.c.OverseerCollectionMessageHandler OverseerCollectionMessageHandler.processMessage : create , {
   [junit4]   2>   "name":"testschemaapi",
   [junit4]   2>   "fromApi":"true",
   [junit4]   2>   "replicationFactor":"2",
   [junit4]   2>   "collection.configName":"conf1",
   [junit4]   2>   "numShards":"1",
   [junit4]   2>   "stateFormat":"2",
   [junit4]   2>   "operation":"create"}
   [junit4]   2> 157024 INFO  (OverseerThreadFactory-554-thread-1-processing-n:127.0.0.1:55955_solr) [n:127.0.0.1:55955_solr    ] o.a.s.c.OverseerCollectionMessageHandler Create collection testschemaapi
   [junit4]   2> 157025 INFO  (OverseerThreadFactory-554-thread-1-processing-n:127.0.0.1:55955_solr) [n:127.0.0.1:55955_solr    ] o.a.s.c.OverseerCollectionMessageHandler creating collections conf node /collections/testschemaapi 
   [junit4]   2> 157025 INFO  (OverseerThreadFactory-554-thread-1-processing-n:127.0.0.1:55955_solr) [n:127.0.0.1:55955_solr    ] o.a.s.c.c.SolrZkClient makePath: /collections/testschemaapi
   [junit4]   2> 157028 INFO  (zkCallback-162-thread-1-processing-n:127.0.0.1:55955_solr) [n:127.0.0.1:55955_solr    ] o.a.s.c.c.ZkStateReader A collections change: [WatchedEvent state:SyncConnected type:NodeChildrenChanged path:/collections], has occurred - updating...
   [junit4]   2> 157028 INFO  (zkCallback-163-thread-1-processing-n:127.0.0.1:55956_solr) [n:127.0.0.1:55956_solr    ] o.a.s.c.c.ZkStateReader A collections change: [WatchedEvent state:SyncConnected type:NodeChildrenChanged path:/collections], has occurred - updating...
   [junit4]   2> 157028 INFO  (zkCallback-167-thread-1) [    ] o.a.s.c.c.ZkStateReader A collections change: [WatchedEvent state:SyncConnected type:NodeChildrenChanged path:/collections], has occurred - updating...
   [junit4]   2> 157033 INFO  (OverseerStateUpdate-97450726425296901-127.0.0.1:55955_solr-n_0000000000) [n:127.0.0.1:55955_solr    ] o.a.s.c.Overseer processMessage: queueSize: 1, message = {
   [junit4]   2>   "name":"testschemaapi",
   [junit4]   2>   "fromApi":"true",
   [junit4]   2>   "replicationFactor":"2",
   [junit4]   2>   "collection.configName":"conf1",
   [junit4]   2>   "numShards":"1",
   [junit4]   2>   "stateFormat":"2",
   [junit4]   2>   "operation":"create"} current state version: 0
   [junit4]   2> 157034 INFO  (OverseerStateUpdate-97450726425296901-127.0.0.1:55955_solr-n_0000000000) [n:127.0.0.1:55955_solr    ] o.a.s.c.o.ClusterStateMutator building a new cName: testschemaapi
   [junit4]   2> 157036 INFO  (OverseerStateUpdate-97450726425296901-127.0.0.1:55955_solr-n_0000000000) [n:127.0.0.1:55955_solr    ] o.a.s.c.o.ZkStateWriter going to create_collection /collections/testschemaapi/state.json
   [junit4]   2> 157133 INFO  (OverseerThreadFactory-554-thread-1-processing-n:127.0.0.1:55955_solr) [n:127.0.0.1:55955_solr    ] o.a.s.c.OverseerCollectionMessageHandler Creating SolrCores for new collection testschemaapi, shardNames [shard1] , replicationFactor : 2
   [junit4]   2> 157133 INFO  (OverseerThreadFactory-554-thread-1-processing-n:127.0.0.1:55955_solr) [n:127.0.0.1:55955_solr    ] o.a.s.c.OverseerCollectionMessageHandler Creating core testschemaapi_shard1_replica2 as part of shard shard1 of collection testschemaapi on 127.0.0.1:55955_solr
   [junit4]   2> 157133 INFO  (OverseerThreadFactory-554-thread-1-processing-n:127.0.0.1:55955_solr) [n:127.0.0.1:55955_solr    ] o.a.s.c.OverseerCollectionMessageHandler Creating core testschemaapi_shard1_replica1 as part of shard shard1 of collection testschemaapi on 127.0.0.1:55956_solr
   [junit4]   2> 157139 INFO  (qtp26476173-1028) [n:127.0.0.1:55956_solr    ] o.a.s.h.a.CoreAdminOperation core create command numShards=1&wt=javabin&collection.configName=conf1&version=2&shard=shard1&name=testschemaapi_shard1_replica1&qt=/admin/cores&action=CREATE&collection=testschemaapi
   [junit4]   2> 157139 INFO  (qtp23823285-1030) [n:127.0.0.1:55955_solr    ] o.a.s.h.a.CoreAdminOperation core create command numShards=1&wt=javabin&collection.configName=conf1&version=2&shard=shard1&name=testschemaapi_shard1_replica2&qt=/admin/cores&action=CREATE&collection=testschemaapi
   [junit4]   2> 157143 INFO  (qtp23823285-1030) [n:127.0.0.1:55955_solr    ] o.a.s.c.CoreDescriptor Created CoreDescriptor: {collection.configName=conf1, name=testschemaapi_shard1_replica2, configSetProperties=configsetprops.json, shard=shard1, collection=testschemaapi, transient=false, dataDir=data\, numShards=1, loadOnStartup=true, config=solrconfig.xml, schema=schema.xml}
   [junit4]   2> 157143 INFO  (qtp26476173-1028) [n:127.0.0.1:55956_solr    ] o.a.s.c.CoreDescriptor Created CoreDescriptor: {collection=testschemaapi, name=testschemaapi_shard1_replica1, schema=schema.xml, numShards=1, loadOnStartup=true, configSetProperties=configsetprops.json, transient=false, shard=shard1, config=solrconfig.xml, collection.configName=conf1, dataDir=data\}
   [junit4]   2> 157146 INFO  (qtp23823285-1030) [n:127.0.0.1:55955_solr c:testschemaapi s:shard1  x:testschemaapi_shard1_replica2] o.a.s.c.ZkController publishing state=down
   [junit4]   2> 157147 INFO  (qtp26476173-1028) [n:127.0.0.1:55956_solr c:testschemaapi s:shard1  x:testschemaapi_shard1_replica1] o.a.s.c.ZkController publishing state=down
   [junit4]   2> 157150 INFO  (qtp23823285-1030) [n:127.0.0.1:55955_solr c:testschemaapi s:shard1  x:testschemaapi_shard1_replica2] o.a.s.c.ZkController Registering watch for collection testschemaapi
   [junit4]   2> 157150 INFO  (qtp23823285-1030) [n:127.0.0.1:55955_solr c:testschemaapi s:shard1  x:testschemaapi_shard1_replica2] o.a.s.c.c.ZkStateReader addZkWatch [testschemaapi]
   [junit4]   2> 157150 INFO  (qtp26476173-1028) [n:127.0.0.1:55956_solr c:testschemaapi s:shard1  x:testschemaapi_shard1_replica1] o.a.s.c.ZkController Registering watch for collection testschemaapi
   [junit4]   2> 157150 INFO  (qtp26476173-1028) [n:127.0.0.1:55956_solr c:testschemaapi s:shard1  x:testschemaapi_shard1_replica1] o.a.s.c.c.ZkStateReader addZkWatch [testschemaapi]
   [junit4]   2> 157151 INFO  (OverseerStateUpdate-97450726425296901-127.0.0.1:55955_solr-n_0000000000) [n:127.0.0.1:55955_solr    ] o.a.s.c.Overseer processMessage: queueSize: 2, message = {
   [junit4]   2>   "numShards":"1",
   [junit4]   2>   "node_name":"127.0.0.1:55955_solr",
   [junit4]   2>   "shard":"shard1",
   [junit4]   2>   "core":"testschemaapi_shard1_replica2",
   [junit4]   2>   "operation":"state",
   [junit4]   2>   "roles":null,
   [junit4]   2>   "collection":"testschemaapi",
   [junit4]   2>   "base_url":"http://127.0.0.1:55955/solr",
   [junit4]   2>   "state":"down"} current state version: 0
   [junit4]   2> 157151 INFO  (qtp23823285-1030) [n:127.0.0.1:55955_solr c:testschemaapi s:shard1  x:testschemaapi_shard1_replica2] o.a.s.c.c.ZkStateReader Add data for [testschemaapi] ver [0]
   [junit4]   2> 157151 INFO  (qtp23823285-1030) [n:127.0.0.1:55955_solr c:testschemaapi s:shard1  x:testschemaapi_shard1_replica2] o.a.s.c.ZkController look for our core node name
   [junit4]   2> 157151 INFO  (qtp26476173-1028) [n:127.0.0.1:55956_solr c:testschemaapi s:shard1  x:testschemaapi_shard1_replica1] o.a.s.c.c.ZkStateReader Add data for [testschemaapi] ver [0]
   [junit4]   2> 157153 INFO  (qtp26476173-1028) [n:127.0.0.1:55956_solr c:testschemaapi s:shard1  x:testschemaapi_shard1_replica1] o.a.s.c.ZkController look for our core node name
   [junit4]   2> 157153 INFO  (OverseerStateUpdate-97450726425296901-127.0.0.1:55955_solr-n_0000000000) [n:127.0.0.1:55955_solr    ] o.a.s.c.o.ReplicaMutator Update state numShards=1 message={
   [junit4]   2>   "numShards":"1",
   [junit4]   2>   "node_name":"127.0.0.1:55955_solr",
   [junit4]   2>   "shard":"shard1",
   [junit4]   2>   "core":"testschemaapi_shard1_replica2",
   [junit4]   2>   "operation":"state",
   [junit4]   2>   "roles":null,
   [junit4]   2>   "collection":"testschemaapi",
   [junit4]   2>   "base_url":"http://127.0.0.1:55955/solr",
   [junit4]   2>   "state":"down"}
   [junit4]   2> 157157 INFO  (OverseerStateUpdate-97450726425296901-127.0.0.1:55955_solr-n_0000000000) [n:127.0.0.1:55955_solr    ] o.a.s.c.Overseer processMessage: queueSize: 1, message = {
   [junit4]   2>   "numShards":"1",
   [junit4]   2>   "node_name":"127.0.0.1:55956_solr",
   [junit4]   2>   "shard":"shard1",
   [junit4]   2>   "core":"testschemaapi_shard1_replica1",
   [junit4]   2>   "operation":"state",
   [junit4]   2>   "roles":null,
   [junit4]   2>   "collection":"testschemaapi",
   [junit4]   2>   "base_url":"http://127.0.0.1:55956/solr",
   [junit4]   2>   "state":"down"} current state version: 0
   [junit4]   2> 157158 INFO  (OverseerStateUpdate-97450726425296901-127.0.0.1:55955_solr-n_0000000000) [n:127.0.0.1:55955_solr    ] o.a.s.c.o.ReplicaMutator Update state numShards=1 message={
   [junit4]   2>   "numShards":"1",
   [junit4]   2>   "node_name":"127.0.0.1:55956_solr",
   [junit4]   2>   "shard":"shard1",
   [junit4]   2>   "core":"testschemaapi_shard1_replica1",
   [junit4]   2>   "operation":"state",
   [junit4]   2>   "roles":null,
   [junit4]   2>   "collection":"testschemaapi",
   [junit4]   2>   "base_url":"http://127.0.0.1:55956/solr",
   [junit4]   2>   "state":"down"}
   [junit4]   2> 157262 INFO  (OverseerStateUpdate-97450726425296901-127.0.0.1:55955_solr-n_0000000000) [n:127.0.0.1:55955_solr    ] o.a.s.c.o.ZkStateWriter going to update_collection /collections/testschemaapi/state.json version: 0
   [junit4]   2> 157263 INFO  (zkCallback-162-thread-2-processing-n:127.0.0.1:55955_solr) [n:127.0.0.1:55955_solr    ] o.a.s.c.c.ZkStateReader A cluster state change: [WatchedEvent state:SyncConnected type:NodeDataChanged path:/collections/testschemaapi/state.json] for collection [testschemaapi] has occurred - updating... (live nodes size: [2])
   [junit4]   2> 157263 INFO  (zkCallback-163-thread-1-processing-n:127.0.0.1:55956_solr) [n:127.0.0.1:55956_solr    ] o.a.s.c.c.ZkStateReader A cluster state change: [WatchedEvent state:SyncConnected type:NodeDataChanged path:/collections/testschemaapi/state.json] for collection [testschemaapi] has occurred - updating... (live nodes size: [2])
   [junit4]   2> 157264 INFO  (zkCallback-162-thread-2-processing-n:127.0.0.1:55955_solr) [n:127.0.0.1:55955_solr    ] o.a.s.c.c.ZkStateReader Updating data for [testschemaapi] from [0] to [1]
   [junit4]   2> 157264 INFO  (zkCallback-163-thread-1-processing-n:127.0.0.1:55956_solr) [n:127.0.0.1:55956_solr    ] o.a.s.c.c.ZkStateReader Updating data for [testschemaapi] from [0] to [1]
   [junit4]   2> 158152 INFO  (qtp23823285-1030) [n:127.0.0.1:55955_solr c:testschemaapi s:shard1  x:testschemaapi_shard1_replica2] o.a.s.c.ZkController waiting to find shard id in clusterstate for testschemaapi_shard1_replica2
   [junit4]   2> 158152 INFO  (qtp23823285-1030) [n:127.0.0.1:55955_solr c:testschemaapi s:shard1  x:testschemaapi_shard1_replica2] o.a.s.c.ZkController Check for collection zkNode:testschemaapi
   [junit4]   2> 158153 INFO  (qtp23823285-1030) [n:127.0.0.1:55955_solr c:testschemaapi s:shard1  x:testschemaapi_shard1_replica2] o.a.s.c.ZkController Collection zkNode exists
   [junit4]   2> 158153 INFO  (qtp23823285-1030) [n:127.0.0.1:55955_solr c:testschemaapi s:shard1  x:testschemaapi_shard1_replica2] o.a.s.c.c.ZkStateReader Load collection config from: [/collections/testschemaapi]
   [junit4]   2> 158154 INFO  (qtp26476173-1028) [n:127.0.0.1:55956_solr c:testschemaapi s:shard1  x:testschemaapi_shard1_replica1] o.a.s.c.ZkController waiting to find shard id in clusterstate for testschemaapi_shard1_replica1
   [junit4]   2> 158154 INFO  (qtp26476173-1028) [n:127.0.0.1:55956_solr c:testschemaapi s:shard1  x:testschemaapi_shard1_replica1] o.a.s.c.ZkController Check for collection zkNode:testschemaapi
   [junit4]   2> 158154 INFO  (qtp23823285-1030) [n:127.0.0.1:55955_solr c:testschemaapi s:shard1  x:testschemaapi_shard1_replica2] o.a.s.c.c.ZkStateReader path=[/collections/testschemaapi] [configName]=[conf1] specified config exists in ZooKeeper
   [junit4]   2> 158154 INFO  (qtp23823285-1030) [n:127.0.0.1:55955_solr c:testschemaapi s:shard1  x:testschemaapi_shard1_replica2] o.a.s.c.SolrResourceLoader new SolrResourceLoader for directory: 'C:\Users\jenkins\workspace\Lucene-Solr-5.5-Windows\solr\build\solr-core\test\J1\temp\solr.schema.TestManagedSchemaAPI_C16B4632F6DB45A7-001\tempDir-001\node1\testschemaapi_shard1_replica2'
   [junit4]   2> 158154 INFO  (qtp23823285-1030) [n:127.0.0.1:55955_solr c:testschemaapi s:shard1  x:testschemaapi_shard1_replica2] o.a.s.c.SolrResourceLoader JNDI not configured for solr (NoInitialContextEx)
   [junit4]   2> 158154 INFO  (qtp23823285-1030) [n:127.0.0.1:55955_solr c:testschemaapi s:shard1  x:testschemaapi_shard1_replica2] o.a.s.c.SolrResourceLoader solr home defaulted to 'solr/' (could not find system property or JNDI)
   [junit4]   2> 158155 INFO  (qtp26476173-1028) [n:127.0.0.1:55956_solr c:testschemaapi s:shard1  x:testschemaapi_shard1_replica1] o.a.s.c.ZkController Collection zkNode exists
   [junit4]   2> 158155 INFO  (qtp26476173-1028) [n:127.0.0.1:55956_solr c:testschemaapi s:shard1  x:testschemaapi_shard1_replica1] o.a.s.c.c.ZkStateReader Load collection config from: [/collections/testschemaapi]
   [junit4]   2> 158157 INFO  (qtp26476173-1028) [n:127.0.0.1:55956_solr c:testschemaapi s:shard1  x:testschemaapi_shard1_replica1] o.a.s.c.c.ZkStateReader path=[/collections/testschemaapi] [configName]=[conf1] specified config exists in ZooKeeper
   [junit4]   2> 158157 INFO  (qtp26476173-1028) [n:127.0.0.1:55956_solr c:testschemaapi s:shard1  x:testschemaapi_shard1_replica1] o.a.s.c.SolrResourceLoader new SolrResourceLoader for directory: 'C:\Users\jenkins\workspace\Lucene-Solr-5.5-Windows\solr\build\solr-core\test\J1\temp\solr.schema.TestManagedSchemaAPI_C16B4632F6DB45A7-001\tempDir-001\node2\testschemaapi_shard1_replica1'
   [junit4]   2> 158157 INFO  (qtp26476173-1028) [n:127.0.0.1:55956_solr c:testschemaapi s:shard1  x:testschemaapi_shard1_replica1] o.a.s.c.SolrResourceLoader JNDI not configured for solr (NoInitialContextEx)
   [junit4]   2> 158157 INFO  (qtp26476173-1028) [n:127.0.0.1:55956_solr c:testschemaapi s:shard1  x:testschemaapi_shard1_replica1] o.a.s.c.SolrResourceLoader solr home defaulted to 'solr/' (could not find system property or JNDI)
   [junit4]   2> 158158 INFO  (qtp23823285-1030) [n:127.0.0.1:55955_solr c:testschemaapi s:shard1  x:testschemaapi_shard1_replica2] o.a.s.c.Config loaded config solrconfig.xml with version 0 
   [junit4]   2> 158161 INFO  (qtp26476173-1028) [n:127.0.0.1:55956_solr c:testschemaapi s:shard1  x:testschemaapi_shard1_replica1] o.a.s.c.Config loaded config solrconfig.xml with version 0 
   [junit4]   2> 158169 INFO  (qtp23823285-1030) [n:127.0.0.1:55955_solr c:testschemaapi s:shard1  x:testschemaapi_shard1_replica2] o.a.s.c.SolrConfig current version of requestparams : -1
   [junit4]   2> 158169 INFO  (qtp26476173-1028) [n:127.0.0.1:55956_solr c:testschemaapi s:shard1  x:testschemaapi_shard1_replica1] o.a.s.c.SolrConfig current version of requestparams : -1
   [junit4]   2> 158187 INFO  (qtp26476173-1028) [n:127.0.0.1:55956_solr c:testschemaapi s:shard1  x:testschemaapi_shard1_replica1] o.a.s.c.SolrConfig Using Lucene MatchVersion: 5.5.4
   [junit4]   2> 158187 INFO  (qtp23823285-1030) [n:127.0.0.1:55955_solr c:testschemaapi s:shard1  x:testschemaapi_shard1_replica2] o.a.s.c.SolrConfig Using Lucene MatchVersion: 5.5.4
   [junit4]   2> 158226 INFO  (qtp23823285-1030) [n:127.0.0.1:55955_solr c:testschemaapi s:shard1  x:testschemaapi_shard1_replica2] o.a.s.c.SolrConfig Loaded SolrConfig: solrconfig.xml
   [junit4]   2> 158227 INFO  (qtp26476173-1028) [n:127.0.0.1:55956_solr c:testschemaapi s:shard1  x:testschemaapi_shard1_replica1] o.a.s.c.SolrConfig Loaded SolrConfig: solrconfig.xml
   [junit4]   2> 158270 INFO  (qtp26476173-1028) [n:127.0.0.1:55956_solr c:testschemaapi s:shard1  x:testschemaapi_shard1_replica1] o.a.s.s.IndexSchema [testschemaapi_shard1_replica1] Schema name=minimal
   [junit4]   2> 158270 INFO  (qtp23823285-1030) [n:127.0.0.1:55955_solr c:testschemaapi s:shard1  x:testschemaapi_shard1_replica2] o.a.s.s.IndexSchema [testschemaapi_shard1_replica2] Schema name=minimal
   [junit4]   2> 158291 INFO  (qtp23823285-1030) [n:127.0.0.1:55955_solr c:testschemaapi s:shard1  x:testschemaapi_shard1_replica2] o.a.s.s.IndexSchema unique key field: id
   [junit4]   2> 158292 INFO  (qtp26476173-1028) [n:127.0.0.1:55956_solr c:testschemaapi s:shard1  x:testschemaapi_shard1_replica1] o.a.s.s.IndexSchema unique key field: id
   [junit4]   2> 158299 INFO  (qtp23823285-1030) [n:127.0.0.1:55955_solr c:testschemaapi s:shard1  x:testschemaapi_shard1_replica2] o.a.s.c.ConfigSetProperties Did not find ConfigSet properties, assuming default properties: Can't find resource 'configsetprops.json' in classpath or '/configs/conf1', cwd=C:\Users\jenkins\workspace\Lucene-Solr-5.5-Windows\solr\build\solr-core\test\J1
   [junit4]   2> 158299 INFO  (qtp23823285-1030) [n:127.0.0.1:55955_solr c:testschemaapi s:shard1  x:testschemaapi_shard1_replica2] o.a.s.c.CoreContainer Creating SolrCore 'testschemaapi_shard1_replica2' using configuration from collection testschemaapi
   [junit4]   2> 158300 INFO  (qtp23823285-1030) [n:127.0.0.1:55955_solr c:testschemaapi s:shard1 r:core_node1 x:testschemaapi_shard1_replica2] o.a.s.c.SolrCore org.apache.solr.core.MockDirectoryFactory
   [junit4]   2> 158300 INFO  (qtp23823285-1030) [n:127.0.0.1:55955_solr c:testschemaapi s:shard1 r:core_node1 x:testschemaapi_shard1_replica2] o.a.s.c.SolrCore [[testschemaapi_shard1_replica2] ] Opening new SolrCore at [C:\Users\jenkins\workspace\Lucene-Solr-5.5-Windows\solr\build\solr-core\test\J1\temp\solr.schema.TestManagedSchemaAPI_C16B4632F6DB45A7-001\tempDir-001\node1\testschemaapi_shard1_replica2], dataDir=[C:\Users\jenkins\workspace\Lucene-Solr-5.5-Windows\solr\build\solr-core\test\J1\temp\solr.schema.TestManagedSchemaAPI_C16B4632F6DB45A7-001\tempDir-001\node1\.\testschemaapi_shard1_replica2\data\]
   [junit4]   2> 158300 INFO  (qtp23823285-1030) [n:127.0.0.1:55955_solr c:testschemaapi s:shard1 r:core_node1 x:testschemaapi_shard1_replica2] o.a.s.c.SolrCore JMX monitoring not detected for core: testschemaapi_shard1_replica2
   [junit4]   2> 158300 INFO  (qtp23823285-1030) [n:127.0.0.1:55955_solr c:testschemaapi s:shard1 r:core_node1 x:testschemaapi_shard1_replica2] o.a.s.c.CachingDirectoryFactory return new directory for C:\Users\jenkins\workspace\Lucene-Solr-5.5-Windows\solr\build\solr-core\test\J1\temp\solr.schema.TestManagedSchemaAPI_C16B4632F6DB45A7-001\tempDir-001\node1\.\testschemaapi_shard1_replica2\data\
   [junit4]   2> 158300 INFO  (qtp26476173-1028) [n:127.0.0.1:55956_solr c:testschemaapi s:shard1  x:testschemaapi_shard1_replica1] o.a.s.c.ConfigSetProperties Did not find ConfigSet properties, assuming default properties: Can't find resource 'configsetprops.json' in classpath or '/configs/conf1', cwd=C:\Users\jenkins\workspace\Lucene-Solr-5.5-Windows\solr\build\solr-core\test\J1
   [junit4]   2> 158301 INFO  (qtp26476173-1028) [n:127.0.0.1:55956_solr c:testschemaapi s:shard1  x:testschemaapi_shard1_replica1] o.a.s.c.CoreContainer Creating SolrCore 'testschemaapi_shard1_replica1' using configuration from collection testschemaapi
   [junit4]   2> 158301 INFO  (qtp26476173-1028) [n:127.0.0.1:55956_solr c:testschemaapi s:shard1 r:core_node2 x:testschemaapi_shard1_replica1] o.a.s.c.SolrCore org.apache.solr.core.MockDirectoryFactory
   [junit4]   2> 158301 INFO  (qtp26476173-1028) [n:127.0.0.1:55956_solr c:testschemaapi s:shard1 r:core_node2 x:testschemaapi_shard1_replica1] o.a.s.c.SolrCore [[testschemaapi_shard1_replica1] ] Opening new SolrCore at [C:\Users\jenkins\workspace\Lucene-Solr-5.5-Windows\solr\build\solr-core\test\J1\temp\solr.schema.TestManagedSchemaAPI_C16B4632F6DB45A7-001\tempDir-001\node2\testschemaapi_shard1_replica1], dataDir=[C:\Users\jenkins\workspace\Lucene-Solr-5.5-Windows\solr\build\solr-core\test\J1\temp\solr.schema.TestManagedSchemaAPI_C16B4632F6DB45A7-001\tempDir-001\node2\.\testschemaapi_shard1_replica1\data\]
   [junit4]   2> 158301 INFO  (qtp26476173-1028) [n:127.0.0.1:55956_solr c:testschemaapi s:shard1 r:core_node2 x:testschemaapi_shard1_replica1] o.a.s.c.SolrCore JMX monitoring not detected for core: testschemaapi_shard1_replica1
   [junit4]   2> 158302 INFO  (qtp26476173-1028) [n:127.0.0.1:55956_solr c:testschemaapi s:shard1 r:core_node2 x:testschemaapi_shard1_replica1] o.a.s.c.CachingDirectoryFactory return new directory for C:\Users\jenkins\workspace\Lucene-Solr-5.5-Windows\solr\build\solr-core\test\J1\temp\solr.schema.TestManagedSchemaAPI_C16B4632F6DB45A7-001\tempDir-001\node2\.\testschemaapi_shard1_replica1\data\
   [junit4]   2> 158303 INFO  (qtp23823285-1030) [n:127.0.0.1:55955_solr c:testschemaapi s:shard1 r:core_node1 x:testschemaapi_shard1_replica2] o.a.s.c.SolrCore New index directory detected: old=null new=C:\Users\jenkins\workspace\Lucene-Solr-5.5-Windows\solr\build\solr-core\test\J1\temp\solr.schema.TestManagedSchemaAPI_C16B4632F6DB45A7-001\tempDir-001\node1\.\testschemaapi_shard1_replica2\data\index/
   [junit4]   2> 158303 WARN  (qtp23823285-1030) [n:127.0.0.1:55955_solr c:testschemaapi s:shard1 r:core_node1 x:testschemaapi_shard1_replica2] o.a.s.c.SolrCore [testschemaapi_shard1_replica2] Solr index directory 'C:\Users\jenkins\workspace\Lucene-Solr-5.5-Windows\solr\build\solr-core\test\J1\temp\solr.schema.TestManagedSchemaAPI_C16B4632F6DB45A7-001\tempDir-001\node1\.\testschemaapi_shard1_replica2\data\index' doesn't exist. Creating new index...
   [junit4]   2> 158303 INFO  (qtp26476173-1028) [n:127.0.0.1:55956_solr c:testschemaapi s:shard1 r:core_node2 x:testschemaapi_shard1_replica1] o.a.s.c.SolrCore New index directory detected: old=null new=C:\Users\jenkins\workspace\Lucene-Solr-5.5-Windows\solr\build\solr-core\test\J1\temp\solr.schema.TestManagedSchemaAPI_C16B4632F6DB45A7-001\tempDir-001\node2\.\testschemaapi_shard1_replica1\data\index/
   [junit4]   2> 158303 WARN  (qtp26476173-1028) [n:127.0.0.1:55956_solr c:testschemaapi s:shard1 r:core_node2 x:testschemaapi_shard1_replica1] o.a.s.c.SolrCore [testschemaapi_shard1_replica1] Solr index directory 'C:\Users\jenkins\workspace\Lucene-Solr-5.5-Windows\solr\build\solr-core\test\J1\temp\solr.schema.TestManagedSchemaAPI_C16B4632F6DB45A7-001\tempDir-001\node2\.\testschemaapi_shard1_replica1\data\index' doesn't exist. Creating new index...
   [junit4]   2> 158303 INFO  (qtp23823285-1030) [n:127.0.0.1:55955_solr c:testschemaapi s:shard1 r:core_node1 x:testschemaapi_shard1_replica2] o.a.s.c.CachingDirectoryFactory return new directory for C:\Users\jenkins\workspace\Lucene-Solr-5.5-Windows\solr\build\solr-core\test\J1\temp\solr.schema.TestManagedSchemaAPI_C16B4632F6DB45A7-001\tempDir-001\node1\.\testschemaapi_shard1_replica2\data\index
   [junit4]   2> 158303 INFO  (qtp26476173-1028) [n:127.0.0.1:55956_solr c:testschemaapi s:shard1 r:core_node2 x:testschemaapi_shard1_replica1] o.a.s.c.CachingDirectoryFactory return new directory for C:\Users\jenkins\workspace\Lucene-Solr-5.5-Windows\solr\build\solr-core\test\J1\temp\solr.schema.TestManagedSchemaAPI_C16B4632F6DB45A7-001\tempDir-001\node2\.\testschemaapi_shard1_replica1\data\index
   [junit4]   2> 158304 INFO  (qtp23823285-1030) [n:127.0.0.1:55955_solr c:testschemaapi s:shard1 r:core_node1 x:testschemaapi_shard1_replica2] o.a.s.c.SolrDeletionPolicy SolrDeletionPolicy.onCommit: commits: num=1
   [junit4]   2> 	commit{dir=MockDirectoryWrapper(RAMDirectory@bf1589 lockFactory=org.apache.lucene.store.SingleInstanceLockFactory@8ad086),segFN=segments_1,generation=1}
   [junit4]   2> 158304 INFO  (qtp23823285-1030) [n:127.0.0.1:55955_solr c:testschemaapi s:shard1 r:core_node1 x:testschemaapi_shard1_replica2] o.a.s.c.SolrDeletionPolicy newest commit generation = 1
   [junit4]   2> 158304 INFO  (qtp26476173-1028) [n:127.0.0.1:55956_solr c:testschemaapi s:shard1 r:core_node2 x:testschemaapi_shard1_replica1] o.a.s.c.SolrDeletionPolicy SolrDeletionPolicy.onCommit: commits: num=1
   [junit4]   2> 	commit{dir=MockDirectoryWrapper(RAMDirectory@11f090b lockFactory=org.apache.lucene.store.SingleInstanceLockFactory@1802e84),segFN=segments_1,generation=1}
   [junit4]   2> 158305 INFO  (qtp26476173-1028) [n:127.0.0.1:55956_solr c:testschemaapi s:shard1 r:core_node2 x:testschemaapi_shard1_replica1] o.a.s.c.SolrDeletionPolicy newest commit generation = 1
   [junit4]   2> 158306 INFO  (qtp23823285-1030) [n:127.0.0.1:55955_solr c:testschemaapi s:shard1 r:core_node1 x:testschemaapi_shard1_replica2] o.a.s.c.SolrCore no updateRequestProcessorChain defined as default, creating implicit default
   [junit4]   2> 158306 INFO  (qtp26476173-1028) [n:127.0.0.1:55956_solr c:testschemaapi s:shard1 r:core_node2 x:testschemaapi_shard1_replica1] o.a.s.c.SolrCore no updateRequestProcessorChain defined as default, creating implicit default
   [junit4]   2> 158309 INFO  (OldIndexDirectoryCleanupThreadForCore-testschemaapi_shard1_replica1) [n:127.0.0.1:55956_solr c:testschemaapi s:shard1 r:core_node2 x:testschemaapi_shard1_replica1] o.a.s.c.SolrCore Looking for old index directories to cleanup for core testschemaapi_shard1_replica1 in C:\Users\jenkins\workspace\Lucene-Solr-5.5-Windows\solr\build\solr-core\test\J1\temp\solr.schema.TestManagedSchemaAPI_C16B4632F6DB45A7-001\tempDir-001\node2\.\testschemaapi_shard1_replica1\data\
   [junit4]   2> 158309 INFO  (OldIndexDirectoryCleanupThreadForCore-testschemaapi_shard1_replica2) [n:127.0.0.1:55955_solr c:testschemaapi s:shard1 r:core_node1 x:testschemaapi_shard1_replica2] o.a.s.c.SolrCore Looking for old index directories to cleanup for core testschemaapi_shard1_replica2 in C:\Users\jenkins\workspace\Lucene-Solr-5.5-Windows\solr\build\solr-core\test\J1\temp\solr.schema.TestManagedSchemaAPI_C16B4632F6DB45A7-001\tempDir-001\node1\.\testschemaapi_shard1_replica2\data\
   [junit4]   2> 158310 WARN  (OldIndexDirectoryCleanupThreadForCore-testschemaapi_shard1_replica2) [n:127.0.0.1:55955_solr c:testschemaapi s:shard1 r:core_node1 x:testschemaapi_shard1_replica2] o.a.s.c.DirectoryFactory C:\Users\jenkins\workspace\Lucene-Solr-5.5-Windows\solr\build\solr-core\test\J1\temp\solr.schema.TestManagedSchemaAPI_C16B4632F6DB45A7-001\tempDir-001\node1\.\testschemaapi_shard1_replica2\data\ does not point to a valid data directory; skipping clean-up of old index directories.
   [junit4]   2> 158312 WARN  (OldIndexDirectoryCleanupThreadForCore-testschemaapi_shard1_replica1) [n:127.0.0.1:55956_solr c:testschemaapi s:shard1 r:core_node2 x:testschemaapi_shard1_replica1] o.a.s.c.DirectoryFactory C:\Users\jenkins\workspace\Lucene-Solr-5.5-Windows\solr\build\solr-core\test\J1\temp\solr.schema.TestManagedSchemaAPI_C16B4632F6DB45A7-001\tempDir-001\node2\.\testschemaapi_shard1_replica1\data\ does not point to a valid data directory; skipping clean-up of old index directories.
   [junit4]   2> 158320 INFO  (qtp26476173-1028) [n:127.0.0.1:55956_solr c:testschemaapi s:shard1 r:core_node2 x:testschemaapi_shard1_replica1] o.a.s.h.l.XMLLoader xsltCacheLifetimeSeconds=60
   [junit4]   2> 158320 INFO  (qtp23823285-1030) [n:127.0.0.1:55955_solr c:testschemaapi s:shard1 r:core_node1 x:testschemaapi_shard1_replica2] o.a.s.h.l.XMLLoader xsltCacheLifetimeSeconds=60
   [junit4]   2> 158323 INFO  (qtp23823285-1030) [n:127.0.0.1:55955_solr c:testschemaapi s:shard1 r:core_node1 x:testschemaapi_shard1_replica2] o.a.s.h.l.XMLLoader xsltCacheLifetimeSeconds=60
   [junit4]   2> 158323 INFO  (qtp26476173-1028) [n:127.0.0.1:55956_solr c:testschemaapi s:shard1 r:core_node2 x:testschemaapi_shard1_replica1] o.a.s.h.l.XMLLoader xsltCacheLifetimeSeconds=60
   [junit4]   2> 158325 INFO  (qtp23823285-1030) [n:127.0.0.1:55955_solr c:testschemaapi s:shard1 r:core_node1 x:testschemaapi_shard1_replica2] o.a.s.h.l.XMLLoader xsltCacheLifetimeSeconds=60
   [junit4]   2> 158325 INFO  (qtp26476173-1028) [n:127.0.0.1:55956_solr c:testschemaapi s:shard1 r:core_node2 x:testschemaapi_shard1_replica1] o.a.s.h.l.XMLLoader xsltCacheLifetimeSeconds=60
   [junit4]   2> 158327 INFO  (qtp26476173-1028) [n:127.0.0.1:55956_solr c:testschemaapi s:shard1 r:core_node2 x:testschemaapi_shard1_replica1] o.a.s.h.l.XMLLoader xsltCacheLifetimeSeconds=60
   [junit4]   2> 158327 INFO  (qtp23823285-1030) [n:127.0.0.1:55955_solr c:testschemaapi s:shard1 r:core_node1 x:testschemaapi_shard1_replica2] o.a.s.h.l.XMLLoader xsltCacheLifetimeSeconds=60
   [junit4]   2> 158329 INFO  (qtp26476173-1028) [n:127.0.0.1:55956_solr c:testschemaapi s:shard1 r:core_node2 x:testschemaapi_shard1_replica1] o.a.s.c.RequestHandlers Registered paths: /admin/plugins,/update,/get,/admin/system,/admin/properties,/admin/mbeans,/update/csv,/admin/luke,/update/json,/admin/segments,/schema,/select,/admin/file,/config,/admin/logging,/admin/threads,/replication,/admin/ping,/update/json/docs
   [junit4]   2> 158329 INFO  (qtp23823285-1030) [n:127.0.0.1:55955_solr c:testschemaapi s:shard1 r:core_node1 x:testschemaapi_shard1_replica2] o.a.s.c.RequestHandlers Registered paths: /admin/plugins,/update,/get,/admin/system,/admin/properties,/admin/mbeans,/update/csv,/admin/luke,/update/json,/admin/segments,/schema,/select,/admin/file,/config,/admin/logging,/admin/threads,/replication,/admin/ping,/update/json/docs
   [junit4]   2> 158331 INFO  (qtp26476173-1028) [n:127.0.0.1:55956_solr c:testschemaapi s:shard1 r:core_node2 x:testschemaapi_shard1_replica1] o.a.s.c.SolrCore Using default statsCache cache: org.apache.solr.search.stats.LocalStatsCache
   [junit4]   2> 158331 INFO  (qtp23823285-1030) [n:127.0.0.1:55955_solr c:testschemaapi s:shard1 r:core_node1 x:testschemaapi_shard1_replica2] o.a.s.c.SolrCore Using default statsCache cache: org.apache.solr.search.stats.LocalStatsCache
   [junit4]   2> 158333 INFO  (qtp26476173-1028) [n:127.0.0.1:55956_solr c:testschemaapi s:shard1 r:core_node2 x:testschemaapi_shard1_replica1] o.a.s.u.UpdateHandler Using UpdateLog implementation: org.apache.solr.update.UpdateLog
   [junit4]   2> 158333 INFO  (qtp26476173-1028) [n:127.0.0.1:55956_solr c:testschemaapi s:shard1 r:core_node2 x:testschemaapi_shard1_replica1] o.a.s.u.UpdateLog Initializing UpdateLog: dataDir=null defaultSyncLevel=FLUSH numRecordsToKeep=100 maxNumLogsToKeep=10 numVersionBuckets=65536
   [junit4]   2> 158333 INFO  (qtp23823285-1030) [n:127.0.0.1:55955_solr c:testschemaapi s:shard1 r:core_node1 x:testschemaapi_shard1_replica2] o.a.s.u.UpdateHandler Using UpdateLog implementation: org.apache.solr.update.UpdateLog
   [junit4]   2> 158333 INFO  (qtp23823285-1030) [n:127.0.0.1:55955_solr c:testschemaapi s:shard1 r:core_node1 x:testschemaapi_shard1_replica2] o.a.s.u.UpdateLog Initializing UpdateLog: dataDir=null defaultSyncLevel=FLUSH numRecordsToKeep=100 maxNumLogsToKeep=10 numVersionBuckets=65536
   [junit4]   2> 158336 INFO  (qtp23823285-1030) [n:127.0.0.1:55955_solr c:testschemaapi s:shard1 r:core_node1 x:testschemaapi_shard1_replica2] o.a.s.u.CommitTracker Hard AutoCommit: disabled
   [junit4]   2> 158336 INFO  (qtp23823285-1030) [n:127.0.0.1:55955_solr c:testschemaapi s:shard1 r:core_node1 x:testschemaapi_shard1_replica2] o.a.s.u.CommitTracker Soft AutoCommit: disabled
   [junit4]   2> 158336 INFO  (qtp26476173-1028) [n:127.0.0.1:55956_solr c:testschemaapi s:shard1 r:core_node2 x:testschemaapi_shard1_replica1] o.a.s.u.CommitTracker Hard AutoCommit: disabled
   [junit4]   2> 158337 INFO  (qtp26476173-1028) [n:127.0.0.1:55956_solr c:testschemaapi s:shard1 r:core_node2 x:testschemaapi_shard1_replica1] o.a.s.u.CommitTracker Soft AutoCommit: disabled
   [junit4]   2> 158336 INFO  (qtp23823285-1030) [n:127.0.0.1:55955_solr c:testschemaapi s:shard1 r:core_node1 x:testschemaapi_shard1_replica2] o.a.s.c.SolrDeletionPolicy SolrDeletionPolicy.onInit: commits: num=1
   [junit4]   2> 	commit{dir=MockDirectoryWrapper(RAMDirectory@bf1589 lockFactory=org.apache.lucene.store.SingleInstanceLockFactory@8ad086),segFN=segments_1,generation=1}
   [junit4]   2> 158337 INFO  (qtp23823285-1030) [n:127.0.0.1:55955_solr c:testschemaapi s:shard1 r:core_node1 x:testschemaapi_shard1_replica2] o.a.s.c.SolrDeletionPolicy newest commit generation = 1
   [junit4]   2> 158337 INFO  (qtp23823285-1030) [n:127.0.0.1:55955_solr c:testschemaapi s:shard1 r:core_node1 x:testschemaapi_shard1_replica2] o.a.s.s.SolrIndexSearcher Opening Searcher@2a702e[testschemaapi_shard1_replica2] main
   [junit4]   2> 158337 INFO  (qtp26476173-1028) [n:127.0.0.1:55956_solr c:testschemaapi s:shard1 r:core_node2 x:testschemaapi_shard1_replica1] o.a.s.c.SolrDeletionPolicy SolrDeletionPolicy.onInit: commits: num=1
   [junit4]   2> 	commit{dir=MockDirectoryWrapper(RAMDirectory@11f090b lockFactory=org.apache.lucene.store.SingleInstanceLockFactory@1802e84),segFN=segments_1,generation=1}
   [junit4]   2> 158337 INFO  (qtp26476173-1028) [n:127.0.0.1:55956_solr c:testschemaapi s:shard1 r:core_node2 x:testschemaapi_shard1_replica1] o.a.s.c.SolrDeletionPolicy newest commit generation = 1
   [junit4]   2> 158337 INFO  (qtp23823285-1030) [n:127.0.0.1:55955_solr c:testschemaapi s:shard1 r:core_node1 x:testschemaapi_shard1_replica2] o.a.s.c.c.ZkStateReader Load collection config from: [/collections/testschemaapi]
   [junit4]   2> 158337 INFO  (qtp26476173-1028) [n:127.0.0.1:55956_solr c:testschemaapi s:shard1 r:core_node2 x:testschemaapi_shard1_replica1] o.a.s.s.SolrIndexSearcher Opening Searcher@1355624[testschemaapi_shard1_replica1] main
   [junit4]   2> 158337 INFO  (qtp26476173-1028) [n:127.0.0.1:55956_solr c:testschemaapi s:shard1 r:core_node2 x:testschemaapi_shard1_replica1] o.a.s.c.c.ZkStateReader Load collection config from: [/collections/testschemaapi]
   [junit4]   2> 158338 INFO  (qtp23823285-1030) [n:127.0.0.1:55955_solr c:testschemaapi s:shard1 r:core_node1 x:testschemaapi_shard1_replica2] o.a.s.c.c.ZkStateReader path=[/collections/testschemaapi] [configName]=[conf1] specified config exists in ZooKeeper
   [junit4]   2> 158339 INFO  (qtp23823285-1030) [n:127.0.0.1:55955_solr c:testschemaapi s:shard1 r:core_node1 x:testschemaapi_shard1_replica2] o.a.s.r.ManagedResourceStorage Setting up ZooKeeper-based storage for the RestManager with znodeBase: /configs/conf1
   [junit4]   2> 158339 INFO  (qtp26476173-1028) [n:127.0.0.1:55956_solr c:testschemaapi s:shard1 r:core_node2 x:testschemaapi_shard1_replica1] o.a.s.c.c.ZkStateReader path=[/collections/testschemaapi] [configName]=[conf1] specified config exists in ZooKeeper
   [junit4]   2> 158339 INFO  (qtp26476173-1028) [n:127.0.0.1:55956_solr c:testschemaapi s:shard1 r:core_node2 x:testschemaapi_shard1_replica1] o.a.s.r.ManagedResourceStorage Setting up ZooKeeper-based storage for the RestManager with znodeBase: /configs/conf1
   [junit4]   2> 158339 INFO  (qtp23823285-1030) [n:127.0.0.1:55955_solr c:testschemaapi s:shard1 r:core_node1 x:testschemaapi_shard1_replica2] o.a.s.r.ManagedResourceStorage Configured ZooKeeperStorageIO with znodeBase: /configs/conf1
   [junit4]   2> 158339 INFO  (qtp23823285-1030) [n:127.0.0.1:55955_solr c:testschemaapi s:shard1 r:core_node1 x:testschemaapi_shard1_replica2] o.a.s.r.RestManager Initializing RestManager with initArgs: {}
   [junit4]   2> 158339 INFO  (qtp23823285-1030) [n:127.0.0.1:55955_solr c:testschemaapi s:shard1 r:core_node1 x:testschemaapi_shard1_replica2] o.a.s.r.ManagedResourceStorage Reading _rest_managed.json using ZooKeeperStorageIO:path=/configs/conf1
   [junit4]   2> 158340 INFO  (qtp26476173-1028) [n:127.0.0.1:55956_solr c:testschemaapi s:shard1 r:core_node2 x:testschemaapi_shard1_replica1] o.a.s.r.ManagedResourceStorage Configured ZooKeeperStorageIO with znodeBase: /configs/conf1
   [junit4]   2> 158340 INFO  (qtp26476173-1028) [n:127.0.0.1:55956_solr c:testschemaapi s:shard1 r:core_node2 x:testschemaapi_shard1_replica1] o.a.s.r.RestManager Initializing RestManager with initArgs: {}
   [junit4]   2> 158340 INFO  (qtp26476173-1028) [n:127.0.0.1:55956_solr c:testschemaapi s:shard1 r:core_node2 x:testschemaapi_shard1_replica1] o.a.s.r.ManagedResourceStorage Reading _rest_managed.json using ZooKeeperStorageIO:path=/configs/conf1
   [junit4]   2> 158341 INFO  (qtp23823285-1030) [n:127.0.0.1:55955_solr c:testschemaapi s:shard1 r:core_node1 x:testschemaapi_shard1_replica2] o.a.s.r.ManagedResourceStorage No data found for znode /configs/conf1/_rest_managed.json
   [junit4]   2> 158341 INFO  (qtp23823285-1030) [n:127.0.0.1:55955_solr c:testschemaapi s:shard1 r:core_node1 x:testschemaapi_shard1_replica2] o.a.s.r.ManagedResourceStorage Loaded null at path _rest_managed.json using ZooKeeperStorageIO:path=/configs/conf1
   [junit4]   2> 158341 INFO  (qtp23823285-1030) [n:127.0.0.1:55955_solr c:testschemaapi s:shard1 r:core_node1 x:testschemaapi_shard1_replica2] o.a.s.r.RestManager Initializing 0 registered ManagedResources
   [junit4]   2> 158341 INFO  (qtp26476173-1028) [n:127.0.0.1:55956_solr c:testschemaapi s:shard1 r:core_node2 x:testschemaapi_shard1_replica1] o.a.s.r.ManagedResourceStorage No data found for znode /configs/conf1/_rest_managed.json
   [junit4]   2> 158341 INFO  (qtp26476173-1028) [n:127.0.0.1:55956_solr c:testschemaapi s:shard1 r:core_node2 x:testschemaapi_shard1_replica1] o.a.s.r.ManagedResourceStorage Loaded null at path _rest_managed.json using ZooKeeperStorageIO:path=/configs/conf1
   [junit4]   2> 158341 INFO  (qtp26476173-1028) [n:127.0.0.1:55956_solr c:testschemaapi s:shard1 r:core_node2 x:testschemaapi_shard1_replica1] o.a.s.r.RestManager Initializing 0 registered ManagedResources
   [junit4]   2> 158349 INFO  (qtp23823285-1030) [n:127.0.0.1:55955_solr c:testschemaapi s:shard1 r:core_node1 x:testschemaapi_shard1_replica2] o.a.s.s.ZkIndexSchemaReader Creating ZooKeeper watch for the managed schema at /configs/conf1/managed-schema
   [junit4]   2> 158349 INFO  (qtp26476173-1028) [n:127.0.0.1:55956_solr c:testschemaapi s:shard1 r:core_node2 x:testschemaapi_shard1_replica1] o.a.s.s.ZkIndexSchemaReader Creating ZooKeeper watch for the managed schema at /configs/conf1/managed-schema
   [junit4]   2> 158353 INFO  (qtp23823285-1030) [n:127.0.0.1:55955_solr c:testschemaapi s:shard1 r:core_node1 x:testschemaapi_shard1_replica2] o.a.s.c.ZkController Added new OnReconnect listener ZkIndexSchemaReader: /configs/conf1/managed-schema, uniqueCoreId: testschemaapi_shard1_replica2:1979021400605112
   [junit4]   2> 158355 INFO  (qtp23823285-1030) [n:127.0.0.1:55955_solr c:testschemaapi s:shard1 r:core_node1 x:testschemaapi_shard1_replica2] o.a.s.h.ReplicationHandler Commits will be reserved for  10000
   [junit4]   2> 158355 INFO  (qtp23823285-1030) [n:127.0.0.1:55955_solr c:testschemaapi s:shard1 r:core_node1 x:testschemaapi_shard1_replica2] o.a.s.u.UpdateLog Looking up max value of version field to seed version buckets
   [junit4]   2> 158355 INFO  (qtp23823285-1030) [n:127.0.0.1:55955_solr c:testschemaapi s:shard1 r:core_node1 x:testschemaapi_shard1_replica2] o.a.s.u.VersionInfo Refreshing highest value of _version_ for 65536 version buckets from index
   [junit4]   2> 158355 INFO  (qtp23823285-1030) [n:127.0.0.1:55955_solr c:testschemaapi s:shard1 r:core_node1 x:testschemaapi_shard1_replica2] o.a.s.u.VersionInfo No terms found for _version_, cannot seed version bucket highest value from index
   [junit4]   2> 158355 INFO  (qtp23823285-1030) [n:127.0.0.1:55955_solr c:testschemaapi s:shard1 r:core_node1 x:testschemaapi_shard1_replica2] o.a.s.u.UpdateLog Could not find max version in index or recent updates, using new clock 1559211624613543936
   [junit4]   2> 158355 INFO  (searcherExecutor-557-thread-1-processing-n:127.0.0.1:55955_solr x:testschemaapi_shard1_replica2 s:shard1 c:testschemaapi r:core_node1) [n:127.0.0.1:55955_solr c:testschemaapi s:shard1 r:core_node1 x:testschemaapi_shard1_replica2] o.a.s.c.SolrCore [testschemaapi_shard1_replica2] Registered new searcher Searcher@2a702e[testschemaapi_shard1_replica2] main{ExitableDirectoryReader(UninvertingDirectoryReader())}
   [junit4]   2> 158355 INFO  (qtp26476173-1028) [n:127.0.0.1:55956_solr c:testschemaapi s:shard1 r:core_node2 x:testschemaapi_shard1_replica1] o.a.s.c.ZkController Added new OnReconnect listener ZkIndexSchemaReader: /configs/conf1/managed-schema, uniqueCoreId: testschemaapi_shard1_replica1:1979021402280428
   [junit4]   2> 158355 INFO  (qtp26476173-1028) [n:127.0.0.1:55956_solr c:testschemaapi s:shard1 r:core_node2 x:testschemaapi_shard1_replica1] o.a.s.h.ReplicationHandler Commits will be reserved for  10000
   [junit4]   2> 158356 INFO  (qtp26476173-1028) [n:127.0.0.1:55956_solr c:testschemaapi s:shard1 r:core_node2 x:testschemaapi_shard1_replica1] o.a.s.u.UpdateLog Looking up max value of version field to seed version buckets
   [junit4]   2> 158356 INFO  (qtp26476173-1028) [n:127.0.0.1:55956_solr c:testschemaapi s:shard1 r:core_node2 x:testschemaapi_shard1_replica1] o.a.s.u.VersionInfo Refreshing highest value of _version_ for 65536 version buckets from index
   [junit4]   2> 158356 INFO  (qtp26476173-1028) [n:127.0.0.1:55956_solr c:testschemaapi s:shard1 r:core_node2 x:testschemaapi_shard1_replica1] o.a.s.u.VersionInfo No terms found for _version_, cannot seed version bucket highest value from index
   [junit4]   2> 158356 INFO  (qtp26476173-1028) [n:127.0.0.1:55956_solr c:testschemaapi s:shard1 r:core_node2 x:testschemaapi_shard1_replica1] o.a.s.u.UpdateLog Could not find max version in index or recent updates, using new clock 1559211624614592512
   [junit4]   2> 158357 INFO  (qtp23823285-1030) [n:127.0.0.1:55955_solr c:testschemaapi s:shard1 r:core_node1 x:testschemaapi_shard1_replica2] o.a.s.u.UpdateLog Took 1.0ms to seed version buckets with highest version 1559211624613543936
   [junit4]   2> 158357 INFO  (qtp23823285-1030) [n:127.0.0.1:55955_solr c:testschemaapi s:shard1 r:core_node1 x:testschemaapi_shard1_replica2] o.a.s.c.ZkController watch zkdir /configs/conf1
   [junit4]   2> 158357 INFO  (searcherExecutor-558-thread-1-processing-n:127.0.0.1:55956_solr s:shard1 x:testschemaapi_shard1_replica1 c:testschemaapi r:core_node2) [n:127.0.0.1:55956_solr c:testschemaapi s:shard1 r:core_node2 x:testschemaapi_shard1_replica1] o.a.s.c.SolrCore [testschemaapi_shard1_replica1] Registered new searcher Searcher@1355624[testschemaapi_shard1_replica1] main{ExitableDirectoryReader(UninvertingDirectoryReader())}
   [junit4]   2> 158357 INFO  (qtp26476173-1028) [n:127.0.0.1:55956_solr c:testschemaapi s:shard1 r:core_node2 x:testschemaapi_shard1_replica1] o.a.s.u.UpdateLog Took 1.0ms to seed version buckets with highest version 1559211624614592512
   [junit4]   2> 158358 INFO  (qtp26476173-1028) [n:127.0.0.1:55956_solr c:testschemaapi s:shard1 r:core_node2 x:testschemaapi_shard1_replica1] o.a.s.c.ZkController watch zkdir /configs/conf1
   [junit4]   2> 158358 INFO  (qtp23823285-1030) [n:127.0.0.1:55955_solr c:testschemaapi s:shard1 r:core_node1 x:testschemaapi_shard1_replica2] o.a.s.c.CoreContainer registering core: testschemaapi_shard1_replica2
   [junit4]   2> 158358 INFO  (qtp23823285-1030) [n:127.0.0.1:55955_solr c:testschemaapi s:shard1 r:core_node1 x:testschemaapi_shard1_replica2] o.a.s.c.ZkController Register replica - core:testschemaapi_shard1_replica2 address:http://127.0.0.1:55955/solr collection:testschemaapi shard:shard1
   [junit4]   2> 158358 INFO  (qtp26476173-1028) [n:127.0.0.1:55956_solr c:testschemaapi s:shard1 r:core_node2 x:testschemaapi_shard1_replica1] o.a.s.c.CoreContainer registering core: testschemaapi_shard1_replica1
   [junit4]   2> 158358 INFO  (qtp26476173-1028) [n:127.0.0.1:55956_solr c:testschemaapi s:shard1 r:core_node2 x:testschemaapi_shard1_replica1] o.a.s.c.ZkController Register replica - core:testschemaapi_shard1_replica1 address:http://127.0.0.1:55956/solr collection:testschemaapi shard:shard1
   [junit4]   2> 158359 INFO  (qtp23823285-1030) [n:127.0.0.1:55955_solr c:testschemaapi s:shard1 r:core_node1 x:testschemaapi_shard1_replica2] o.a.s.c.c.SolrZkClient makePath: /collections/testschemaapi/leader_elect/shard1/election
   [junit4]   2> 158359 INFO  (qtp26476173-1028) [n:127.0.0.1:55956_solr c:testschemaapi s:shard1 r:core_node2 x:testschemaapi_shard1_replica1] o.a.s.c.c.SolrZkClient makePath: /collections/testschemaapi/leader_elect/shard1/election
   [junit4]   2> 158365 INFO  (qtp26476173-1028) [n:127.0.0.1:55956_solr c:testschemaapi s:shard1 r:core_node2 x:testschemaapi_shard1_replica1] o.a.s.c.LeaderElector Joined leadership election with path: /collections/testschemaapi/leader_elect/shard1/election/97450726425296902-core_node2-n_0000000000
   [junit4]   2> 158366 INFO  (qtp23823285-1030) [n:127.0.0.1:55955_solr c:testschemaapi s:shard1 r:core_node1 x:testschemaapi_shard1_replica2] o.a.s.c.LeaderElector Joined leadership election with path: /collections/testschemaapi/leader_elect/shard1/election/97450726425296901-core_node1-n_0000000001
   [junit4]   2> 158366 INFO  (qtp26476173-1028) [n:127.0.0.1:55956_solr c:testschemaapi s:shard1 r:core_node2 x:testschemaapi_shard1_replica1] o.a.s.c.ShardLeaderElectionContext Running the leader process for shard=shard1 and weAreReplacement=false and leaderVoteWait=10000
   [junit4]   2> 158367 INFO  (qtp23823285-1030) [n:127.0.0.1:55955_solr c:testschemaapi s:shard1 r:core_node1 x:testschemaapi_shard1_replica2] o.a.s.c.LeaderElector Watching path /collections/testschemaapi/leader_elect/shard1/election/97450726425296902-core_node2-n_0000000000 to know if I could be the leader
   [junit4]   2> 158369 INFO  (qtp26476173-1028) [n:127.0.0.1:55956_solr c:testschemaapi s:shard1 r:core_node2 x:testschemaapi_shard1_replica1] o.a.s.c.ShardLeaderElectionContext Enough replicas found to continue.
   [junit4]   2> 158369 INFO  (qtp26476173-1028) [n:127.0.0.1:55956_solr c:testschemaapi s:shard1 r:core_node2 x:testschemaapi_shard1_replica1] o.a.s.c.ShardLeaderElectionContext I may be the new leader - try and sync
   [junit4]   2> 158369 INFO  (qtp26476173-1028) [n:127.0.0.1:55956_solr c:testschemaapi s:shard1 r:core_node2 x:testschemaapi_shard1_replica1] o.a.s.c.SyncStrategy Sync replicas to http://127.0.0.1:55956/solr/testschemaapi_shard1_replica1/
   [junit4]   2> 158369 INFO  (qtp26476173-1028) [n:127.0.0.1:55956_solr c:testschemaapi s:shard1 r:core_node2 x:testschemaapi_shard1_replica1] o.a.s.u.PeerSync PeerSync: core=testschemaapi_shard1_replica1 url=http://127.0.0.1:55956/solr START replicas=[http://127.0.0.1:55955/solr/testschemaapi_shard1_replica2/] nUpdates=100
   [junit4]   2> 158370 INFO  (qtp26476173-1028) [n:127.0.0.1:55956_solr c:testschemaapi s:shard1 r:core_node2 x:testschemaapi_shard1_replica1] o.a.s.u.PeerSync PeerSync: core=testschemaapi_shard1_replica1 url=http://127.0.0.1:55956/solr DONE.  We have no versions.  sync failed.
   [junit4]   2> 158370 INFO  (qtp26476173-1028) [n:127.0.0.1:55956_solr c:testschemaapi s:shard1 r:core_node2 x:testschemaapi_shard1_replica1] o.a.s.c.SyncStrategy Leader's attempt to sync with shard failed, moving to the next candidate
   [junit4]   2> 158370 INFO  (qtp26476173-1028) [n:127.0.0.1:55956_solr c:testschemaapi s:shard1 r:core_node2 x:testschemaapi_shard1_replica1] o.a.s.c.ShardLeaderElectionContext We failed sync, but we have no versions - we can't sync in that case - we were active before, so become leader anyway
   [junit4]   2> 158370 INFO  (OverseerStateUpdate-97450726425296901-127.0.0.1:55955_solr-n_0000000000) [n:127.0.0.1:55955_solr    ] o.a.s.c.Overseer processMessage: queueSize: 1, message = {
   [junit4]   2>   "operation":"leader",
   [junit4]   2>   "shard":"shard1",
   [junit4]   2>   "collection":"testschemaapi"} current state version: 0
   [junit4]   2> 158371 INFO  (qtp26476173-1028) [n:127.0.0.1:55956_solr c:testschemaapi s:shard1 r:core_node2 x:testschemaapi_shard1_replica1] o.a.s.c.c.SolrZkClient makePath: /collections/testschemaapi/leaders/shard1
   [junit4]   2> 158376 INFO  (qtp23823285-1032) [n:127.0.0.1:55955_solr c:testschemaapi s:shard1 r:core_node1 x:testschemaapi_shard1_replica2] o.a.s.c.S.Request [testschemaapi_shard1_replica2]  webapp=/solr path=/get params={wt=javabin&getVersions=100&version=2&fingerprint=false&qt=/get&distrib=false} status=0 QTime=0
   [junit4]   2> 158377 INFO  (qtp26476173-1028) [n:127.0.0.1:55956_solr c:testschemaapi s:shard1 r:core_node2 x:testschemaapi_shard1_replica1] o.a.s.c.ShardLeaderElectionContextBase Creating leader registration node /collections/testschemaapi/leaders/shard1/leader after winning as /collections/testschemaapi/leader_elect/shard1/election/97450726425296902-core_node2-n_0000000000
   [junit4]   2> 158379 INFO  (qtp26476173-1028) [n:127.0.0.1:55956_solr c:testschemaapi s:shard1 r:core_node2 x:testschemaapi_shard1_replica1] o.a.s.c.ShardLeaderElectionContext I am the new leader: http://127.0.0.1:55956/solr/testschemaapi_shard1_replica1/ shard1
   [junit4]   2> 158380 INFO  (OverseerStateUpdate-97450726425296901-127.0.0.1:55955_solr-n_0000000000) [n:127.0.0.1:55955_solr    ] o.a.s.c.Overseer processMessage: queueSize: 1, message = {
   [junit4]   2>   "operation":"leader",
   [junit4]   2>   "shard":"shard1",
   [junit4]   2>   "collection":"testschemaapi",
   [junit4]   2>   "base_url":"http://127.0.0.1:55956/solr",
   [junit4]   2>   "core":"testschemaapi_shard1_replica1",
   [junit4]   2>   "state":"active"} current state version: 0
   [junit4]   2> 158485 INFO  (OverseerStateUpdate-97450726425296901-127.0.0.1:55955_solr-n_0000000000) [n:127.0.0.1:55955_solr    ] o.a.s.c.o.ZkStateWriter going to update_collection /collections/testschemaapi/state.json version: 1
   [junit4]   2> 158486 INFO  (zkCallback-162-thread-1-processing-n:127.0.0.1:55955_solr) [n:127.0.0.1:55955_solr    ] o.a.s.c.c.ZkStateReader A cluster state change: [WatchedEvent state:SyncConnected type:NodeDataChanged path:/collections/testschemaapi/state.json] for collection [testschemaapi] has occurred - updating... (live nodes size: [2])
   [junit4]   2> 158486 INFO  

[...truncated too long message...]

d.DistribDocExpirationUpdateProcessorTest_C16B4632F6DB45A7-001\shard-4-001\cores\collection1\data\index;done=false>>]
   [junit4]   2> 2594759 INFO  (recoveryExecutor-2370-thread-1-processing-n:127.0.0.1:50286_x%2Fad x:collection1 s:shard1 c:collection1 r:core_node4) [n:127.0.0.1:50286_x%2Fad c:collection1 s:shard1 r:core_node4 x:collection1] o.a.s.c.CachingDirectoryFactory Closing directory: C:\Users\jenkins\workspace\Lucene-Solr-5.5-Windows\solr\build\solr-core\test\J0\..\..\..\..\..\..\..\..\..\Users\jenkins\workspace\Lucene-Solr-5.5-Windows\solr\build\solr-core\test\J0\temp\solr.cloud.DistribDocExpirationUpdateProcessorTest_C16B4632F6DB45A7-001\shard-4-001\cores\collection1\data\index
   [junit4]   2> 2594760 INFO  (TEST-DistribDocExpirationUpdateProcessorTest.test-seed#[C16B4632F6DB45A7]) [    ] o.a.s.c.Overseer Overseer (id=97450881859649553-127.0.0.1:50286_x%2Fad-n_0000000004) closing
   [junit4]   2> 2594760 INFO  (OverseerStateUpdate-97450881859649553-127.0.0.1:50286_x%2Fad-n_0000000004) [n:127.0.0.1:50286_x%2Fad    ] o.a.s.c.Overseer Overseer Loop exiting : 127.0.0.1:50286_x%2Fad
   [junit4]   2> 2594761 INFO  (zkCallback-2372-thread-2-processing-n:127.0.0.1:50286_x%2Fad) [n:127.0.0.1:50286_x%2Fad    ] o.a.s.c.c.ZkStateReader A live node change: [WatchedEvent state:SyncConnected type:NodeChildrenChanged path:/live_nodes], has occurred - updating... (live nodes size: [1])
   [junit4]   2> 2594761 WARN  (zkCallback-2372-thread-2-processing-n:127.0.0.1:50286_x%2Fad) [n:127.0.0.1:50286_x%2Fad    ] o.a.s.c.c.ZkStateReader ZooKeeper watch triggered, but Solr cannot talk to ZK: [KeeperErrorCode = Session expired for /live_nodes]
   [junit4]   2> 2594762 INFO  (TEST-DistribDocExpirationUpdateProcessorTest.test-seed#[C16B4632F6DB45A7]) [    ] o.e.j.s.ServerConnector Stopped ServerConnector@d03532{HTTP/1.1}{127.0.0.1:0}
   [junit4]   2> 2594762 INFO  (TEST-DistribDocExpirationUpdateProcessorTest.test-seed#[C16B4632F6DB45A7]) [    ] o.e.j.s.h.ContextHandler Stopped o.e.j.s.ServletContextHandler@4b593e{/x/ad,null,UNAVAILABLE}
   [junit4]   2> 2594765 INFO  (TEST-DistribDocExpirationUpdateProcessorTest.test-seed#[C16B4632F6DB45A7]) [    ] o.a.s.c.ZkTestServer connecting to 127.0.0.1:50202 50202
   [junit4]   2> 2594765 INFO  (Thread-6627) [    ] o.a.s.c.ZkTestServer connecting to 127.0.0.1:50202 50202
   [junit4]   2> 2594767 WARN  (Thread-6627) [    ] o.a.s.c.ZkTestServer Watch limit violations: 
   [junit4]   2> Maximum concurrent create/delete watches above limit:
   [junit4]   2> 
   [junit4]   2> 	6	/solr/aliases.json
   [junit4]   2> 	5	/solr/security.json
   [junit4]   2> 	5	/solr/configs/conf1
   [junit4]   2> 	4	/solr/collections/collection1/state.json
   [junit4]   2> 
   [junit4]   2> Maximum concurrent data watches above limit:
   [junit4]   2> 
   [junit4]   2> 	6	/solr/clusterstate.json
   [junit4]   2> 
   [junit4]   2> Maximum concurrent children watches above limit:
   [junit4]   2> 
   [junit4]   2> 	67	/solr/overseer/collection-queue-work
   [junit4]   2> 	39	/solr/overseer/queue
   [junit4]   2> 	6	/solr/collections
   [junit4]   2> 	6	/solr/live_nodes
   [junit4]   2> 	5	/solr/overseer/queue-work
   [junit4]   2> 
   [junit4]   2> NOTE: reproduce with: ant test  -Dtestcase=DistribDocExpirationUpdateProcessorTest -Dtests.method=test -Dtests.seed=C16B4632F6DB45A7 -Dtests.slow=true -Dtests.locale=id -Dtests.timezone=PRT -Dtests.asserts=true -Dtests.file.encoding=US-ASCII
   [junit4] FAILURE 66.4s J0 | DistribDocExpirationUpdateProcessorTest.test <<<
   [junit4]    > Throwable #1: java.lang.AssertionError: There are still nodes recoverying - waited for 45 seconds
   [junit4]    > 	at __randomizedtesting.SeedInfo.seed([C16B4632F6DB45A7:493F79E85827285F]:0)
   [junit4]    > 	at org.apache.solr.cloud.AbstractDistribZkTestBase.waitForRecoveriesToFinish(AbstractDistribZkTestBase.java:174)
   [junit4]    > 	at org.apache.solr.cloud.AbstractFullDistribZkTestBase.waitForRecoveriesToFinish(AbstractFullDistribZkTestBase.java:838)
   [junit4]    > 	at org.apache.solr.cloud.DistribDocExpirationUpdateProcessorTest.test(DistribDocExpirationUpdateProcessorTest.java:74)
   [junit4]    > 	at org.apache.solr.BaseDistributedSearchTestCase$ShardsRepeatRule$ShardsFixedStatement.callStatement(BaseDistributedSearchTestCase.java:996)
   [junit4]    > 	at org.apache.solr.BaseDistributedSearchTestCase$ShardsRepeatRule$ShardsStatement.evaluate(BaseDistributedSearchTestCase.java:971)
   [junit4]    > 	at java.lang.Thread.run(Thread.java:745)
   [junit4]   2> 2594769 INFO  (SUITE-DistribDocExpirationUpdateProcessorTest-seed#[C16B4632F6DB45A7]-worker) [    ] o.a.s.SolrTestCaseJ4 ###deleteCore
   [junit4]   2> NOTE: leaving temporary files on disk at: C:\Users\jenkins\workspace\Lucene-Solr-5.5-Windows\solr\build\solr-core\test\J0\temp\solr.cloud.DistribDocExpirationUpdateProcessorTest_C16B4632F6DB45A7-001
   [junit4]   2> Feb 13, 2017 10:41:56 AM com.carrotsearch.randomizedtesting.ThreadLeakControl checkThreadLeaks
   [junit4]   2> WARNING: Will linger awaiting termination of 2 leaked thread(s).
   [junit4]   2> NOTE: test params are: codec=CheapBastard, sim=DefaultSimilarity, locale=id, timezone=PRT
   [junit4]   2> NOTE: Windows 8.1 6.3 x86/Oracle Corporation 1.7.0_80 (32-bit)/cpus=3,threads=1,free=213481936,total=510656512
   [junit4]   2> NOTE: All tests run in this JVM: [TestElisionMultitermQuery, DistributedQueueTest, TestStressLucene, SyncSliceTest, PingRequestHandlerTest, TestDefaultStatsCache, TestInitParams, TestCloudManagedSchema, TestJmxIntegration, TestReplicationHandlerBackup, TestFreeTextSuggestions, ReplicationFactorTest, AnalysisErrorHandlingTest, PKIAuthenticationIntegrationTest, TestHdfsUpdateLog, OverseerTaskQueueTest, TestConfigSets, CoreSorterTest, DistributedSpellCheckComponentTest, TestRestoreCore, BufferStoreTest, AddSchemaFieldsUpdateProcessorFactoryTest, PrimUtilsTest, DeleteReplicaTest, TestRemoveLastDynamicCopyField, TestHighlightDedupGrouping, TestFunctionQuery, XmlUpdateRequestHandlerTest, TestSweetSpotSimilarityFactory, BlockJoinFacetRandomTest, HdfsThreadLeakTest, UpdateParamsTest, QueryEqualityTest, DeleteInactiveReplicaTest, TermsComponentTest, TestSchemaManager, MBeansHandlerTest, TestGroupingSearch, BigEndianAscendingWordDeserializerTest, AssignTest, SegmentsInfoRequestHandlerTest, TestImplicitCoreProperties, TestManagedSchema, TestConfigSetsAPI, RulesTest, TestDistribDocBasedVersion, TestManagedResource, QueryResultKeyTest, ChangedSchemaMergeTest, TestMiniSolrCloudClusterSSL, TestOverriddenPrefixQueryForCustomFieldType, DirectSolrSpellCheckerTest, BlockCacheTest, TestQuerySenderNoQuery, SolrTestCaseJ4Test, ConfigSetsAPITest, TestSolrCLIRunExample, TestLFUCache, AsyncMigrateRouteKeyTest, CollectionsAPISolrJTest, SchemaVersionSpecificBehaviorTest, InfoHandlerTest, OverseerTest, DirectUpdateHandlerTest, CloneFieldUpdateProcessorFactoryTest, FastVectorHighlighterTest, TestReloadAndDeleteDocs, TestPKIAuthenticationPlugin, TestSha256AuthenticationProvider, TestSolrConfigHandler, DistributedSuggestComponentTest, CollectionTooManyReplicasTest, TestPhraseSuggestions, TestReplicationHandler, TestSolrDeletionPolicy1, TestSearcherReuse, CreateCollectionCleanupTest, TestUseDocValuesAsStored2, TestLeaderInitiatedRecoveryThread, TestTrieFacet, TimeZoneUtilsTest, RecoveryAfterSoftCommitTest, TestStandardQParsers, TestSearchPerf, OverriddenZkACLAndCredentialsProvidersTest, SortSpecParsingTest, TestSort, TestRequestStatusCollectionAPI, TestClassNameShortening, UUIDUpdateProcessorFallbackTest, PrimitiveFieldTypeTest, TestFastLRUCache, ExternalFileFieldSortTest, QueryElevationComponentTest, ExitableDirectoryReaderTest, SystemInfoHandlerTest, SolrXmlInZkTest, TestSolrCloudWithKerberosAlt, TestStressVersions, TestObjectReleaseTracker, DocumentAnalysisRequestHandlerTest, PeerSyncTest, TestUniqueKeyFieldResource, TestFieldSortValues, TestDFRSimilarityFactory, TestPartialUpdateDeduplication, TestLazyCores, TestSolrConfigHandlerConcurrent, TestExpandComponent, TestRecoveryHdfs, RegexBoostProcessorTest, TestSchemaVersionResource, URLClassifyProcessorTest, TestSolrQueryResponse, OverseerRolesTest, MultiThreadedOCPTest, ChaosMonkeyNothingIsSafeTest, RecoveryZkTest, TestManagedSchemaFieldResource, TestDefaultSearchFieldResource, SimpleMLTQParserTest, TestExactSharedStatsCache, TestDocBasedVersionConstraints, TestMiniSolrCloudClusterBase, TestRandomRequestDistribution, HdfsCollectionsAPIDistributedZkTest, RequiredFieldsTest, SimpleCollectionCreateDeleteTest, TestArbitraryIndexDir, TestSolrQueryParserDefaultOperatorResource, SimplePostToolTest, XsltUpdateRequestHandlerTest, TestDocumentBuilder, TestCursorMarkWithoutUniqueKey, StandardRequestHandlerTest, TestUpdate, ShardRoutingTest, TestLRUCache, HdfsRestartWhileUpdatingTest, SmileWriterTest, BasicDistributedZkTest, CollectionsAPIDistributedZkTest, TestDistributedGrouping, TestHashPartitioner, HardAutoCommitTest, TestCoreContainer, TestSolr4Spatial, StatsComponentTest, DistributedQueryElevationComponentTest, AnalysisAfterCoreReloadTest, SuggesterFSTTest, SolrRequestParserTest, DocValuesTest, SOLR749Test, ResponseLogComponentTest, BadComponentTest, TestStressRecovery, TestSolrDeletionPolicy2, MultiTermTest, TestDocSet, MinimalSchemaTest, OutputWriterTest, TestFuzzyAnalyzedSuggestions, TestPostingsSolrHighlighter, SpellPossibilityIteratorTest, TestCodecSupport, TestJmxMonitoredMap, ResourceLoaderTest, ScriptEngineTest, PreAnalyzedFieldTest, DOMUtilTest, ClusterStateTest, TestSolrJ, TestUtils, ZkNodePropsTest, SliceStateTest, UUIDFieldTest, CircularListTest, DistributedIntervalFacetingTest, TestSimpleTrackingShardHandler, TestJettySolrRunner, AliasIntegrationTest, CollectionReloadTest, ConcurrentDeleteAndCreateCollectionTest, ConnectionManagerTest, CustomCollectionTest, DistribDocExpirationUpdateProcessorTest]
   [junit4] Completed [446/575 (2!)] on J0 in 66.94s, 1 test, 1 failure <<< FAILURES!

[...truncated 49521 lines...]


Mime
View raw message