lucene-dev mailing list archives

Site index · List index
Message view « Date » · « Thread »
Top « Date » · « Thread »
From Policeman Jenkins Server <jenk...@thetaphi.de>
Subject [JENKINS] Lucene-Solr-master-MacOSX (64bit/jdk1.8.0) - Build # 3814 - Still Unstable!
Date Thu, 02 Feb 2017 19:29:49 GMT
Build: https://jenkins.thetaphi.de/job/Lucene-Solr-master-MacOSX/3814/
Java: 64bit/jdk1.8.0 -XX:-UseCompressedOops -XX:+UseParallelGC

3 tests failed.
FAILED:  junit.framework.TestSuite.org.apache.solr.core.TestLazyCores

Error Message:
1 thread leaked from SUITE scope at org.apache.solr.core.TestLazyCores:     1) Thread[id=9816, name=searcherExecutor-3954-thread-1, state=WAITING, group=TGRP-TestLazyCores]         at sun.misc.Unsafe.park(Native Method)         at java.util.concurrent.locks.LockSupport.park(LockSupport.java:175)         at java.util.concurrent.locks.AbstractQueuedSynchronizer$ConditionObject.await(AbstractQueuedSynchronizer.java:2039)         at java.util.concurrent.LinkedBlockingQueue.take(LinkedBlockingQueue.java:442)         at java.util.concurrent.ThreadPoolExecutor.getTask(ThreadPoolExecutor.java:1067)         at java.util.concurrent.ThreadPoolExecutor.runWorker(ThreadPoolExecutor.java:1127)         at java.util.concurrent.ThreadPoolExecutor$Worker.run(ThreadPoolExecutor.java:617)         at java.lang.Thread.run(Thread.java:745)

Stack Trace:
com.carrotsearch.randomizedtesting.ThreadLeakError: 1 thread leaked from SUITE scope at org.apache.solr.core.TestLazyCores: 
   1) Thread[id=9816, name=searcherExecutor-3954-thread-1, state=WAITING, group=TGRP-TestLazyCores]
        at sun.misc.Unsafe.park(Native Method)
        at java.util.concurrent.locks.LockSupport.park(LockSupport.java:175)
        at java.util.concurrent.locks.AbstractQueuedSynchronizer$ConditionObject.await(AbstractQueuedSynchronizer.java:2039)
        at java.util.concurrent.LinkedBlockingQueue.take(LinkedBlockingQueue.java:442)
        at java.util.concurrent.ThreadPoolExecutor.getTask(ThreadPoolExecutor.java:1067)
        at java.util.concurrent.ThreadPoolExecutor.runWorker(ThreadPoolExecutor.java:1127)
        at java.util.concurrent.ThreadPoolExecutor$Worker.run(ThreadPoolExecutor.java:617)
        at java.lang.Thread.run(Thread.java:745)
	at __randomizedtesting.SeedInfo.seed([59AE304D60FF3D46]:0)


FAILED:  junit.framework.TestSuite.org.apache.solr.core.TestLazyCores

Error Message:
There are still zombie threads that couldn't be terminated:    1) Thread[id=9816, name=searcherExecutor-3954-thread-1, state=WAITING, group=TGRP-TestLazyCores]         at sun.misc.Unsafe.park(Native Method)         at java.util.concurrent.locks.LockSupport.park(LockSupport.java:175)         at java.util.concurrent.locks.AbstractQueuedSynchronizer$ConditionObject.await(AbstractQueuedSynchronizer.java:2039)         at java.util.concurrent.LinkedBlockingQueue.take(LinkedBlockingQueue.java:442)         at java.util.concurrent.ThreadPoolExecutor.getTask(ThreadPoolExecutor.java:1067)         at java.util.concurrent.ThreadPoolExecutor.runWorker(ThreadPoolExecutor.java:1127)         at java.util.concurrent.ThreadPoolExecutor$Worker.run(ThreadPoolExecutor.java:617)         at java.lang.Thread.run(Thread.java:745)

Stack Trace:
com.carrotsearch.randomizedtesting.ThreadLeakError: There are still zombie threads that couldn't be terminated:
   1) Thread[id=9816, name=searcherExecutor-3954-thread-1, state=WAITING, group=TGRP-TestLazyCores]
        at sun.misc.Unsafe.park(Native Method)
        at java.util.concurrent.locks.LockSupport.park(LockSupport.java:175)
        at java.util.concurrent.locks.AbstractQueuedSynchronizer$ConditionObject.await(AbstractQueuedSynchronizer.java:2039)
        at java.util.concurrent.LinkedBlockingQueue.take(LinkedBlockingQueue.java:442)
        at java.util.concurrent.ThreadPoolExecutor.getTask(ThreadPoolExecutor.java:1067)
        at java.util.concurrent.ThreadPoolExecutor.runWorker(ThreadPoolExecutor.java:1127)
        at java.util.concurrent.ThreadPoolExecutor$Worker.run(ThreadPoolExecutor.java:617)
        at java.lang.Thread.run(Thread.java:745)
	at __randomizedtesting.SeedInfo.seed([59AE304D60FF3D46]:0)


FAILED:  org.apache.solr.core.TestLazyCores.testNoCommit

Error Message:
Exception during query

Stack Trace:
java.lang.RuntimeException: Exception during query
	at __randomizedtesting.SeedInfo.seed([59AE304D60FF3D46:86CE919CABD85EE3]:0)
	at org.apache.solr.SolrTestCaseJ4.assertQ(SolrTestCaseJ4.java:857)
	at org.apache.solr.core.TestLazyCores.check10(TestLazyCores.java:794)
	at org.apache.solr.core.TestLazyCores.testNoCommit(TestLazyCores.java:776)
	at sun.reflect.NativeMethodAccessorImpl.invoke0(Native Method)
	at sun.reflect.NativeMethodAccessorImpl.invoke(NativeMethodAccessorImpl.java:62)
	at sun.reflect.DelegatingMethodAccessorImpl.invoke(DelegatingMethodAccessorImpl.java:43)
	at java.lang.reflect.Method.invoke(Method.java:498)
	at com.carrotsearch.randomizedtesting.RandomizedRunner.invoke(RandomizedRunner.java:1713)
	at com.carrotsearch.randomizedtesting.RandomizedRunner$8.evaluate(RandomizedRunner.java:907)
	at com.carrotsearch.randomizedtesting.RandomizedRunner$9.evaluate(RandomizedRunner.java:943)
	at com.carrotsearch.randomizedtesting.RandomizedRunner$10.evaluate(RandomizedRunner.java:957)
	at com.carrotsearch.randomizedtesting.rules.SystemPropertiesRestoreRule$1.evaluate(SystemPropertiesRestoreRule.java:57)
	at org.apache.lucene.util.TestRuleSetupTeardownChained$1.evaluate(TestRuleSetupTeardownChained.java:49)
	at org.apache.lucene.util.AbstractBeforeAfterRule$1.evaluate(AbstractBeforeAfterRule.java:45)
	at org.apache.lucene.util.TestRuleThreadAndTestName$1.evaluate(TestRuleThreadAndTestName.java:48)
	at org.apache.lucene.util.TestRuleIgnoreAfterMaxFailures$1.evaluate(TestRuleIgnoreAfterMaxFailures.java:64)
	at org.apache.lucene.util.TestRuleMarkFailure$1.evaluate(TestRuleMarkFailure.java:47)
	at com.carrotsearch.randomizedtesting.rules.StatementAdapter.evaluate(StatementAdapter.java:36)
	at com.carrotsearch.randomizedtesting.ThreadLeakControl$StatementRunner.run(ThreadLeakControl.java:368)
	at com.carrotsearch.randomizedtesting.ThreadLeakControl.forkTimeoutingTask(ThreadLeakControl.java:817)
	at com.carrotsearch.randomizedtesting.ThreadLeakControl$3.evaluate(ThreadLeakControl.java:468)
	at com.carrotsearch.randomizedtesting.RandomizedRunner.runSingleTest(RandomizedRunner.java:916)
	at com.carrotsearch.randomizedtesting.RandomizedRunner$5.evaluate(RandomizedRunner.java:802)
	at com.carrotsearch.randomizedtesting.RandomizedRunner$6.evaluate(RandomizedRunner.java:852)
	at com.carrotsearch.randomizedtesting.RandomizedRunner$7.evaluate(RandomizedRunner.java:863)
	at com.carrotsearch.randomizedtesting.rules.StatementAdapter.evaluate(StatementAdapter.java:36)
	at com.carrotsearch.randomizedtesting.rules.SystemPropertiesRestoreRule$1.evaluate(SystemPropertiesRestoreRule.java:57)
	at org.apache.lucene.util.AbstractBeforeAfterRule$1.evaluate(AbstractBeforeAfterRule.java:45)
	at com.carrotsearch.randomizedtesting.rules.StatementAdapter.evaluate(StatementAdapter.java:36)
	at org.apache.lucene.util.TestRuleStoreClassName$1.evaluate(TestRuleStoreClassName.java:41)
	at com.carrotsearch.randomizedtesting.rules.NoShadowingOrOverridesOnMethodsRule$1.evaluate(NoShadowingOrOverridesOnMethodsRule.java:40)
	at com.carrotsearch.randomizedtesting.rules.NoShadowingOrOverridesOnMethodsRule$1.evaluate(NoShadowingOrOverridesOnMethodsRule.java:40)
	at com.carrotsearch.randomizedtesting.rules.StatementAdapter.evaluate(StatementAdapter.java:36)
	at com.carrotsearch.randomizedtesting.rules.StatementAdapter.evaluate(StatementAdapter.java:36)
	at com.carrotsearch.randomizedtesting.rules.StatementAdapter.evaluate(StatementAdapter.java:36)
	at org.apache.lucene.util.TestRuleAssertionsRequired$1.evaluate(TestRuleAssertionsRequired.java:53)
	at org.apache.lucene.util.TestRuleMarkFailure$1.evaluate(TestRuleMarkFailure.java:47)
	at org.apache.lucene.util.TestRuleIgnoreAfterMaxFailures$1.evaluate(TestRuleIgnoreAfterMaxFailures.java:64)
	at org.apache.lucene.util.TestRuleIgnoreTestSuites$1.evaluate(TestRuleIgnoreTestSuites.java:54)
	at com.carrotsearch.randomizedtesting.rules.StatementAdapter.evaluate(StatementAdapter.java:36)
	at com.carrotsearch.randomizedtesting.ThreadLeakControl$StatementRunner.run(ThreadLeakControl.java:368)
	at java.lang.Thread.run(Thread.java:745)
Caused by: java.lang.RuntimeException: REQUEST FAILED: xpath=//result[@numFound='10']
	xml response was: <?xml version="1.0" encoding="UTF-8"?>
<response>

<lst name="responseHeader">
  <int name="status">0</int>
  <int name="QTime">0</int>
  <lst name="params">
    <str name="q">*:*</str>
  </lst>
</lst>
<result name="response" numFound="0" start="0">
</result>
</response>

	request was:q=*:*
	at org.apache.solr.SolrTestCaseJ4.assertQ(SolrTestCaseJ4.java:850)
	... 41 more




Build Log:
[...truncated 11572 lines...]
   [junit4] Suite: org.apache.solr.core.TestLazyCores
   [junit4]   2> Creating dataDir: /Users/jenkins/workspace/Lucene-Solr-master-MacOSX/solr/build/solr-core/test/J0/temp/solr.core.TestLazyCores_59AE304D60FF3D46-001/init-core-data-001
   [junit4]   2> 1781632 INFO  (SUITE-TestLazyCores-seed#[59AE304D60FF3D46]-worker) [    ] o.a.s.SolrTestCaseJ4 Using TrieFields
   [junit4]   2> 1781635 INFO  (SUITE-TestLazyCores-seed#[59AE304D60FF3D46]-worker) [    ] o.a.s.SolrTestCaseJ4 Randomized ssl (false) and clientAuth (false) via: @org.apache.solr.util.RandomizeSSL(reason=, value=NaN, ssl=NaN, clientAuth=NaN) w/ MAC_OS_X supressed clientAuth
   [junit4]   2> 1781637 INFO  (TEST-TestLazyCores.testCreateTransientFromAdmin-seed#[59AE304D60FF3D46]) [    ] o.a.s.SolrTestCaseJ4 ###Starting testCreateTransientFromAdmin
   [junit4]   2> 1781683 INFO  (TEST-TestLazyCores.testCreateTransientFromAdmin-seed#[59AE304D60FF3D46]) [    ] o.a.s.c.SolrCores Allocating transient cache for 4 transient cores
   [junit4]   2> 1781779 INFO  (coreLoadExecutor-3773-thread-3) [    x:collection5] o.a.s.c.SolrConfig Using Lucene MatchVersion: 7.0.0
   [junit4]   2> 1781782 INFO  (coreLoadExecutor-3773-thread-2) [    x:collection2] o.a.s.c.SolrConfig Using Lucene MatchVersion: 7.0.0
   [junit4]   2> 1781782 INFO  (coreLoadExecutor-3773-thread-1) [    x:collection1] o.a.s.c.SolrConfig Using Lucene MatchVersion: 7.0.0
   [junit4]   2> 1781790 INFO  (coreLoadExecutor-3773-thread-2) [    x:collection2] o.a.s.s.IndexSchema [collection2] Schema name=tiny
   [junit4]   2> 1781790 INFO  (coreLoadExecutor-3773-thread-3) [    x:collection5] o.a.s.s.IndexSchema [collection5] Schema name=tiny
   [junit4]   2> 1781793 INFO  (coreLoadExecutor-3773-thread-1) [    x:collection1] o.a.s.s.IndexSchema [collection1] Schema name=tiny
   [junit4]   2> 1781794 INFO  (coreLoadExecutor-3773-thread-2) [    x:collection2] o.a.s.s.IndexSchema Loaded schema tiny/1.1 with uniqueid field id
   [junit4]   2> 1781794 INFO  (coreLoadExecutor-3773-thread-3) [    x:collection5] o.a.s.s.IndexSchema Loaded schema tiny/1.1 with uniqueid field id
   [junit4]   2> 1781796 INFO  (coreLoadExecutor-3773-thread-1) [    x:collection1] o.a.s.s.IndexSchema Loaded schema tiny/1.1 with uniqueid field id
   [junit4]   2> 1781798 INFO  (coreLoadExecutor-3773-thread-3) [    x:collection5] o.a.s.c.CoreContainer Creating SolrCore 'collection5' using configuration from instancedir /Users/jenkins/workspace/Lucene-Solr-master-MacOSX/solr/build/solr-core/test/J0/temp/solr.core.TestLazyCores_59AE304D60FF3D46-001/tempDir-001/collection5
   [junit4]   2> 1781798 INFO  (coreLoadExecutor-3773-thread-1) [    x:collection1] o.a.s.c.CoreContainer Creating SolrCore 'collection1' using configuration from instancedir /Users/jenkins/workspace/Lucene-Solr-master-MacOSX/solr/build/solr-core/test/J0/temp/solr.core.TestLazyCores_59AE304D60FF3D46-001/tempDir-001/collection1
   [junit4]   2> 1781798 INFO  (coreLoadExecutor-3773-thread-1) [    x:collection1] o.a.s.c.SolrCore [[collection1] ] Opening new SolrCore at [/Users/jenkins/workspace/Lucene-Solr-master-MacOSX/solr/build/solr-core/test/J0/temp/solr.core.TestLazyCores_59AE304D60FF3D46-001/tempDir-001/collection1], dataDir=[/Users/jenkins/workspace/Lucene-Solr-master-MacOSX/solr/build/solr-core/test/J0/temp/solr.core.TestLazyCores_59AE304D60FF3D46-001/tempDir-001/collection1/data/]
   [junit4]   2> 1781798 INFO  (coreLoadExecutor-3773-thread-2) [    x:collection2] o.a.s.c.CoreContainer Creating SolrCore 'collection2' using configuration from instancedir /Users/jenkins/workspace/Lucene-Solr-master-MacOSX/solr/build/solr-core/test/J0/temp/solr.core.TestLazyCores_59AE304D60FF3D46-001/tempDir-001/collection2
   [junit4]   2> 1781799 INFO  (coreLoadExecutor-3773-thread-3) [    x:collection5] o.a.s.c.SolrCore [[collection5] ] Opening new SolrCore at [/Users/jenkins/workspace/Lucene-Solr-master-MacOSX/solr/build/solr-core/test/J0/temp/solr.core.TestLazyCores_59AE304D60FF3D46-001/tempDir-001/collection5], dataDir=[/Users/jenkins/workspace/Lucene-Solr-master-MacOSX/solr/build/solr-core/test/J0/temp/solr.core.TestLazyCores_59AE304D60FF3D46-001/tempDir-001/collection5/data/]
   [junit4]   2> 1781799 INFO  (coreLoadExecutor-3773-thread-2) [    x:collection2] o.a.s.c.SolrCore [[collection2] ] Opening new SolrCore at [/Users/jenkins/workspace/Lucene-Solr-master-MacOSX/solr/build/solr-core/test/J0/temp/solr.core.TestLazyCores_59AE304D60FF3D46-001/tempDir-001/collection2], dataDir=[/Users/jenkins/workspace/Lucene-Solr-master-MacOSX/solr/build/solr-core/test/J0/temp/solr.core.TestLazyCores_59AE304D60FF3D46-001/tempDir-001/collection2/data/]
   [junit4]   2> 1781803 INFO  (coreLoadExecutor-3773-thread-3) [    x:collection5] o.a.s.u.RandomMergePolicy RandomMergePolicy wrapping class org.apache.lucene.index.LogByteSizeMergePolicy: [LogByteSizeMergePolicy: minMergeSize=1677721, mergeFactor=15, maxMergeSize=2147483648, maxMergeSizeForForcedMerge=9223372036854775807, calibrateSizeByDeletes=true, maxMergeDocs=2147483647, maxCFSSegmentSizeMB=8.796093022207999E12, noCFSRatio=0.0]
   [junit4]   2> 1781803 INFO  (coreLoadExecutor-3773-thread-1) [    x:collection1] o.a.s.u.RandomMergePolicy RandomMergePolicy wrapping class org.apache.lucene.index.LogByteSizeMergePolicy: [LogByteSizeMergePolicy: minMergeSize=1677721, mergeFactor=15, maxMergeSize=2147483648, maxMergeSizeForForcedMerge=9223372036854775807, calibrateSizeByDeletes=true, maxMergeDocs=2147483647, maxCFSSegmentSizeMB=8.796093022207999E12, noCFSRatio=0.0]
   [junit4]   2> 1781803 INFO  (coreLoadExecutor-3773-thread-2) [    x:collection2] o.a.s.u.RandomMergePolicy RandomMergePolicy wrapping class org.apache.lucene.index.LogByteSizeMergePolicy: [LogByteSizeMergePolicy: minMergeSize=1677721, mergeFactor=15, maxMergeSize=2147483648, maxMergeSizeForForcedMerge=9223372036854775807, calibrateSizeByDeletes=true, maxMergeDocs=2147483647, maxCFSSegmentSizeMB=8.796093022207999E12, noCFSRatio=0.0]
   [junit4]   2> 1781889 INFO  (coreLoadExecutor-3773-thread-2) [    x:collection2] o.a.s.u.CommitTracker Hard AutoCommit: disabled
   [junit4]   2> 1781889 INFO  (coreLoadExecutor-3773-thread-2) [    x:collection2] o.a.s.u.CommitTracker Soft AutoCommit: disabled
   [junit4]   2> 1781890 INFO  (coreLoadExecutor-3773-thread-2) [    x:collection2] o.a.s.u.RandomMergePolicy RandomMergePolicy wrapping class org.apache.lucene.index.LogByteSizeMergePolicy: [LogByteSizeMergePolicy: minMergeSize=1677721, mergeFactor=10, maxMergeSize=2147483648, maxMergeSizeForForcedMerge=9223372036854775807, calibrateSizeByDeletes=false, maxMergeDocs=2147483647, maxCFSSegmentSizeMB=8.796093022207999E12, noCFSRatio=0.0]
   [junit4]   2> 1781890 INFO  (coreLoadExecutor-3773-thread-3) [    x:collection5] o.a.s.u.CommitTracker Hard AutoCommit: disabled
   [junit4]   2> 1781890 INFO  (coreLoadExecutor-3773-thread-3) [    x:collection5] o.a.s.u.CommitTracker Soft AutoCommit: disabled
   [junit4]   2> 1781890 INFO  (coreLoadExecutor-3773-thread-3) [    x:collection5] o.a.s.u.RandomMergePolicy RandomMergePolicy wrapping class org.apache.lucene.index.LogByteSizeMergePolicy: [LogByteSizeMergePolicy: minMergeSize=1677721, mergeFactor=10, maxMergeSize=2147483648, maxMergeSizeForForcedMerge=9223372036854775807, calibrateSizeByDeletes=false, maxMergeDocs=2147483647, maxCFSSegmentSizeMB=8.796093022207999E12, noCFSRatio=0.0]
   [junit4]   2> 1781890 INFO  (coreLoadExecutor-3773-thread-1) [    x:collection1] o.a.s.u.CommitTracker Hard AutoCommit: disabled
   [junit4]   2> 1781890 INFO  (coreLoadExecutor-3773-thread-1) [    x:collection1] o.a.s.u.CommitTracker Soft AutoCommit: disabled
   [junit4]   2> 1781891 INFO  (coreLoadExecutor-3773-thread-1) [    x:collection1] o.a.s.u.RandomMergePolicy RandomMergePolicy wrapping class org.apache.lucene.index.LogByteSizeMergePolicy: [LogByteSizeMergePolicy: minMergeSize=1677721, mergeFactor=10, maxMergeSize=2147483648, maxMergeSizeForForcedMerge=9223372036854775807, calibrateSizeByDeletes=false, maxMergeDocs=2147483647, maxCFSSegmentSizeMB=8.796093022207999E12, noCFSRatio=0.0]
   [junit4]   2> 1781892 INFO  (coreLoadExecutor-3773-thread-3) [    x:collection5] o.a.s.s.SolrIndexSearcher Opening [Searcher@15c9537d[collection5] main]
   [junit4]   2> 1781892 INFO  (coreLoadExecutor-3773-thread-2) [    x:collection2] o.a.s.s.SolrIndexSearcher Opening [Searcher@6ef0c948[collection2] main]
   [junit4]   2> 1781892 INFO  (coreLoadExecutor-3773-thread-2) [    x:collection2] o.a.s.r.ManagedResourceStorage File-based storage initialized to use dir: /Users/jenkins/workspace/Lucene-Solr-master-MacOSX/solr/build/solr-core/test/J0/temp/solr.core.TestLazyCores_59AE304D60FF3D46-001/tempDir-001/collection2/conf
   [junit4]   2> 1781893 INFO  (coreLoadExecutor-3773-thread-3) [    x:collection5] o.a.s.r.ManagedResourceStorage File-based storage initialized to use dir: /Users/jenkins/workspace/Lucene-Solr-master-MacOSX/solr/build/solr-core/test/J0/temp/solr.core.TestLazyCores_59AE304D60FF3D46-001/tempDir-001/collection5/conf
   [junit4]   2> 1781893 INFO  (coreLoadExecutor-3773-thread-2) [    x:collection2] o.a.s.h.ReplicationHandler Commits will be reserved for  10000
   [junit4]   2> 1781893 INFO  (coreLoadExecutor-3773-thread-3) [    x:collection5] o.a.s.h.ReplicationHandler Commits will be reserved for  10000
   [junit4]   2> 1781893 INFO  (coreLoadExecutor-3773-thread-2) [    x:collection2] o.a.s.c.SolrCores Opening transient core collection2
   [junit4]   2> 1781894 INFO  (searcherExecutor-3774-thread-1-processing-x:collection5) [    x:collection5] o.a.s.c.SolrCore [collection5] Registered new searcher Searcher@15c9537d[collection5] main{ExitableDirectoryReader(UninvertingDirectoryReader())}
   [junit4]   2> 1781894 INFO  (searcherExecutor-3776-thread-1-processing-x:collection2) [    x:collection2] o.a.s.c.SolrCore [collection2] Registered new searcher Searcher@6ef0c948[collection2] main{ExitableDirectoryReader(UninvertingDirectoryReader())}
   [junit4]   2> 1781894 INFO  (coreLoadExecutor-3773-thread-1) [    x:collection1] o.a.s.s.SolrIndexSearcher Opening [Searcher@e60ef73[collection1] main]
   [junit4]   2> 1781894 INFO  (coreLoadExecutor-3773-thread-1) [    x:collection1] o.a.s.r.ManagedResourceStorage File-based storage initialized to use dir: /Users/jenkins/workspace/Lucene-Solr-master-MacOSX/solr/build/solr-core/test/J0/temp/solr.core.TestLazyCores_59AE304D60FF3D46-001/tempDir-001/collection1/conf
   [junit4]   2> 1781895 INFO  (coreLoadExecutor-3773-thread-1) [    x:collection1] o.a.s.h.ReplicationHandler Commits will be reserved for  10000
   [junit4]   2> 1781895 INFO  (searcherExecutor-3775-thread-1-processing-x:collection1) [    x:collection1] o.a.s.c.SolrCore [collection1] Registered new searcher Searcher@e60ef73[collection1] main{ExitableDirectoryReader(UninvertingDirectoryReader())}
   [junit4]   2> 1781918 INFO  (TEST-TestLazyCores.testCreateTransientFromAdmin-seed#[59AE304D60FF3D46]) [    ] o.a.s.h.a.CoreAdminOperation core create command loadOnStartup=true&transient=true&name=core1&action=CREATE&wt=xml
   [junit4]   2> 1781934 INFO  (TEST-TestLazyCores.testCreateTransientFromAdmin-seed#[59AE304D60FF3D46]) [    x:core1] o.a.s.c.SolrConfig Using Lucene MatchVersion: 7.0.0
   [junit4]   2> 1781940 INFO  (TEST-TestLazyCores.testCreateTransientFromAdmin-seed#[59AE304D60FF3D46]) [    x:core1] o.a.s.s.IndexSchema [core1] Schema name=tiny
   [junit4]   2> 1781945 INFO  (TEST-TestLazyCores.testCreateTransientFromAdmin-seed#[59AE304D60FF3D46]) [    x:core1] o.a.s.s.IndexSchema Loaded schema tiny/1.1 with uniqueid field id
   [junit4]   2> 1781948 INFO  (TEST-TestLazyCores.testCreateTransientFromAdmin-seed#[59AE304D60FF3D46]) [    x:core1] o.a.s.c.CoreContainer Creating SolrCore 'core1' using configuration from instancedir /Users/jenkins/workspace/Lucene-Solr-master-MacOSX/solr/build/solr-core/test/J0/temp/solr.core.TestLazyCores_59AE304D60FF3D46-001/tempDir-001/core1
   [junit4]   2> 1781948 INFO  (TEST-TestLazyCores.testCreateTransientFromAdmin-seed#[59AE304D60FF3D46]) [    x:core1] o.a.s.c.SolrCore [[core1] ] Opening new SolrCore at [/Users/jenkins/workspace/Lucene-Solr-master-MacOSX/solr/build/solr-core/test/J0/temp/solr.core.TestLazyCores_59AE304D60FF3D46-001/tempDir-001/core1], dataDir=[/Users/jenkins/workspace/Lucene-Solr-master-MacOSX/solr/build/solr-core/test/J0/temp/solr.core.TestLazyCores_59AE304D60FF3D46-001/tempDir-001/core1/data/]
   [junit4]   2> 1781951 INFO  (TEST-TestLazyCores.testCreateTransientFromAdmin-seed#[59AE304D60FF3D46]) [    x:core1] o.a.s.u.RandomMergePolicy RandomMergePolicy wrapping class org.apache.lucene.index.LogDocMergePolicy: [LogDocMergePolicy: minMergeSize=1000, mergeFactor=49, maxMergeSize=9223372036854775807, maxMergeSizeForForcedMerge=9223372036854775807, calibrateSizeByDeletes=true, maxMergeDocs=2147483647, maxCFSSegmentSizeMB=8.796093022207999E12, noCFSRatio=1.0]
   [junit4]   2> 1782012 INFO  (TEST-TestLazyCores.testCreateTransientFromAdmin-seed#[59AE304D60FF3D46]) [    x:core1] o.a.s.u.CommitTracker Hard AutoCommit: disabled
   [junit4]   2> 1782012 INFO  (TEST-TestLazyCores.testCreateTransientFromAdmin-seed#[59AE304D60FF3D46]) [    x:core1] o.a.s.u.CommitTracker Soft AutoCommit: disabled
   [junit4]   2> 1782013 INFO  (TEST-TestLazyCores.testCreateTransientFromAdmin-seed#[59AE304D60FF3D46]) [    x:core1] o.a.s.u.RandomMergePolicy RandomMergePolicy wrapping class org.apache.lucene.index.TieredMergePolicy: [TieredMergePolicy: maxMergeAtOnce=24, maxMergeAtOnceExplicit=50, maxMergedSegmentMB=27.388671875, floorSegmentMB=0.953125, forceMergeDeletesPctAllowed=6.737827246473503, segmentsPerTier=13.0, maxCFSSegmentSizeMB=8.796093022207999E12, noCFSRatio=0.0
   [junit4]   2> 1782013 INFO  (TEST-TestLazyCores.testCreateTransientFromAdmin-seed#[59AE304D60FF3D46]) [    x:core1] o.a.s.s.SolrIndexSearcher Opening [Searcher@1d27224c[core1] main]
   [junit4]   2> 1782014 INFO  (TEST-TestLazyCores.testCreateTransientFromAdmin-seed#[59AE304D60FF3D46]) [    x:core1] o.a.s.r.ManagedResourceStorage File-based storage initialized to use dir: /Users/jenkins/workspace/Lucene-Solr-master-MacOSX/solr/build/solr-core/test/J0/temp/solr.core.TestLazyCores_59AE304D60FF3D46-001/tempDir-001/core1/conf
   [junit4]   2> 1782014 INFO  (TEST-TestLazyCores.testCreateTransientFromAdmin-seed#[59AE304D60FF3D46]) [    x:core1] o.a.s.h.ReplicationHandler Commits will be reserved for  10000
   [junit4]   2> 1782014 INFO  (searcherExecutor-3787-thread-1-processing-x:core1) [    x:core1] o.a.s.c.SolrCore [core1] Registered new searcher Searcher@1d27224c[core1] main{ExitableDirectoryReader(UninvertingDirectoryReader())}
   [junit4]   2> 1782015 INFO  (TEST-TestLazyCores.testCreateTransientFromAdmin-seed#[59AE304D60FF3D46]) [    x:core1] o.a.s.c.SolrCores Opening transient core core1
   [junit4]   2> 1782015 INFO  (TEST-TestLazyCores.testCreateTransientFromAdmin-seed#[59AE304D60FF3D46]) [    x:core1] o.a.s.h.a.CoreAdminOperation core create command loadOnStartup=false&transient=true&name=core2&action=CREATE&wt=xml
   [junit4]   2> 1782029 INFO  (TEST-TestLazyCores.testCreateTransientFromAdmin-seed#[59AE304D60FF3D46]) [    x:core1] o.a.s.c.SolrConfig Using Lucene MatchVersion: 7.0.0
   [junit4]   2> 1782035 INFO  (TEST-TestLazyCores.testCreateTransientFromAdmin-seed#[59AE304D60FF3D46]) [    x:core1] o.a.s.s.IndexSchema [core2] Schema name=tiny
   [junit4]   2> 1782048 INFO  (TEST-TestLazyCores.testCreateTransientFromAdmin-seed#[59AE304D60FF3D46]) [    x:core1] o.a.s.s.IndexSchema Loaded schema tiny/1.1 with uniqueid field id
   [junit4]   2> 1782054 INFO  (TEST-TestLazyCores.testCreateTransientFromAdmin-seed#[59AE304D60FF3D46]) [    x:core1] o.a.s.c.CoreContainer Creating SolrCore 'core2' using configuration from instancedir /Users/jenkins/workspace/Lucene-Solr-master-MacOSX/solr/build/solr-core/test/J0/temp/solr.core.TestLazyCores_59AE304D60FF3D46-001/tempDir-001/core2
   [junit4]   2> 1782055 INFO  (TEST-TestLazyCores.testCreateTransientFromAdmin-seed#[59AE304D60FF3D46]) [    x:core1] o.a.s.c.SolrCore [[core2] ] Opening new SolrCore at [/Users/jenkins/workspace/Lucene-Solr-master-MacOSX/solr/build/solr-core/test/J0/temp/solr.core.TestLazyCores_59AE304D60FF3D46-001/tempDir-001/core2], dataDir=[/Users/jenkins/workspace/Lucene-Solr-master-MacOSX/solr/build/solr-core/test/J0/temp/solr.core.TestLazyCores_59AE304D60FF3D46-001/tempDir-001/core2/data/]
   [junit4]   2> 1782059 INFO  (TEST-TestLazyCores.testCreateTransientFromAdmin-seed#[59AE304D60FF3D46]) [    x:core1] o.a.s.u.RandomMergePolicy RandomMergePolicy wrapping class org.apache.lucene.index.AlcoholicMergePolicy: [AlcoholicMergePolicy: minMergeSize=0, mergeFactor=10, maxMergeSize=683426718, maxMergeSizeForForcedMerge=9223372036854775807, calibrateSizeByDeletes=true, maxMergeDocs=2147483647, maxCFSSegmentSizeMB=8.796093022207999E12, noCFSRatio=0.1]
   [junit4]   2> 1782126 INFO  (TEST-TestLazyCores.testCreateTransientFromAdmin-seed#[59AE304D60FF3D46]) [    x:core1] o.a.s.u.CommitTracker Hard AutoCommit: disabled
   [junit4]   2> 1782126 INFO  (TEST-TestLazyCores.testCreateTransientFromAdmin-seed#[59AE304D60FF3D46]) [    x:core1] o.a.s.u.CommitTracker Soft AutoCommit: disabled
   [junit4]   2> 1782127 INFO  (TEST-TestLazyCores.testCreateTransientFromAdmin-seed#[59AE304D60FF3D46]) [    x:core1] o.a.s.u.RandomMergePolicy RandomMergePolicy wrapping class org.apache.lucene.index.TieredMergePolicy: [TieredMergePolicy: maxMergeAtOnce=13, maxMergeAtOnceExplicit=10, maxMergedSegmentMB=57.9892578125, floorSegmentMB=0.7041015625, forceMergeDeletesPctAllowed=29.559928710167224, segmentsPerTier=47.0, maxCFSSegmentSizeMB=8.796093022207999E12, noCFSRatio=0.43821023908663725
   [junit4]   2> 1782128 INFO  (TEST-TestLazyCores.testCreateTransientFromAdmin-seed#[59AE304D60FF3D46]) [    x:core1] o.a.s.s.SolrIndexSearcher Opening [Searcher@2bc10b87[core2] main]
   [junit4]   2> 1782128 INFO  (TEST-TestLazyCores.testCreateTransientFromAdmin-seed#[59AE304D60FF3D46]) [    x:core1] o.a.s.r.ManagedResourceStorage File-based storage initialized to use dir: /Users/jenkins/workspace/Lucene-Solr-master-MacOSX/solr/build/solr-core/test/J0/temp/solr.core.TestLazyCores_59AE304D60FF3D46-001/tempDir-001/core2/conf
   [junit4]   2> 1782128 INFO  (TEST-TestLazyCores.testCreateTransientFromAdmin-seed#[59AE304D60FF3D46]) [    x:core1] o.a.s.h.ReplicationHandler Commits will be reserved for  10000
   [junit4]   2> 1782129 INFO  (searcherExecutor-3792-thread-1-processing-x:core1) [    x:core1] o.a.s.c.SolrCore [core2] Registered new searcher Searcher@2bc10b87[core2] main{ExitableDirectoryReader(UninvertingDirectoryReader())}
   [junit4]   2> 1782129 INFO  (TEST-TestLazyCores.testCreateTransientFromAdmin-seed#[59AE304D60FF3D46]) [    x:core1] o.a.s.c.SolrCores Opening transient core core2
   [junit4]   2> 1782129 INFO  (TEST-TestLazyCores.testCreateTransientFromAdmin-seed#[59AE304D60FF3D46]) [    x:core1] o.a.s.h.a.CoreAdminOperation core create command loadOnStartup=true&transient=true&name=core3&action=CREATE&wt=xml
   [junit4]   2> 1782141 INFO  (TEST-TestLazyCores.testCreateTransientFromAdmin-seed#[59AE304D60FF3D46]) [    x:core1] o.a.s.c.SolrConfig Using Lucene MatchVersion: 7.0.0
   [junit4]   2> 1782147 INFO  (TEST-TestLazyCores.testCreateTransientFromAdmin-seed#[59AE304D60FF3D46]) [    x:core1] o.a.s.s.IndexSchema [core3] Schema name=tiny
   [junit4]   2> 1782150 INFO  (TEST-TestLazyCores.testCreateTransientFromAdmin-seed#[59AE304D60FF3D46]) [    x:core1] o.a.s.s.IndexSchema Loaded schema tiny/1.1 with uniqueid field id
   [junit4]   2> 1782153 INFO  (TEST-TestLazyCores.testCreateTransientFromAdmin-seed#[59AE304D60FF3D46]) [    x:core1] o.a.s.c.CoreContainer Creating SolrCore 'core3' using configuration from instancedir /Users/jenkins/workspace/Lucene-Solr-master-MacOSX/solr/build/solr-core/test/J0/temp/solr.core.TestLazyCores_59AE304D60FF3D46-001/tempDir-001/core3
   [junit4]   2> 1782154 INFO  (TEST-TestLazyCores.testCreateTransientFromAdmin-seed#[59AE304D60FF3D46]) [    x:core1] o.a.s.c.SolrCore [[core3] ] Opening new SolrCore at [/Users/jenkins/workspace/Lucene-Solr-master-MacOSX/solr/build/solr-core/test/J0/temp/solr.core.TestLazyCores_59AE304D60FF3D46-001/tempDir-001/core3], dataDir=[/Users/jenkins/workspace/Lucene-Solr-master-MacOSX/solr/build/solr-core/test/J0/temp/solr.core.TestLazyCores_59AE304D60FF3D46-001/tempDir-001/core3/data/]
   [junit4]   2> 1782156 INFO  (TEST-TestLazyCores.testCreateTransientFromAdmin-seed#[59AE304D60FF3D46]) [    x:core1] o.a.s.u.RandomMergePolicy RandomMergePolicy wrapping class org.apache.lucene.index.LogDocMergePolicy: [LogDocMergePolicy: minMergeSize=1000, mergeFactor=21, maxMergeSize=9223372036854775807, maxMergeSizeForForcedMerge=9223372036854775807, calibrateSizeByDeletes=false, maxMergeDocs=2147483647, maxCFSSegmentSizeMB=8.796093022207999E12, noCFSRatio=0.7439572040505582]
   [junit4]   2> 1782224 INFO  (TEST-TestLazyCores.testCreateTransientFromAdmin-seed#[59AE304D60FF3D46]) [    x:core1] o.a.s.u.CommitTracker Hard AutoCommit: disabled
   [junit4]   2> 1782224 INFO  (TEST-TestLazyCores.testCreateTransientFromAdmin-seed#[59AE304D60FF3D46]) [    x:core1] o.a.s.u.CommitTracker Soft AutoCommit: disabled
   [junit4]   2> 1782224 INFO  (TEST-TestLazyCores.testCreateTransientFromAdmin-seed#[59AE304D60FF3D46]) [    x:core1] o.a.s.u.RandomMergePolicy RandomMergePolicy wrapping class org.apache.lucene.index.AlcoholicMergePolicy: [AlcoholicMergePolicy: minMergeSize=0, mergeFactor=10, maxMergeSize=839824161, maxMergeSizeForForcedMerge=9223372036854775807, calibrateSizeByDeletes=true, maxMergeDocs=2147483647, maxCFSSegmentSizeMB=8.796093022207999E12, noCFSRatio=0.1]
   [junit4]   2> 1782226 INFO  (TEST-TestLazyCores.testCreateTransientFromAdmin-seed#[59AE304D60FF3D46]) [    x:core1] o.a.s.s.SolrIndexSearcher Opening [Searcher@175ff952[core3] main]
   [junit4]   2> 1782226 INFO  (TEST-TestLazyCores.testCreateTransientFromAdmin-seed#[59AE304D60FF3D46]) [    x:core1] o.a.s.r.ManagedResourceStorage File-based storage initialized to use dir: /Users/jenkins/workspace/Lucene-Solr-master-MacOSX/solr/build/solr-core/test/J0/temp/solr.core.TestLazyCores_59AE304D60FF3D46-001/tempDir-001/core3/conf
   [junit4]   2> 1782226 INFO  (TEST-TestLazyCores.testCreateTransientFromAdmin-seed#[59AE304D60FF3D46]) [    x:core1] o.a.s.h.ReplicationHandler Commits will be reserved for  10000
   [junit4]   2> 1782227 INFO  (searcherExecutor-3797-thread-1-processing-x:core1) [    x:core1] o.a.s.c.SolrCore [core3] Registered new searcher Searcher@175ff952[core3] main{ExitableDirectoryReader(UninvertingDirectoryReader())}
   [junit4]   2> 1782227 INFO  (TEST-TestLazyCores.testCreateTransientFromAdmin-seed#[59AE304D60FF3D46]) [    x:core1] o.a.s.c.SolrCores Opening transient core core3
   [junit4]   2> 1782227 INFO  (TEST-TestLazyCores.testCreateTransientFromAdmin-seed#[59AE304D60FF3D46]) [    x:core1] o.a.s.h.a.CoreAdminOperation core create command loadOnStartup=false&transient=true&name=core4&action=CREATE&wt=xml
   [junit4]   2> 1782246 INFO  (TEST-TestLazyCores.testCreateTransientFromAdmin-seed#[59AE304D60FF3D46]) [    x:core1] o.a.s.c.SolrConfig Using Lucene MatchVersion: 7.0.0
   [junit4]   2> 1782255 INFO  (TEST-TestLazyCores.testCreateTransientFromAdmin-seed#[59AE304D60FF3D46]) [    x:core1] o.a.s.s.IndexSchema [core4] Schema name=tiny
   [junit4]   2> 1782260 INFO  (TEST-TestLazyCores.testCreateTransientFromAdmin-seed#[59AE304D60FF3D46]) [    x:core1] o.a.s.s.IndexSchema Loaded schema tiny/1.1 with uniqueid field id
   [junit4]   2> 1782265 INFO  (TEST-TestLazyCores.testCreateTransientFromAdmin-seed#[59AE304D60FF3D46]) [    x:core1] o.a.s.c.CoreContainer Creating SolrCore 'core4' using configuration from instancedir /Users/jenkins/workspace/Lucene-Solr-master-MacOSX/solr/build/solr-core/test/J0/temp/solr.core.TestLazyCores_59AE304D60FF3D46-001/tempDir-001/core4
   [junit4]   2> 1782266 INFO  (TEST-TestLazyCores.testCreateTransientFromAdmin-seed#[59AE304D60FF3D46]) [    x:core1] o.a.s.c.SolrCore [[core4] ] Opening new SolrCore at [/Users/jenkins/workspace/Lucene-Solr-master-MacOSX/solr/build/solr-core/test/J0/temp/solr.core.TestLazyCores_59AE304D60FF3D46-001/tempDir-001/core4], dataDir=[/Users/jenkins/workspace/Lucene-Solr-master-MacOSX/solr/build/solr-core/test/J0/temp/solr.core.TestLazyCores_59AE304D60FF3D46-001/tempDir-001/core4/data/]
   [junit4]   2> 1782269 INFO  (TEST-TestLazyCores.testCreateTransientFromAdmin-seed#[59AE304D60FF3D46]) [    x:core1] o.a.s.u.RandomMergePolicy RandomMergePolicy wrapping class org.apache.lucene.index.LogByteSizeMergePolicy: [LogByteSizeMergePolicy: minMergeSize=1677721, mergeFactor=17, maxMergeSize=2147483648, maxMergeSizeForForcedMerge=9223372036854775807, calibrateSizeByDeletes=false, maxMergeDocs=2147483647, maxCFSSegmentSizeMB=8.796093022207999E12, noCFSRatio=0.27542011496171426]
   [junit4]   2> 1782343 INFO  (TEST-TestLazyCores.testCreateTransientFromAdmin-seed#[59AE304D60FF3D46]) [    x:core1] o.a.s.u.CommitTracker Hard AutoCommit: disabled
   [junit4]   2> 1782343 INFO  (TEST-TestLazyCores.testCreateTransientFromAdmin-seed#[59AE304D60FF3D46]) [    x:core1] o.a.s.u.CommitTracker Soft AutoCommit: disabled
   [junit4]   2> 1782343 INFO  (TEST-TestLazyCores.testCreateTransientFromAdmin-seed#[59AE304D60FF3D46]) [    x:core1] o.a.s.u.RandomMergePolicy RandomMergePolicy wrapping class org.apache.lucene.index.TieredMergePolicy: [TieredMergePolicy: maxMergeAtOnce=11, maxMergeAtOnceExplicit=18, maxMergedSegmentMB=32.9794921875, floorSegmentMB=1.771484375, forceMergeDeletesPctAllowed=1.71783767404449, segmentsPerTier=48.0, maxCFSSegmentSizeMB=8.796093022207999E12, noCFSRatio=0.5972593854452207
   [junit4]   2> 1782345 INFO  (TEST-TestLazyCores.testCreateTransientFromAdmin-seed#[59AE304D60FF3D46]) [    x:core1] o.a.s.s.SolrIndexSearcher Opening [Searcher@1c407b84[core4] main]
   [junit4]   2> 1782345 INFO  (TEST-TestLazyCores.testCreateTransientFromAdmin-seed#[59AE304D60FF3D46]) [    x:core1] o.a.s.r.ManagedResourceStorage File-based storage initialized to use dir: /Users/jenkins/workspace/Lucene-Solr-master-MacOSX/solr/build/solr-core/test/J0/temp/solr.core.TestLazyCores_59AE304D60FF3D46-001/tempDir-001/core4/conf
   [junit4]   2> 1782346 INFO  (TEST-TestLazyCores.testCreateTransientFromAdmin-seed#[59AE304D60FF3D46]) [    x:core1] o.a.s.h.ReplicationHandler Commits will be reserved for  10000
   [junit4]   2> 1782346 INFO  (searcherExecutor-3802-thread-1-processing-x:core1) [    x:core1] o.a.s.c.SolrCore [core4] Registered new searcher Searcher@1c407b84[core4] main{ExitableDirectoryReader(UninvertingDirectoryReader())}
   [junit4]   2> 1782346 INFO  (TEST-TestLazyCores.testCreateTransientFromAdmin-seed#[59AE304D60FF3D46]) [    x:core1] o.a.s.c.SolrCores Opening transient core core4
   [junit4]   2> 1782346 INFO  (TEST-TestLazyCores.testCreateTransientFromAdmin-seed#[59AE304D60FF3D46]) [    x:core1] o.a.s.c.SolrCores Closing transient core [collection2]
   [junit4]   2> 1782347 INFO  (Thread-1982) [    ] o.a.s.c.SolrCore [collection2]  CLOSING SolrCore org.apache.solr.core.SolrCore@6d8aa4a
   [junit4]   2> 1782347 INFO  (TEST-TestLazyCores.testCreateTransientFromAdmin-seed#[59AE304D60FF3D46]) [    x:core1] o.a.s.h.a.CoreAdminOperation core create command loadOnStartup=false&transient=true&name=core5&action=CREATE&wt=xml
   [junit4]   2> 1782348 INFO  (Thread-1982) [    ] o.a.s.m.SolrMetricManager Closing metric reporters for: solr.core.collection2
   [junit4]   2> 1782376 INFO  (TEST-TestLazyCores.testCreateTransientFromAdmin-seed#[59AE304D60FF3D46]) [    x:core1] o.a.s.c.SolrConfig Using Lucene MatchVersion: 7.0.0
   [junit4]   2> 1782382 INFO  (TEST-TestLazyCores.testCreateTransientFromAdmin-seed#[59AE304D60FF3D46]) [    x:core1] o.a.s.s.IndexSchema [core5] Schema name=tiny
   [junit4]   2> 1782385 INFO  (TEST-TestLazyCores.testCreateTransientFromAdmin-seed#[59AE304D60FF3D46]) [    x:core1] o.a.s.s.IndexSchema Loaded schema tiny/1.1 with uniqueid field id
   [junit4]   2> 1782389 INFO  (TEST-TestLazyCores.testCreateTransientFromAdmin-seed#[59AE304D60FF3D46]) [    x:core1] o.a.s.c.CoreContainer Creating SolrCore 'core5' using configuration from instancedir /Users/jenkins/workspace/Lucene-Solr-master-MacOSX/solr/build/solr-core/test/J0/temp/solr.core.TestLazyCores_59AE304D60FF3D46-001/tempDir-001/core5
   [junit4]   2> 1782389 INFO  (TEST-TestLazyCores.testCreateTransientFromAdmin-seed#[59AE304D60FF3D46]) [    x:core1] o.a.s.c.SolrCore [[core5] ] Opening new SolrCore at [/Users/jenkins/workspace/Lucene-Solr-master-MacOSX/solr/build/solr-core/test/J0/temp/solr.core.TestLazyCores_59AE304D60FF3D46-001/tempDir-001/core5], dataDir=[/Users/jenkins/workspace/Lucene-Solr-master-MacOSX/solr/build/solr-core/test/J0/temp/solr.core.TestLazyCores_59AE304D60FF3D46-001/tempDir-001/core5/data/]
   [junit4]   2> 1782392 INFO  (TEST-TestLazyCores.testCreateTransientFromAdmin-seed#[59AE304D60FF3D46]) [    x:core1] o.a.s.u.RandomMergePolicy RandomMergePolicy wrapping class org.apache.lucene.index.LogByteSizeMergePolicy: [LogByteSizeMergePolicy: minMergeSize=1677721, mergeFactor=30, maxMergeSize=2147483648, maxMergeSizeForForcedMerge=9223372036854775807, calibrateSizeByDeletes=false, maxMergeDocs=2147483647, maxCFSSegmentSizeMB=8.796093022207999E12, noCFSRatio=0.6063172945228661]
   [junit4]   2> 1782457 INFO  (TEST-TestLazyCores.testCreateTransientFromAdmin-seed#[59AE304D60FF3D46]) [    x:core1] o.a.s.u.CommitTracker Hard AutoCommit: disabled
   [junit4]   2> 1782457 INFO  (TEST-TestLazyCores.testCreateTransientFromAdmin-seed#[59AE304D60FF3D46]) [    x:core1] o.a.s.u.CommitTracker Soft AutoCommit: disabled
   [junit4]   2> 1782457 INFO  (TEST-TestLazyCores.testCreateTransientFromAdmin-seed#[59AE304D60FF3D46]) [    x:core1] o.a.s.u.RandomMergePolicy RandomMergePolicy wrapping class org.apache.lucene.index.LogDocMergePolicy: [LogDocMergePolicy: minMergeSize=1000, mergeFactor=31, maxMergeSize=9223372036854775807, maxMergeSizeForForcedMerge=9223372036854775807, calibrateSizeByDeletes=true, maxMergeDocs=2147483647, maxCFSSegmentSizeMB=8.796093022207999E12, noCFSRatio=0.8567274669161578]
   [junit4]   2> 1782458 INFO  (TEST-TestLazyCores.testCreateTransientFromAdmin-seed#[59AE304D60FF3D46]) [    x:core1] o.a.s.s.SolrIndexSearcher Opening [Searcher@122cf66c[core5] main]
   [junit4]   2> 1782459 INFO  (TEST-TestLazyCores.testCreateTransientFromAdmin-seed#[59AE304D60FF3D46]) [    x:core1] o.a.s.r.ManagedResourceStorage File-based storage initialized to use dir: /Users/jenkins/workspace/Lucene-Solr-master-MacOSX/solr/build/solr-core/test/J0/temp/solr.core.TestLazyCores_59AE304D60FF3D46-001/tempDir-001/core5/conf
   [junit4]   2> 1782459 INFO  (TEST-TestLazyCores.testCreateTransientFromAdmin-seed#[59AE304D60FF3D46]) [    x:core1] o.a.s.h.ReplicationHandler Commits will be reserved for  10000
   [junit4]   2> 1782460 INFO  (searcherExecutor-3807-thread-1-processing-x:core1) [    x:core1] o.a.s.c.SolrCore [core5] Registered new searcher Searcher@122cf66c[core5] main{ExitableDirectoryReader(UninvertingDirectoryReader())}
   [junit4]   2> 1782460 INFO  (TEST-TestLazyCores.testCreateTransientFromAdmin-seed#[59AE304D60FF3D46]) [    x:core1] o.a.s.c.SolrCores Opening transient core core5
   [junit4]   2> 1782460 INFO  (TEST-TestLazyCores.testCreateTransientFromAdmin-seed#[59AE304D60FF3D46]) [    x:core1] o.a.s.c.SolrCores Closing transient core [core1]
   [junit4]   2> 1782460 INFO  (Thread-1982) [    ] o.a.s.c.SolrCore [core1]  CLOSING SolrCore org.apache.solr.core.SolrCore@576535f0
   [junit4]   2> 1782462 INFO  (Thread-1982) [    ] o.a.s.m.SolrMetricManager Closing metric reporters for: solr.core.core1
   [junit4]   2> 1782476 INFO  (TEST-TestLazyCores.testCreateTransientFromAdmin-seed#[59AE304D60FF3D46]) [    x:core1] o.a.s.c.SolrConfig Using Lucene MatchVersion: 7.0.0
   [junit4]   2> 1782482 INFO  (TEST-TestLazyCores.testCreateTransientFromAdmin-seed#[59AE304D60FF3D46]) [    x:core1] o.a.s.s.IndexSchema [core1] Schema name=tiny
   [junit4]   2> 1782486 INFO  (TEST-TestLazyCores.testCreateTransientFromAdmin-seed#[59AE304D60FF3D46]) [    x:core1] o.a.s.s.IndexSchema Loaded schema tiny/1.1 with uniqueid field id
   [junit4]   2> 1782489 INFO  (TEST-TestLazyCores.testCreateTransientFromAdmin-seed#[59AE304D60FF3D46]) [    x:core1] o.a.s.c.CoreContainer Creating SolrCore 'core1' using configuration from instancedir /Users/jenkins/workspace/Lucene-Solr-master-MacOSX/solr/build/solr-core/test/J0/temp/solr.core.TestLazyCores_59AE304D60FF3D46-001/tempDir-001/core1
   [junit4]   2> 1782490 INFO  (TEST-TestLazyCores.testCreateTransientFromAdmin-seed#[59AE304D60FF3D46]) [    x:core1] o.a.s.c.SolrCore [[core1] ] Opening new SolrCore at [/Users/jenkins/workspace/Lucene-Solr-master-MacOSX/solr/build/solr-core/test/J0/temp/solr.core.TestLazyCores_59AE304D60FF3D46-001/tempDir-001/core1], dataDir=[/Users/jenkins/workspace/Lucene-Solr-master-MacOSX/solr/build/solr-core/test/J0/temp/solr.core.TestLazyCores_59AE304D60FF3D46-001/tempDir-001/core1/data/]
   [junit4]   2> 1782547 INFO  (TEST-TestLazyCores.testCreateTransientFromAdmin-seed#[59AE304D60FF3D46]) [    x:core1] o.a.s.u.CommitTracker Hard AutoCommit: disabled
   [junit4]   2> 1782547 INFO  (TEST-TestLazyCores.testCreateTransientFromAdmin-seed#[59AE304D60FF3D46]) [    x:core1] o.a.s.u.CommitTracker Soft AutoCommit: disabled
   [junit4]   2> 1782549 INFO  (TEST-TestLazyCores.testCreateTransientFromAdmin-seed#[59AE304D60FF3D46]) [    x:core1] o.a.s.u.RandomMergePolicy RandomMergePolicy wrapping class org.apache.lucene.index.TieredMergePolicy: [TieredMergePolicy: maxMergeAtOnce=22, maxMergeAtOnceExplicit=27, maxMergedSegmentMB=93.087890625, floorSegmentMB=0.236328125, forceMergeDeletesPctAllowed=20.157259956214567, segmentsPerTier=45.0, maxCFSSegmentSizeMB=8.796093022207999E12, noCFSRatio=0.541048004126412
   [junit4]   2> 1782550 INFO  (TEST-TestLazyCores.testCreateTransientFromAdmin-seed#[59AE304D60FF3D46]) [    x:core1] o.a.s.s.SolrIndexSearcher Opening [Searcher@10f6ea8[core1] main]
   [junit4]   2> 1782550 INFO  (TEST-TestLazyCores.testCreateTransientFromAdmin-seed#[59AE304D60FF3D46]) [    x:core1] o.a.s.r.ManagedResourceStorage File-based storage initialized to use dir: /Users/jenkins/workspace/Lucene-Solr-master-MacOSX/solr/build/solr-core/test/J0/temp/solr.core.TestLazyCores_59AE304D60FF3D46-001/tempDir-001/core1/conf
   [junit4]   2> 1782550 INFO  (TEST-TestLazyCores.testCreateTransientFromAdmin-seed#[59AE304D60FF3D46]) [    x:core1] o.a.s.h.ReplicationHandler Commits will be reserved for  10000
   [junit4]   2> 1782550 INFO  (searcherExecutor-3811-thread-1-processing-x:core1) [    x:core1] o.a.s.c.SolrCore [core1] Registered new searcher Searcher@10f6ea8[core1] main{ExitableDirectoryReader(UninvertingDirectoryReader())}
   [junit4]   2> 1782551 INFO  (TEST-TestLazyCores.testCreateTransientFromAdmin-seed#[59AE304D60FF3D46]) [    x:core1] o.a.s.c.SolrCores Opening transient core core1
   [junit4]   2> 1782551 INFO  (TEST-TestLazyCores.testCreateTransientFromAdmin-seed#[59AE304D60FF3D46]) [    x:core1] o.a.s.c.SolrCores Closing transient core [core2]
   [junit4]   2> 1782551 INFO  (Thread-1982) [    ] o.a.s.c.SolrCore [core2]  CLOSING SolrCore org.apache.solr.core.SolrCore@d81a5b4
   [junit4]   2> 1782552 INFO  (Thread-1982) [    ] o.a.s.m.SolrMetricManager Closing metric reporters for: solr.core.core2
   [junit4]   2> 1782566 INFO  (TEST-TestLazyCores.testCreateTransientFromAdmin-seed#[59AE304D60FF3D46]) [    x:core1] o.a.s.c.SolrConfig Using Lucene MatchVersion: 7.0.0
   [junit4]   2> 1782582 INFO  (TEST-TestLazyCores.testCreateTransientFromAdmin-seed#[59AE304D60FF3D46]) [    x:core1] o.a.s.s.IndexSchema [core2] Schema name=tiny
   [junit4]   2> 1782587 INFO  (TEST-TestLazyCores.testCreateTransientFromAdmin-seed#[59AE304D60FF3D46]) [    x:core1] o.a.s.s.IndexSchema Loaded schema tiny/1.1 with uniqueid field id
   [junit4]   2> 1782593 INFO  (TEST-TestLazyCores.testCreateTransientFromAdmin-seed#[59AE304D60FF3D46]) [    x:core1] o.a.s.c.CoreContainer Creating SolrCore 'core2' using configuration from instancedir /Users/jenkins/workspace/Lucene-Solr-master-MacOSX/solr/build/solr-core/test/J0/temp/solr.core.TestLazyCores_59AE304D60FF3D46-001/tempDir-001/core2
   [junit4]   2> 1782594 INFO  (TEST-TestLazyCores.testCreateTransientFromAdmin-seed#[59AE304D60FF3D46]) [    x:core1] o.a.s.c.SolrCore [[core2] ] Opening new SolrCore at [/Users/jenkins/workspace/Lucene-Solr-master-MacOSX/solr/build/solr-core/test/J0/temp/solr.core.TestLazyCores_59AE304D60FF3D46-001/tempDir-001/core2], dataDir=[/Users/jenkins/workspace/Lucene-Solr-master-MacOSX/solr/build/solr-core/test/J0/temp/solr.core.TestLazyCores_59AE304D60FF3D46-001/tempDir-001/core2/data/]
   [junit4]   2> 1782667 INFO  (TEST-TestLazyCores.testCreateTransientFromAdmin-seed#[59AE304D60FF3D46]) [    x:core1] o.a.s.u.CommitTracker Hard AutoCommit: disabled
   [junit4]   2> 1782667 INFO  (TEST-TestLazyCores.testCreateTransientFromAdmin-seed#[59AE304D60FF3D46]) [    x:core1] o.a.s.u.CommitTracker Soft AutoCommit: disabled
   [junit4]   2> 1782668 INFO  (TEST-TestLazyCores.testCreateTransientFromAdmin-seed#[59AE304D60FF3D46]) [    x:core1] o.a.s.u.RandomMergePolicy RandomMergePolicy wrapping class org.apache.lucene.index.AlcoholicMergePolicy: [AlcoholicMergePolicy: minMergeSize=0, mergeFactor=10, maxMergeSize=1483864360, maxMergeSizeForForcedMerge=9223372036854775807, calibrateSizeByDeletes=true, maxMergeDocs=2147483647, maxCFSSegmentSizeMB=8.796093022207999E12, noCFSRatio=0.1]
   [junit4]   2> 1782670 INFO  (TEST-TestLazyCores.testCreateTransientFromAdmin-seed#[59AE304D60FF3D46]) [    x:core1] o.a.s.s.SolrIndexSearcher Opening [Searcher@761b8b98[core2] main]
   [junit4]   2> 1782670 INFO  (TEST-TestLazyCores.testCreateTransientFromAdmin-seed#[59AE304D60FF3D46]) [    x:core1] o.a.s.r.ManagedResourceStorage File-based storage initialized to use dir: /Users/jenkins/workspace/Lucene-Solr-master-MacOSX/solr/build/solr-core/test/J0/temp/solr.core.TestLazyCores_59AE304D60FF3D46-001/tempDir-001/core2/conf
   [junit4]   2> 1782671 INFO  (TEST-TestLazyCores.testCreateTransientFromAdmin-seed#[59AE304D60FF3D46]) [    x:core1] o.a.s.h.ReplicationHandler Commits will be reserved for  10000
   [junit4]   2> 1782671 INFO  (searcherExecutor-3815-thread-1-processing-x:core1) [    x:core1] o.a.s.c.SolrCore [core2] Registered new searcher Searcher@761b8b98[core2] main{ExitableDirectoryReader(UninvertingDirectoryReader())}
   [junit4]   2> 1782671 INFO  (TEST-TestLazyCores.testCreateTransientFromAdmin-seed#[59AE304D60FF3D46]) [    x:core1] o.a.s.c.SolrCores Opening transient core core2
   [junit4]   2> 1782671 INFO  (TEST-TestLazyCores.testCreateTransientFromAdmin-seed#[59AE304D60FF3D46]) [    x:core1] o.a.s.c.SolrCores Closing transient core [core3]
   [junit4]   2> 1782671 INFO  (Thread-1982) [    ] o.a.s.c.SolrCore [core3]  CLOSING SolrCore org.apache.solr.core.SolrCore@2d655fe2
   [junit4]   2> 1782673 INFO  (Thread-1982) [    ] o.a.s.m.SolrMetricManager Closing metric reporters for: solr.core.core3
   [junit4]   2> 1782691 INFO  (TEST-TestLazyCores.testCreateTransientFromAdmin-seed#[59AE304D60FF3D46]) [    x:core1] o.a.s.c.SolrConfig Using Lucene MatchVersion: 7.0.0
   [junit4]   2> 1782697 INFO  (TEST-TestLazyCores.testCreateTransientFromAdmin-seed#[59AE304D60FF3D46]) [    x:core1] o.a.s.s.IndexSchema [core3] Schema name=tiny
   [junit4]   2> 1782700 INFO  (TEST-TestLazyCores.testCreateTransientFromAdmin-seed#[59AE304D60FF3D46]) [    x:core1] o.a.s.s.IndexSchema Loaded schema tiny/1.1 with uniqueid field id
   [junit4]   2> 1782704 INFO  (TEST-TestLazyCores.testCreateTransientFromAdmin-seed#[59AE304D60FF3D46]) [    x:core1] o.a.s.c.CoreContainer Creating SolrCore 'core3' using configuration from instancedir /Users/jenkins/workspace/Lucene-Solr-master-MacOSX/solr/build/solr-core/test/J0/temp/solr.core.TestLazyCores_59AE304D60FF3D46-001/tempDir-001/core3
   [junit4]   2> 1782704 INFO  (TEST-TestLazyCores.testCreateTransientFromAdmin-seed#[59AE304D60FF3D46]) [    x:core1] o.a.s.c.SolrCore [[core3] ] Opening new SolrCore at [/Users/jenkins/workspace/Lucene-Solr-master-MacOSX/solr/build/solr-core/test/J0/temp/solr.core.TestLazyCores_59AE304D60FF3D46-001/tempDir-001/core3], dataDir=[/Users/jenkins/workspace/Lucene-Solr-master-MacOSX/solr/build/solr-core/test/J0/temp/solr.core.TestLazyCores_59AE304D60FF3D46-001/tempDir-001/core3/data/]
   [junit4]   2> 1782767 INFO  (TEST-TestLazyCores.testCreateTransientFromAdmin-seed#[59AE304D60FF3D46]) [    x:core1] o.a.s.u.CommitTracker Hard AutoCommit: disabled
   [junit4]   2> 1782767 INFO  (TEST-TestLazyCores.testCreateTransientFromAdmin-seed#[59AE304D60FF3D46]) [    x:core1] o.a.s.u.CommitTracker Soft AutoCommit: disabled
   [junit4]   2> 1782767 INFO  (TEST-TestLazyCores.testCreateTransientFromAdmin-seed#[59AE304D60FF3D46]) [    x:core1] o.a.s.u.RandomMergePolicy RandomMergePolicy wrapping class org.apache.lucene.index.LogByteSizeMergePolicy: [LogByteSizeMergePolicy: minMergeSize=1677721, mergeFactor=25, maxMergeSize=2147483648, maxMergeSizeForForcedMerge=9223372036854775807, calibrateSizeByDeletes=true, maxMergeDocs=2147483647, maxCFSSegmentSizeMB=8.796093022207999E12, noCFSRatio=0.19437276754856062]
   [junit4]   2> 1782768 INFO  (TEST-TestLazyCores.testCreateTransientFromAdmin-seed#[59AE304D60FF3D46]) [    x:core1] o.a.s.s.SolrIndexSearcher Opening [Searcher@2471ea26[core3] main]
   [junit4]   2> 1782769 INFO  (TEST-TestLazyCores.testCreateTransientFromAdmin-seed#[59AE304D60FF3D46]) [    x:core1] o.a.s.r.ManagedResourceStorage File-based storage initialized to use dir: /Users/jenkins/workspace/Lucene-Solr-master-MacOSX/solr/build/solr-core/test/J0/temp/solr.core.TestLazyCores_59AE304D60FF3D46-001/tempDir-001/core3/conf
   [junit4]   2> 1782769 INFO  (TEST-TestLazyCores.testCreateTransientFromAdmin-seed#[59AE304D60FF3D46]) [    x:core1] o.a.s.h.ReplicationHandler Commits will be reserved for  10000
   [junit4]   2> 1782769 INFO  (searcherExecutor-3819-thread-1-processing-x:core1) [    x:core1] o.a.s.c.SolrCore [core3] Registered new searcher Searcher@2471ea26[core3] main{ExitableDirectoryReader(UninvertingDirectoryReader())}
   [junit4]   2> 1782770 INFO  (TEST-TestLazyCores.testCreateTransientFromAdmin-seed#[59AE304D60FF3D46]) [    x:core1] o.a.s.c.SolrCores Opening transient core core3
   [junit4]   2> 1782770 INFO  (TEST-TestLazyCores.testCreateTransientFromAdmin-seed#[59AE304D60FF3D46]) [    x:core1] o.a.s.c.SolrCores Closing transient core [core4]
   [junit4]   2> 1782770 INFO  (Thread-1982) [    ] o.a.s.c.SolrCore [core4]  CLOSING SolrCore org.apache.solr.core.SolrCore@4eb07a35
   [junit4]   2> 1782772 INFO  (Thread-1982) [    ] o.a.s.m.SolrMetricManager Closing metric reporters for: solr.core.core4
   [junit4]   2> 1782788 INFO  (TEST-TestLazyCores.testCreateTransientFromAdmin-seed#[59AE304D60FF3D46]) [    x:core1] o.a.s.c.SolrConfig Using Lucene MatchVersion: 7.0.0
   [junit4]   2> 1782794 INFO  (TEST-TestLazyCores.testCreateTransientFromAdmin-seed#[59AE304D60FF3D46]) [    x:core1] o.a.s.s.IndexSchema [core4] Schema name=tiny
   [junit4]   2> 1782798 INFO  (TEST-TestLazyCores.testCreateTransientFromAdmin-seed#[59AE304D60FF3D46]) [    x:core1] o.a.s.s.IndexSchema Loaded schema tiny/1.1 with uniqueid field id
   [junit4]   2> 1782801 INFO  (TEST-TestLazyCores.testCreateTransientFromAdmin-seed#[59AE304D60FF3D46]) [    x:core1] o.a.s.c.CoreContainer Creating SolrCore 'core4' using configuration from instancedir /Users/jenkins/workspace/Lucene-Solr-master-MacOSX/solr/build/solr-core/test/J0/temp/solr.core.TestLazyCores_59AE304D60FF3D46-001/tempDir-001/core4
   [junit4]   2> 1782802 INFO  (TEST-TestLazyCores.testCreateTransientFromAdmin-seed#[59AE304D60FF3D46]) [    x:core1] o.a.s.c.SolrCore [[core4] ] Opening new SolrCore at [/Users/jenkins/workspace/Lucene-Solr-master-MacOSX/solr/build/solr-core/test/J0/temp/solr.core.TestLazyCores_59AE304D60FF3D46-001/tempDir-001/core4], dataDir=[/Users/jenkins/workspace/Lucene-Solr-master-MacOSX/solr/build/solr-core/test/J0/temp/solr.core.TestLazyCores_59AE304D60FF3D46-001/tempDir-001/core4/data/]
   [junit4]   2> 1782878 INFO  (TEST-TestLazyCores.testCreateTransientFromAdmin-seed#[59AE304D60FF3D46]) [    x:core1] o.a.s.u.CommitTracker Hard AutoCommit: disabled
   [junit4]   2> 1782878 INFO  (TEST-TestLazyCores.testCreateTransientFromAdmin-seed#[59AE304D60FF3D46]) [    x:core1] o.a.s.u.CommitTracker Soft AutoCommit: disabled
   [junit4]   2> 1782879 INFO  (TEST-TestLazyCores.testCreateTransientFromAdmin-seed#[59AE304D60FF3D46]) [    x:core1] o.a.s.u.RandomMergePolicy RandomMergePolicy wrapping class org.apache.lucene.index.TieredMergePolicy: [TieredMergePolicy: maxMergeAtOnce=25, maxMergeAtOnceExplicit=36, maxMergedSegmentMB=48.0048828125, floorSegmentMB=1.8623046875, forceMergeDeletesPctAllowed=0.3800270929911054, segmentsPerTier=19.0, maxCFSSegmentSizeMB=8.796093022207999E12, noCFSRatio=0.6460918199848262
   [junit4]   2> 1782880 INFO  (TEST-TestLazyCores.testCreateTransientFromAdmin-seed#[59AE304D60FF3D46]) [    x:core1] o.a.s.s.SolrIndexSearcher Opening [Searcher@6e701cfe[core4] main]
   [junit4]   2> 1782880 INFO  (TEST-TestLazyCores.testCreateTransientFromAdmin-seed#[59AE304D60FF3D46]) [    x:core1] o.a.s.r.ManagedResourceStorage File-based storage initialized to use dir: /Users/jenkins/workspace/Lucene-Solr-master-MacOSX/solr/build/solr-core/test/J0/temp/solr.core.TestLazyCores_59AE304D60FF3D46-001/tempDir-001/core4/conf
   [junit4]   2> 1782881 INFO  (TEST-TestLazyCores.testCreateTransientFromAdmin-seed#[59AE304D60FF3D46]) [    x:core1] o.a.s.h.ReplicationHandler Commits will be reserved for  10000
   [junit4]   2> 1782881 INFO  (searcherExecutor-3823-thread-1-processing-x:core1) [    x:core1] o.a.s.c.SolrCore [core4] Registered new searcher Searcher@6e701cfe[core4] main{ExitableDirectoryReader(UninvertingDirectoryReader())}
   [junit4]   2> 1782881 INFO  (TEST-TestLazyCores.testCreateTransientFromAdmin-seed#[59AE304D60FF3D46]) [    x:core1] o.a.s.c.SolrCores Opening transient core core4
   [junit4]   2> 1782881 INFO  (TEST-TestLazyCores.testCreateTransientFromAdmin-seed#[59AE304D60FF3D46]) [    x:core1] o.a.s.c.SolrCores Closing transient core [core5]
   [junit4]   2> 1782881 INFO  (Thread-1982) [    ] o.a.s.c.SolrCore [core5]  CLOSING SolrCore org.apache.solr.core.SolrCore@7ea332cc
   [junit4]   2> 1782883 INFO  (Thread-1982) [    ] o.a.s.m.SolrMetricManager Closing metric reporters for: solr.core.core5
   [junit4]   2> 1782908 INFO  (TEST-TestLazyCores.testCreateTransientFromAdmin-seed#[59AE304D60FF3D46]) [    x:core1] o.a.s.c.SolrConfig Using Lucene MatchVersion: 7.0.0
   [junit4]   2> 1782917 INFO  (TEST-TestLazyCores.testCreateTransientFromAdmin-seed#[59AE304D60FF3D46]) [    x:core1] o.a.s.s.IndexSchema [core5] Schema name=tiny
   [junit4]   2> 1782923 INFO  (TEST-TestLazyCores.testCreateTransientFromAdmin-seed#[59AE304D60FF3D46]) [    x:core1] o.a.s.s.IndexSchema Loaded schema tiny/1.1 with uniqueid field id
   [junit4]   2> 1782928 INFO  (TEST-TestLazyCores.testCreateTransientFromAdmin-seed#[59AE304D60FF3D46]) [    x:core1] o.a.s.c.CoreContainer Creating SolrCore 'core5' using configuration from instancedir /Users/jenkins/workspace/Lucene-Solr-master-MacOSX/solr/build/solr-core/test/J0/temp/solr.core.TestLazyCores_59AE304D60FF3D46-001/tempDir-001/core5
   [junit4]   2> 1782929 INFO  (TEST-TestLazyCores.testCreateTransientFromAdmin-seed#[59AE304D60FF3D46]) [    x:core1] o.a.s.c.SolrCore [[core5] ] Opening new SolrCore at [/Users/jenkins/workspace/Lucene-Solr-master-MacOSX/solr/build/solr-core/test/J0/temp/solr.core.TestLazyCores_59AE304D60FF3D46-001/tempDir-001/core5], dataDir=[/Users/jenkins/workspace/Lucene-Solr-master-MacOSX/solr/build/solr-core/test/J0/temp/solr.core.TestLazyCores_59AE304D60FF3D46-001/tempDir-001/core5/data/]
   [junit4]   2> 1783013 INFO  (TEST-TestLazyCores.testCreateTransientFromAdmin-seed#[59AE304D60FF3D46]) [    x:core1] o.a.s.u.CommitTracker Hard AutoCommit: disabled
   [junit4]   2> 1783013 INFO  (TEST-TestLazyCores.testCreateTransientFromAdmin-seed#[59AE304D60FF3D46]) [    x:core1] o.a.s.u.CommitTracker Soft AutoCommit: disabled
   [junit4]   2> 1783014 INFO  (TEST-TestLazyCores.testCreateTransientFromAdmin-seed#[59AE304D60FF3D46]) [    x:core1] o.a.s.u.RandomMergePolicy RandomMergePolicy wrapping class org.apache.lucene.index.TieredMergePolicy: [TieredMergePolicy: maxMergeAtOnce=47, maxMergeAtOnceExplicit=43, maxMergedSegmentMB=30.1240234375, floorSegmentMB=0.3330078125, forceMergeDeletesPctAllowed=1.2539505180056332, segmentsPerTier=17.0, maxCFSSegmentSizeMB=8.796093022207999E12, noCFSRatio=0.38804756438950394
   [junit4]   2> 1783016 INFO  (TEST-TestLazyCores.testCreateTransientFromAdmin-seed#[59AE304D60FF3D46]) [    x:core1] o.a.s.s.SolrIndexSearcher Opening [Searcher@18834f28[core5] main]
   [junit4]   2> 1783016 INFO  (TEST-TestLazyCores.testCreateTransientFromAdmin-seed#[59AE304D60FF3D46]) [    x:core1] o.a.s.r.ManagedResourceStorage File-based storage initialized to use dir: /Users/jenkins/workspace/Lucene-Solr-master-MacOSX/solr/build/solr-core/test/J0/temp/solr.core.TestLazyCores_59AE304D60FF3D46-001/tempDir-001/core5/conf
   [junit4]   2> 1783017 INFO  (TEST-TestLazyCores.testCreateTransientFromAdmin-seed#[59AE304D60FF3D46]) [    x:core1] o.a.s.h.ReplicationHandler Commits will be reserved for  10000
   [junit4]   2> 1783017 INFO  (searcherExecutor-3827-thread-1-processing-x:core1) [    x:core1] o.a.s.c.SolrCore [core5] Registered new searcher Searcher@18834f28[core5] main{ExitableDirectoryReader(UninvertingDirectoryReader())}
   [junit4]   2> 1783017 INFO  (TEST-TestLazyCores.testCreateTransientFromAdmin-seed#[59AE304D60FF3D46]) [    x:core1] o.a.s.c.SolrCores Opening transient core core5
   [junit4]   2> 1783017 INFO  (TEST-TestLazyCores.testCreateTransientFromAdmin-seed#[59AE304D60FF3D46]) [    x:core1] o.a.s.c.SolrCores Closing transient core [core1]
   [junit4]   2> 1783022 INFO  (TEST-TestLazyCores.testCreateTransientFromAdmin-seed#[59AE304D60FF3D46]) [    x:core1] o.a.s.m.SolrMetricManager Closing metric reporters for: solr.core.core2
   [junit4]   2> 1783022 INFO  (TEST-TestLazyCores.testCreateTransientFromAdmin-seed#[59AE304D60FF3D46]) [    x:core1] o.a.s.c.SolrCore Core core2 is not yet closed, waiting 100 ms before checking again.
   [junit4]   2> 1783129 INFO  (TEST-TestLazyCores.testCreateTransientFromAdmin-seed#[59AE304D60FF3D46]) [    x:core1] o.a.s.c.SolrCore Core core2 is not yet closed, waiting 100 ms before checking again.
   [junit4]   2> 1783236 INFO  (TEST-TestLazyCores.testCreateTransientFromAdmin-seed#[59AE304D60FF3D46]) [    x:core1] o.a.s.c.SolrCore Core core2 is not yet closed, waiting 100 ms before checking again.
   [junit4]   2> 1783337 INFO  (TEST-TestLazyCores.testCreateTransientFromAdmin-seed#[59AE304D60FF3D46]) [    x:core1] o.a.s.c.SolrCore Core core2 is not yet closed, waiting 100 ms before checking again.
   [junit4]   2> 1783447 INFO  (TEST-TestLazyCores.testCreateTransientFromAdmin-seed#[59AE304D60FF3D46]) [    x:core1] o.a.s.c.SolrCore Core core2 is not yet closed, waiting 100 ms before checking again.
   [junit4]   2> 1783460 INFO  (Thread-1983) [    x:core1] o.a.s.c.SolrCore [core1]  CLOSING SolrCore org.apache.solr.core.SolrCore@58b66643
   [junit4]   2> 1783462 INFO  (Thread-1983) [    x:core1] o.a.s.m.SolrMetricManager Closing metric reporters for: solr.core.core1
   [junit4]   2> 1783462 INFO  (Thread-1983) [    x:core1] o.a.s.c.SolrCore [core2]  CLOSING SolrCore org.apache.solr.core.SolrCore@4c9b5fad
   [junit4]   2> 1783468 INFO  (Thread-1983) [    x:core1] o.a.s.m.SolrMetricManager Closing metric reporters for: solr.core.core2
   [junit4]   2> 1783549 INFO  (TEST-TestLazyCores.testCreateTransientFromAdmin-seed#[59AE304D60FF3D46]) [    x:core1] o.a.s.m.SolrMetricManager Closing metric reporters for: solr.core.core3
   [junit4]   2> 1783549 INFO  (TEST-TestLazyCores.testCreateTransientFromAdmin-seed#[59AE304D60FF3D46]) [    x:core1] o.a.s.c.SolrCore [core3]  CLOSING SolrCore org.apache.solr.core.SolrCore@468b4f30
   [junit4]   2> 1783550 INFO  (TEST-TestLazyCores.testCreateTransientFromAdmin-seed#[59AE304D60FF3D46]) [    x:core1] o.a.s.m.SolrMetricManager Closing metric reporters for: solr.core.core3
   [junit4]   2> 1783550 INFO  (TEST-TestLazyCores.testCreateTransientFromAdmin-seed#[59AE304D60FF3D46]) [    x:core1] o.a.s.m.SolrMetricManager Closing metric reporters for: solr.core.core4
   [junit4]   2> 1783550 INFO  (TEST-TestLazyCores.testCreateTransientFromAdmin-seed#[59AE304D60FF3D46]) [    x:core1] o.a.s.c.SolrCore [core4]  CLOSING SolrCore org.apache.solr.core.SolrCore@2c2e89c8
   [junit4]   2> 1783551 INFO  (TEST-TestLazyCores.testCreateTransientFromAdmin-seed#[59AE304D60FF3D46]) [    x:core1] o.a.s.m.SolrMetricManager Closing metric reporters for: solr.core.core4
   [junit4]   2> 1783551 INFO  (TEST-TestLazyCores.testCreateTransientFromAdmin-seed#[59AE304D60FF3D46]) [    x:core1] o.a.s.m.SolrMetricManager Closing metric reporters for: solr.core.core5
   [junit4]   2> 1783551 INFO  (TEST-TestLazyCores.testCreateTransientFromAdmin-seed#[59AE304D60FF3D46]) [    x:core1] o.a.s.c.SolrCore [core5]  CLOSING SolrCore org.apache.solr.core.SolrCore@700808b
   [junit4]   2> 1783551 INFO  (TEST-TestLazyCores.testCreateTransientFromAdmin-seed#[59AE304D60FF3D46]) [    x:core1] o.a.s.m.SolrMetricManager Closing metric reporters for: solr.core.core5
   [junit4]   2> 1783551 INFO  (TEST-TestLazyCores.testCreateTransientFromAdmin-seed#[59AE304D60FF3D46]) [    x:core1] o.a.s.c.CoreContainer Shutting down CoreContainer instance=1384273406
   [junit4]   2> 1783552 INFO  (coreCloseExecutor-3836-thread-1-processing-x:core1) [    x:collection5] o.a.s.c.SolrCore [collection5]  CLOSING SolrCore org.apache.solr.core.SolrCore@6b3341e4
   [junit4]   2> 1783552 INFO  (coreCloseExecutor-3836-thread-2-processing-x:core1) [    x:collection1] o.a.s.c.SolrCore [collection1]  CLOSING SolrCore org.apache.solr.core.SolrCore@46fdefb9
   [junit4]   2> 1783553 INFO  (coreCloseExecutor-3836-thread-1-processing-x:core1) [    x:collection5] o.a.s.m.SolrMetricManager Closing metric reporters for: solr.core.collection5
   [junit4]   2> 1783553 INFO  (coreCloseExecutor-3836-thread-2-processing-x:core1) [    x:collection1] o.a.s.m.SolrMetricManager Closing metric reporters for: solr.core.collection1
   [junit4]   2> 1783553 INFO  (TEST-TestLazyCores.testCreateTransientFromAdmin-seed#[59AE304D60FF3D46]) [    x:core1] o.a.s.m.SolrMetricManager Closing metric reporters for: solr.node
   [junit4]   2> 1783554 INFO  (TEST-TestLazyCores.testCreateTransientFromAdmin-seed#[59AE304D60FF3D46]) [    x:core1] o.a.s.SolrTestCaseJ4 ###Ending testCreateTransientFromAdmin
   [junit4]   2> 1783555 INFO  (TEST-TestLazyCores.testLazyLoad-seed#[59AE304D60FF3D46]) [    x:core1] o.a.s.SolrTestCaseJ4 ###Starting testLazyLoad
   [junit4]   2> 1783594 INFO  (TEST-TestLazyCores.testLazyLoad-seed#[59AE304D60FF3D46]) [    x:core1] o.a.s.c.SolrCores Allocating transient cache for 4 transient cores
   [junit4]   2> 1783675 INFO  (coreLoadExecutor-3843-thread-2-processing-x:core1) [    x:collection2] o.a.s.c.SolrConfig Using Lucene MatchVersion: 7.0.0
   [junit4]   2> 1783675 INFO  (coreLoadExecutor-3843-thread-1-processing-x:core1) [    x:collection1] o.a.s.c.SolrConfig Using Lucene MatchVersion: 7.0.0
   [junit4]   2> 1783675 INFO  (coreLoadExecutor-3843-thread-3-processing-x:core1) [    x:collection5] o.a.s.c.SolrConfig Using Lucene MatchVersion: 7.0.0
   [junit4]   2> 1783693 INFO  (coreLoadExecutor-3843-thread-1-processing-x:core1) [    x:collection1] o.a.s.s.IndexSchema [collection1] Schema name=tiny
   [junit4]   2> 1783693 INFO  (coreLoadExecutor-3843-thread-3-processing-x:core1) [    x:collection5] o.a.s.s.IndexSchema [collection5] Schema name=tiny
   [junit4]   2> 1783694 INFO  (coreLoadExecutor-3843-thread-2-processing-x:core1) [    x:collection2] o.a.s.s.IndexSchema [collection2] Schema name=tiny
   [junit4]   2> 1783698 INFO  (coreLoadExecutor-3843-thread-2-processing-x:core1) [    x:collection2] o.a.s.s.IndexSchema Loaded schema tiny/1.1 with uniqueid field id
   [junit4]   2> 1783699 INFO  (coreLoadExecutor-3843-thread-3-processing-x:core1) [    x:collection5] o.a.s.s.IndexSchema Loaded schema tiny/1.1 with uniqueid field id
   [junit4]   2> 1783700 INFO  (coreLoadExecutor-3843-thread-1-processing-x:core1) [    x:collection1] o.a.s.s.IndexSchema Loaded schema tiny/1.1 with uniqueid field id
   [junit4]   2> 1783705 INFO  (coreLoadExecutor-3843-thread-1-processing-x:core1) [    x:collection1] o.a.s.c.CoreContainer Creating SolrCore 'collection1' using configuration from instancedir /Users/jenkins/workspace/Lucene-Solr-master-MacOSX/solr/build/solr-core/test/J0/temp/solr.core.TestLazyCores_59AE304D60FF3D46-001/tempDir-002/collection1
   [junit4]   2> 1783705 INFO  (coreLoadExecutor-3843-thread-2-processing-x:core1) [    x:collection2] o.a.s.c.CoreContainer Creating SolrCore 'collection2' using configuration from instancedir /Users/jenkins/workspace/Lucene-Solr-master-MacOSX/solr/build/solr-core/test/J0/temp/solr.core.TestLazyCores_59AE304D60FF3D46-001/tempDir-002/collection2
   [junit4]   2> 1783705 INFO  (coreLoadExecutor-3843-thread-3-processing-x:core1) [    x:collection5] o.a.s.c.CoreContainer Creating SolrCore 'collection5' using configuration from instancedir /Users/jenkins/workspace/Lucene-Solr-master-MacOSX/solr/build/solr-core/test/J0/temp/solr.core.TestLazyCores_59AE304D60FF3D46-001/tempDir-002/collection5
   [junit4]   2> 1783706 INFO  (coreLoadExecutor-3843-thread-3-processing-x:core1) [    x:collection5] o.a.s.c.SolrCore [[collection5] ] Opening new SolrCore at [/Users/jenkins/workspace/Lucene-Solr-master-MacOSX/solr/build/solr-core/test/J0/temp/solr.core.TestLazyCores_59AE304D60FF3D46-001/tempDir-002/collection5], dataDir=[/Users/jenkins/workspace/Lucene-Solr-master-MacOSX/solr/build/solr-core/test/J0/temp/solr.core.TestLazyCores_59AE304D60FF3D46-001/tempDir-002/collection5/data/]
   [junit4]   2> 1783706 INFO  (coreLoadExecutor-3843-thread-2-processing-x:core1) [    x:collection2] o.a.s.c.SolrCore [[collection2] ] Opening new SolrCore at [/Users/jenkins/workspace/Lucene-Solr-master-MacOSX/solr/build/solr-core/test/J0/temp/solr.core.TestLazyCores_59AE304D60FF3D46-001/tempDir-002/collection2], dataDir=[/Users/jenkins/workspace/Lucene-Solr-master-MacOSX/solr/build/solr-core/test/J0/temp/solr.core.TestLazyCores_59AE304D60FF3D46-001/tempDir-002/collection2/data/]
   [junit4]   2> 1783706 INFO  (coreLoadExecutor-3843-thread-1-processing-x:core1) [    x:collection1] o.a.s.c.SolrCore [[collection1] ] Opening new SolrCore at [/Users/jenkins/workspace/Lucene-Solr-master-MacOSX/solr/build/solr-core/test/J0/temp/solr.core.TestLazyCores_59AE304D60FF3D46-001/tempDir-002/collection1], dataDir=[/Users/jenkins/workspace/Lucene-Solr-master-MacOSX/solr/build/solr-core/test/J0/temp/solr.core.TestLazyCores_59AE304D60FF3D46-001/tempDir-002/collection1/data/]
   [junit4]   2> 1783709 INFO  (coreLoadExecutor-3843-thread-3-processing-x:core1) [    x:collection5] o.a.s.u.RandomMergePolicy RandomMergePolicy wrapping class org.apache.lucene.index.LogByteSizeMergePolicy: [LogByteSizeMergePolicy: minMergeSize=1677721, mergeFactor=15, maxMergeSize=2147483648, maxMergeSizeForForcedMerge=9223372036854775807, calibrateSizeByDeletes=true, maxMergeDocs=2147483647, maxCFSSegmentSizeMB=8.796093022207999E12, noCFSRatio=0.0]
   [junit4]   2> 1783710 INFO  (coreLoadExecutor-3843-thread-1-processing-x:core1) [    x:collection1] o.a.s.u.RandomMergePolicy RandomMergePolicy wrapping class org.apache.lucene.index.LogByteSizeMergePolicy: [LogByteSizeMergePolicy: minMergeSize=1677721, mergeFactor=15, maxMergeSize=2147483648, maxMergeSizeForForcedMerge=9223372036854775807, calibrateSizeByDeletes=true, maxMergeDocs=2147483647, maxCFSSegmentSizeMB=8.796093022207999E12, noCFSRatio=0.0]
   [junit4]   2> 1783710 INFO  (coreLoadExecutor-3843-thread-2-processing-x:core1) [    x:collection2] o.a.s.u.RandomMergePolicy RandomMergePolicy wrapping class org.apache.lucene.index.LogByteSizeMergePolicy: [LogByteSizeMergePolicy: minMergeSize=1677721, mergeFactor=15, maxMergeSize=2147483648, maxMergeSizeForForcedMerge=9223372036854775807, calibrateSizeByDeletes=true, maxMergeDocs=2147483647, maxCFSSegmentSizeMB=8.796093022207999E12, noCFSRatio=0.0]
   [junit4]   2> 1783805 INFO  (coreLoadExecutor-3843-thread-1-processing-x:core1) [    x:collection1] o.a.s.u.CommitTracker Hard AutoCommit: disabled
   [junit4]   2> 1783805 INFO  (coreLoadExecutor-3843-thread-1-processing-x:core1) [    x:collection1] o.a.s.u.CommitTracker Soft AutoCommit: disabled
   [junit4]   2> 1783805 INFO  (coreLoadExecutor-3843-thread-3-processing-x:core1) [    x:collection5] o.a.s.u.CommitTracker Hard AutoCommit: disabled
   [junit4]   2> 1783805 INFO  (coreLoadExecutor-3843-thread-1-processing-x:core1) [    x:collection1] o.a.s.u.RandomMergePolicy RandomMergePolicy wrapping class org.apache.lucene.index.LogByteSizeMergePolicy: [LogByteSizeMergePolicy: minMergeSize=1677721, mergeFactor=10, maxMergeSize=2147483648, maxMergeSizeForForcedMerge=9223372036854775807, calibrateSizeByDeletes=false, maxMergeDocs=2147483647, maxCFSSegmentSizeMB=8.796093022207999E12, noCFSRatio=0.0]
   [junit4]   2> 1783805 INFO  (coreLoadExecutor-3843-thread-3-processing-x:core1) [    x:collection5] o.a.s.u.CommitTracker Soft AutoCommit: disabled
   [junit4]   2> 1783806 INFO  (coreLoadExecutor-3843-thread-2-processing-x:core1) [    x:collection2] o.a.s.u.CommitTracker Hard AutoCommit: disabled
   [junit4]   2> 1783806 INFO  (coreLoadExecutor-3843-thread-3-processing-x:core1) [    x:collection5] o.a.s.u.RandomMergePolicy RandomMergePolicy wrapping class org.apache.lucene.index.LogByteSizeMergePolicy: [LogByteSizeMergePolicy: minMergeSize=1677721, mergeFactor=10, maxMergeSize=2147483648, maxMergeSizeForForcedMerge=9223372036854775807, calibrateSizeByDeletes=false, maxMergeDocs=2147483647, maxCFSSegmentSizeMB=8.796093022207999E12, noCFSRatio=0.0]
   [junit4]   2> 1783806 INFO  (coreLoadExecutor-3843-thread-2-processing-x:core1) [    x:collection2] o.a.s.u.CommitTracker Soft AutoCommit: disabled
   [junit4]   2> 1783807 INFO  (coreLoadExecutor-3843-thread-1-processing-x:core1) [    x:collection1] o.a.s.s.SolrIndexSearcher Opening [Searcher@20b71828[collection1] main]
   [junit4]   2> 1783807 INFO  (coreLoadExecutor-3843-thread-3-processing-x:core1) [    x:collection5] o.a.s.s.SolrIndexSearcher Opening [Searcher@4601709f[collection5] main]
   [junit4]   2> 1783807 INFO  (coreLoadExecutor-3843-thread-1-processing-x:core1) [    x:collection1] o.a.s.r.ManagedResourceStorage File-based storage initialized to use dir: /Users/jenkins/workspace/Lucene-Solr-master-MacOSX/solr/build/solr-core/test/J0/temp/solr.core.TestLazyCores_59AE304D60FF3D46-001/tempDir-002/collection1/conf
   [junit4]   2> 1783808 INFO  (coreLoadExecutor-3843-thread-3-processing-x:core1) [    x:collection5] o.a.s.r.ManagedResourceStorage File-based storage initialized to use dir: /Users/jenkins/workspace/Lucene-Solr-master-MacOSX/solr/build/solr-core/test/J0/temp/solr.core.TestLazyCores_59AE304D60FF3D46-001/tempDir-002/collection5/conf
   [junit4]   2> 1783808 INFO  (coreLoadExecutor-3843-thread-1-processing-x:core1) [    x:collection1] o.a.s.h.ReplicationHandler Commits will be reserved for  10000
   [junit4]   2> 1783808 INFO  (coreLoadExecutor-3843-thread-3-processing-x:core1) [    x:collection5] o.a.s.h.ReplicationHandler Commits will be reserved for  10000
   [junit4]   2> 1783808 INFO  (searcherExecutor-3844-thread-1-processing-x:collection1) [    x:collection1] o.a.s.c.SolrCore [collection1] Registered new searcher Searcher@20b71828[collection1] main{ExitableDirectoryReader(UninvertingDirectoryReader())}
   [junit4]   2> 1783808 INFO  (searcherExecutor-3846-thread-1-processing-x:collection5) [    x:collection5] o.a.s.c.SolrCore [collection5] Registered new searcher Searcher@4601709f[collection5] main{ExitableDirectoryReader(UninvertingDirectoryReader())}
   [junit4]   2> 1783808 INFO  (coreLoadExecutor-3843-thread-2-processing-x:core1) [    x:collection2] o.a.s.u.RandomMergePolicy RandomMergePolicy wrapping class org.apache.lucene.index.LogByteSizeMergePolicy: [LogByteSizeMergePolicy: minMergeSize=1677721, mergeFactor=10, maxMergeSize=2147483648, maxMergeSizeForForcedMerge=9223372036854775807, calibrateSizeByDeletes=false, maxMergeDocs=2147483647, maxCFSSegmentSizeMB=8.796093022207999E12, noCFSRatio=0.0]
   [junit4]   2> 1783809 INFO  (coreLoadExecutor-3843-thread-2-processing-x:core1) [    x:collection2] o.a.s.s.SolrIndexSearcher Opening [Searcher@244a7d99[collection2] main]
   [junit4]   2> 1783810 INFO  (coreLoadExecutor-3843-thread-2-processing-x:core1) [    x:collection2] o.a.s.r.ManagedResourceStorage File-based storage initialized to use dir: /Users/jenkins/workspace/Lucene-Solr-master-MacOSX/solr/build/solr-core/test/J0/temp/solr.core.TestLazyCores_59AE304D60FF3D46-001/tempDir-002/collection2/conf
   [junit4]   2> 1783810 INFO  (coreLoadExecutor-3843-thread-2-processing-x:core1) [    x:collection2] o.a.s.h.ReplicationHandler Commits will be reserved for  10000
   [junit4]   2> 1783810 INFO  (searcherExecutor-3845-thread-1-processing-x:collection2) [    x:collection2] o.a.s.c.SolrCore [collection2] Registered new searcher Searcher@244a7d99[collection2] main{ExitableDirectoryReader(UninvertingDirectoryReader())}
   [junit4]   2> 1783810 INFO  (coreLoadExecutor-3843-thread-2-processing-x:core1) [    x:collection2] o.a.s.c.SolrCores Opening transient core collection2
   [junit4]   2> 1783832 INFO  (TEST-TestLazyCores.testLazyLoad-seed#[59AE304D60FF3D46]) [    x:core1] o.a.s.c.SolrConfig Using Lucene MatchVersion: 7.0.0
   [junit4]   2> 1783847 INFO  (TEST-TestLazyCores.testLazyLoad-seed#[59AE304D60FF3D46]) [    x:core1] o.a.s.s.IndexSchema [collection3] Schema name=tiny
   [junit4]   2> 1783853 INFO  (TEST-TestLazyCores.testLazyLoad-seed#[59AE304D60FF3D46]) [    x:core1] o.a.s.s.IndexSchema Loaded schema tiny/1.1 with uniqueid field id
   [junit4]   2> 1783858 INFO  (TEST-TestLazyCores.testLazyLoad-seed#[59AE304D60FF3D46]) [    x:core1] o.a.s.c.CoreContainer Creating SolrCore 'collection3' using configuration from instancedir /Users/jenkins/workspace/Lucene-Solr-master-MacOSX/solr/build/solr-core/test/J0/temp/solr.core.TestLazyCores_59AE304D60FF3D46-001/tempDir-002/collection3
   [junit4]   2> 1783859 INFO  (TEST-TestLazyCores.testLazyLoad-seed#[59AE304D60FF3D46]) [    x:core1] o.a.s.c.SolrCore [[collection3] ] Opening new SolrCore at [/Users/jenkins/workspace/Lucene-Solr-master-MacOSX/solr/build/solr-core/test/J0/temp/solr.core.TestLazyCores_59AE304D60FF3D46-001/tempDir-002/collection3], dataDir=[/Users/jenkins/workspace/Lucene-Solr-master-MacOSX/solr/build/solr-core/test/J0/temp/solr.core.TestLazyCores_59AE304D60FF3D46-001/tempDir-002/collection3/data/]
   [junit4]   2> 1783864 INFO  (TEST-TestLazyCores.testLazyLoad-seed#[59AE304D60FF3D46]) [    x:core1] o.a.s.u.RandomMergePolicy RandomMergePolicy wrapping class org.apache.lucene.index.TieredMergePolicy: [TieredMergePolicy: maxMergeAtOnce=37, maxMergeAtOnceExplicit=17, maxMergedSegmentMB=83.2529296875, floorSegmentMB=2.1865234375, forceMergeDeletesPctAllowed=0.36776241474489324, segmentsPerTier=50.0, maxCFSSegmentSizeMB=8.796093022207999E12, noCFSRatio=0.1566808019931316
   [junit4]   2> 1783957 INFO  (TEST-TestLazyCores.testLazyLoad-seed#[59AE304D60FF3D46]) [    x:core1] o.a.s.u.CommitTracker Hard AutoCommit: disabled
   [junit4]   2> 1783957 INFO  (TEST-TestLazyCores.testLazyLoad-seed#[59AE304D60FF3D46]) [    x:core1] o.a.s.u.CommitTracker Soft AutoCommit: disabled
   [junit4]   2> 1783958 INFO  (TEST-TestLazyCores.testLazyLoad-seed#[59AE304D60FF3D46]) [    x:core1] o.a.s.u.RandomMergePolicy RandomMergePolicy wrapping class org.apache.lucene.index.LogDocMergePolicy: [LogDocMergePolicy: minMergeSize=1000, mergeFactor=21, maxMergeSize=9223372036854775807, maxMergeSizeForForcedMerge=9223372036854775807, calibrateSizeByDeletes=false, maxMergeDocs=2147483647, maxCFSSegmentSizeMB=8.796093022207999E12, noCFSRatio=0.0]
   [junit4]   2> 1783959 INFO  (TEST-TestLazyCores.testLazyLoad-seed#[59AE304D60FF3D46]) [    x:core1] o.a.s.s.SolrIndexSearcher Opening [Searcher@5d73492[collection3] main]
   [junit4]   2> 1783959 INFO  (TEST-TestLazyCores.testLazyLoad-seed#[59AE304D60FF3D46]) [    x:core1] o.a.s.r.ManagedResourceStorage File-based storage initialized to use dir: /Users/jenkins/workspace/Lucene-Solr-master-MacOSX/solr/build/solr-core/test/J0/temp/solr.core.TestLazyCores_59AE304D60FF3D46-001/tempDir-002/collection3/conf
   [junit4]   2> 1783960 INFO  (TEST-TestLazyCores.testLazyLoad-seed#[59AE304D60FF3D46]) [    x:core1] o.a.s.h.ReplicationHandler Commits will be reserved for  10000
   [junit4]   2> 1783960 INFO  (searcherExecutor-3856-thread-1-processing-x:core1) [    x:core1] o.a.s.c.SolrCore [collection3] Registered new searcher Searcher@5d73492[collection3] main{ExitableDirectoryReader(UninvertingDirectoryReader())}
   [junit4]   2> 1783960 INFO  (TEST-TestLazyCores.testLazyLoad-seed#[59AE304D60FF3D46]) [    x:core1] o.a.s.c.SolrCores Opening transient core collection3
   [junit4]   2> 1783979 INFO  (TEST-TestLazyCores.testLazyLoad-seed#[59AE304D60FF3D46]) [    x:core1] o.a.s.c.SolrConfig Using Lucene MatchVersion: 7.0.0
   [junit4]   2> 1783983 INFO  (TEST-TestLazyCores.testLazyLoad-seed#[59AE304D60FF3D46]) [    x:core1] o.a.s.s.IndexSchema [collection4] Schema name=tiny
   [junit4]   2> 1783991 INFO  (TEST-TestLazyCores.testLazyLoad-seed#[59AE304D60FF3D46]) [    x:core1] o.a.s.s.IndexSchema Loaded schema tiny/1.1 with uniqueid field id
   [junit4]   2> 1783995 INFO  (TEST-TestLazyCores.testLazyLoad-seed#[59AE304D60FF3D46]) [    x:core1] o.a.s.c.CoreContainer Creating SolrCore 'collection4' using configuration from instancedir /Users/jenkins/workspace/Lucene-Solr-master-MacOSX/solr/build/solr-core/test/J0/temp/solr.core.TestLazyCores_59AE304D60FF3D46-001/tempDir-002/collection4
   [junit4]   2> 1783995 INFO  (TEST-TestLazyCores.testLazyLoad-seed#[59AE304D60FF3D46]) [    x:core1] o.a.s.c.SolrCore [[collection4] ] Opening new SolrCore at [/Users/jenkins/workspace/Lucene-Solr-master-MacOSX/solr/build/solr-core/test/J0/temp/solr.core.TestLazyCores_59AE304D60FF3D46-001/tempDir-002/collection4], dataDir=[/Users/jenkins/workspace/Lucene-Solr-master-MacOSX/solr/build/solr-core/test/J0/temp/solr.core.TestLazyCores_59AE304D60FF3D46-001/tempDir-002/collection4/data/]
   [junit4]   2> 1783998 INFO  (TEST-TestLazyCores.testLazyLoad-seed#[59AE304D60FF3D46]) [    x:core1] o.a.s.u.RandomMergePolicy RandomMergePolicy wrapping class org.apache.lucene.index.TieredMergePolicy: [TieredMergePolicy: maxMergeAtOnce=30, maxMergeAtOnceExplicit=36, maxMergedSegmentMB=87.390625, floorSegmentMB=0.541015625, forceMergeDeletesPctAllowed=12.922545561063348, segmentsPerTier=14.0, maxCFSSegmentSizeMB=8.796093022207999E12, noCFSRatio=0.30532050574314795
   [junit4]   2> 1784084 INFO  (TEST-TestLazyCores.testLazyLoad-seed#[59AE304D60FF3D46]) [    x:core1] o.a.s.u.CommitTracker Hard AutoCommit: disabled
   [junit4]   2> 1784084 INFO  (TEST-TestLazyCores.testLazyLoad-seed#[59AE304D60FF3D46]) [    x:core1] o.a.s.u.CommitTracker Soft AutoCommit: disabled
   [junit4]   2> 1784084 INFO  (TEST-TestLazyCores.testLazyLoad-seed#[59AE304D60FF3D46]) [    x:core1] o.a.s.u.RandomMergePolicy RandomMergePolicy wrapping class org.apache.lucene.index.TieredMergePolicy: [TieredMergePolicy: maxMergeAtOnce=26, maxMergeAtOnceExplicit=44, maxMergedSegmentMB=1.5078125, floorSegmentMB=1.5869140625, forceMergeDeletesPctAllowed=29.466776509892657, segmentsPerTier=19.0, maxCFSSegmentSizeMB=8.796093022207999E12, noCFSRatio=0.8394521596094265
   [junit4]   2> 1784085 INFO  (TEST-TestLazyCores.testLazyLoad-seed#[59AE304D60FF3D46]) [    x:core1] o.a.s.s.SolrIndexSearcher Opening [Searcher@2a84f7e2[collection4] main]
   [junit4]   2> 1784085 INFO  (TEST-TestLazyCores.testLazyLoad-seed#[59AE304D60FF3D46]) [    x:core1] o.a.s.r.ManagedResourceStorage File-based storage initialized to use dir: /Users/jenkins/workspace/Lucene-Solr-master-MacOSX/solr/build/solr-core/test/J0/temp/solr.core.TestLazyCores_59AE304D60FF3D46-001/tempDir-002/collection4/conf
   [junit4]   2> 1784086 INFO  (TEST-TestLazyCores.testLazyLoad-seed#[59AE304D60FF3D46]) [    x:core1] o.a.s.h.ReplicationHandler Commits will be reserved for  10000
   [junit4]   2> 1784086 INFO  (searcherExecutor-3860-thread-1-processing-x:core1) [    x:core1] o.a.s.c.SolrCore [collection4] Registered new searcher Searcher@2a84f7e2[collection4] main{ExitableDirectoryReader(UninvertingDirectoryReader())}
   [junit4]   2> 1784086 INFO  (TEST-TestLazyCores.testLazyLoad-seed#[59AE304D60FF3D46]) [    x:core1] o.a.s.c.CoreContainer Shutting down CoreContainer instance=613482775
   [junit4]   2> 1784087 INFO  (coreCloseExecutor-3864-thread-1-processing-x:core1) [    x:collection1] o.a.s.c.SolrCore [collection1]  CLOSING SolrCore org.apache.solr.core.SolrCore@76c85303
   [junit4]   2> 1784087 INFO  (coreCloseExecutor-3864-thread-2-processing-x:core1) [    x:collection5] o.a.s.c.SolrCore [collection5]  CLOSING SolrCore org.apache.solr.core.SolrCore@7f1ff4f6
   [junit4]   2> 1784089 INFO  (coreCloseExecutor-3864-thread-1-processing-x:core1) [    x:collection1] o.a.s.m.SolrMetricManager Closing metric reporters for: solr.core.collection1
   [junit4]   2> 1784089 INFO  (coreCloseExecutor-3864-thread-2-processing-x:core1) [    x:collection5] o.a.s.m.SolrMetricManager Closing metric reporters for: solr.core.collection5
   [junit4]   2> 1784090 INFO  (coreCloseExecutor-3864-thread-3-processing-x:core1) [    x:collection4] o.a.s.c.SolrCore [collection4]  CLOSING SolrCore org.apache.solr.core.SolrCore@528fb28d
   [junit4]   2> 1784091 INFO  (coreCloseExecutor-3864-thread-4-processing-x:core1) [    x:collection2] o.a.s.c.SolrCore [collection2]  CLOSING SolrCore org.apache.solr.core.SolrCore@72114d8
   [junit4]   2> 1784092 INFO  (coreCloseExecutor-3864-thread-3-processing-x:core1) [    x:collection4] o.a.s.m.SolrMetricManager Closing metric reporters for: solr.core.collection4
   [junit4]   2> 1784093 INFO  (coreCloseExecutor-3864-thread-4-processing-x:core1) [    x:collection2] o.a.s.m.SolrMetricManager Closing metric reporters for: solr.core.collection2
   [junit4]   2> 1784093 INFO  (coreCloseExecutor-3864-thread-5-processing-x:core1) [    x:collection3] o.a.s.c.SolrCore [collection3]  CLOSING SolrCore org.apache.solr.core.SolrCore@e09a446
   [junit4]   2> 1784095 INFO  (coreCloseExecutor-3864-thread-5-processing-x:core1) [    x:collection3] o.a.s.m.SolrMetricManager Closing metric reporters for: solr.core.collection3
   [junit4]   2> 1784095 INFO  (TEST-TestLazyCores.testLazyLoad-seed#[59AE304D60FF3D46]) [    x:core1] o.a.s.m.SolrMetricManager Closing metric reporters for: solr.node
   [junit4]   2> 1784095 INFO  (TEST-TestLazyCores.testLazyLoad-seed#[59AE304D60FF3D46]) [    x:core1] o.a.s.SolrTestCaseJ4 ###Ending testLazyLoad
   [junit4]   2> 1784096 INFO  (TEST-TestLazyCores.testMidUseUnload-seed#[59AE304D60FF3D46]) [    x:core1] o.a.s.SolrTestCaseJ4 ###Starting testMidUseUnload
   [junit4]   2> 1784134 INFO  (TEST-TestLazyCores.testMidUseUnload-seed#[59AE304D60FF3D46]) [    x:core1] o.a.s.c.SolrCores Allocating transient cache for 4 transient cores
   [junit4]   2> 1784212 INFO  (coreLoadExecutor-3871-thread-1-processing-x:core1) [    x:collection1] o.a.s.c.SolrConfig Using Lucene MatchVersion: 7.0.0
   [junit4]   2> 1784212 INFO  (coreLoadExecutor-3871-thread-2-processing-x:core1) [    x:collection2] o.a.s.c.SolrConfig Using Lucene MatchVersion: 7.0.0
   [junit4]   2> 1784213 INFO  (coreLoadExecutor-3871-thread-3-processing-x:core1) [    x:collection5] o.a.s.c.SolrConfig Using Lucene MatchVersion: 7.0.0
   [junit4]   2> 1784223 INFO  (coreLoadExecutor-3871-thread-1-processing-x:core1) [    x:collection1] o.a.s.s.IndexSchema [collection1] Schema name=tiny
   [junit4]   2> 1784223 INFO  (coreLoadExecutor-3871-thread-2-processing-x:core1) [    x:collection2] o.a.s.s.IndexSchema [collection2] Schema name=tiny
   [junit4]   2> 1784224 INFO  (coreLoadExecutor-3871-thread-3-processing-x:core1) [    x:collection5] o.a.s.s.IndexSchema [collection5] Schema name=tiny
   [junit4]   2> 1784229 INFO  (coreLoadExecutor-3871-thread-3-processing-x:core1) [    x:collection5] o.a.s.s.IndexSchema Loaded schema tiny/1.1 with uniqueid field id
   [junit4]   2> 1784229 INFO  (coreLoadExecutor-3871-thread-2-processing-x:core1) [    x:collection2] o.a.s.s.IndexSchema Loaded schema tiny/1.1 with uniqueid field id
   [junit4]   2> 1784229 INFO  (coreLoadExecutor-3871-thread-1-processing-x:core1) [    x:collection1] o.a.s.s.IndexSchema Loaded schema tiny/1.1 with uniqueid field id
   [junit4]   2> 1784234 INFO  (coreLoadExecutor-3871-thread-1-processing-x:core1) [    x:collection1] o.a.s.c.CoreContainer Creating SolrCore 'collection1' using configuration from instancedir /Users/jenkins/workspace/Lucene-Solr-master-MacOSX/solr/build/solr-core/test/J0/temp/solr.core.TestLazyCores_59AE304D60FF3D46-001/tempDir-003/collection1
   [junit4]   2> 1784235 INFO  (coreLoadExecutor-3871-thread-2-processing-x:core1) [    x:collection2] o.a.s.c.CoreContainer Creating SolrCore 'collection2' using configuration from instancedir /Users/jenkins/workspace/Lucene-Solr-master-MacOSX/solr/build/solr-core/test/J0/temp/solr.core.TestLazyCores_59AE304D60FF3D46-001/tempDir-003/collection2
   [junit4]   2> 1784235 INFO  (coreLoadExecutor-3871-thread-2-processing-x:core1) [    x:collection2] o.a.s.c.SolrCore [[collection2] ] Opening new SolrCore at [/Users/jenkins/workspace/Lucene-Solr-master-MacOSX/solr/build/solr-core/test/J0/temp/solr.core.TestLazyCores_59AE304D60FF3D46-001/tempDir-003/collection2], dataDir=[/Users/jenkins/workspace/Lucene-Solr-master-MacOSX/solr/build/solr-core/test/J0/temp/solr.core.TestLazyCores_59AE304D60FF3D46-001/tempDir-003/collection2/data/]
   [junit4]   2> 1784235 INFO  (coreLoadExecutor-3871-thread-3-processing-x:core1) [    x:collection5] o.a.s.c.CoreContainer Creating SolrCore 'collection5' using configuration from instancedir /Users/jenkins/workspace/Lucene-Solr-master-MacOSX/solr/build/solr-core/test/J0/temp/solr.core.TestLazyCores_59AE304D60FF3D46-001/tempDir-003/collection5
   [junit4]   2> 1784235 INFO  (coreLoadExecutor-3871-thread-1-processing-x:core1) [    x:collection1] o.a.s.c.SolrCore [[collection1] ] Opening new SolrCore at [/Users/jenkins/workspace/Lucene-Solr-master-MacOSX/solr/build/solr-core/test/J0/temp/solr.core.TestLazyCores_59AE304D60FF3D46-001/tempDir-003/collection1], dataDir=[/Users/jenkins/workspace/Lucene-Solr-master-MacOSX/solr/build/solr-core/test/J0/temp/solr.core.TestLazyCores_59AE304D60FF3D46-001/tempDir-003/collection1/data/]
   [junit4]   2> 1784235 INFO  (coreLoadExecutor-3871-thread-3-processing-x:core1) [    x:collection5] o.a.s.c.SolrCore [[collection5] ] Opening new SolrCore at [/Users/jenkins/workspace/Lucene-Solr-master-MacOSX/solr/build/solr-core/test/J0/temp/solr.core.TestLazyCores_59AE304D60FF3D46-001/tempDir-003/collection5], dataDir=[/Users/jenkins/workspace/Lucene-Solr-master-MacOSX/solr/build/solr-core/test/J0/temp/solr.core.TestLazyCores_59AE304D60FF3D46-001/tempDir-003/collection5/data/]
   [junit4]   2> 1784239 INFO  (coreLoadExecutor-3871-thread-1-processing-x:core1) [    x:collection1] o.a.s.u.RandomMergePolicy RandomMergePolicy wrapping class org.apache.lucene.index.LogByteSizeMergePolicy: [LogByteSizeMergePolicy: minMergeSize=1677721, mergeFactor=15, maxMergeSize=2147483648, maxMergeSizeForForcedMerge=9223372036854775807, calibrateSizeByDeletes=true, maxMergeDocs=2147483647, maxCFSSegmentSizeMB=8.796093022207999E12, noCFSRatio=0.0]
   [junit4]   2> 1784240 INFO  (coreLoadExecutor-3871-thread-3-processing-x:core1) [    x:collection5] o.a.s.u.RandomMergePolicy RandomMergePolicy wrapping class org.apache.lucene.index.LogByteSizeMergePolicy: [LogByteSizeMergePolicy: minMergeSize=1677721, mergeFactor=15, maxMergeSize=2147483648, maxMergeSizeForForcedMerge=9223372036854775807, calibrateSizeByDeletes=true, maxMergeDocs=2147483647, maxCFSSegmentSizeMB=8.796093022207999E12, noCFSRatio=0.0]
   [junit4]   2> 1784241 INFO  (coreLoadExecutor-3871-thread-2-processing-x:core1) [    x:collection2] o.a.s.u.RandomMergePolicy RandomMergePolicy wrapping class org.apache.lucene.index.LogByteSizeMergePolicy: [LogByteSizeMergePolicy: minMergeSize=1677721, mergeFactor=15, maxMergeSize=2147483648, maxMergeSizeForForcedMerge=9223372036854775807, calibrateSizeByDeletes=true, maxMergeDocs=2147483647, maxCFSSegmentSizeMB=8.796093022207999E12, noCFSRatio=0.0]
   [junit4]   2> 1784350 INFO  (coreLoadExecutor-3871-thread-3-processing-x:core1) [    x:collection5] o.a.s.u.CommitTracker Hard AutoCommit: disabled
   [junit4]   2> 1784350 INFO  (coreLoadExecutor-3871-thread-3-processing-x:core1) [    x:collection5] o.a.s.u.CommitTracker Soft AutoCommit: disabled
   [junit4]   2> 1784351 INFO  (coreLoadExecutor-3871-thread-3-processing-x:core1) [    x:collection5] o.a.s.u.RandomMergePolicy RandomMergePolicy wrapping class org.apache.lucene.index.LogByteSizeMergePolicy: [LogByteSizeMergePolicy: minMergeSize=1677721, mergeFactor=10, maxMergeSize=2147483648, maxMergeS

[...truncated too long message...]

:core1) [    x:collection2] o.a.s.c.SolrCore [collection2]  CLOSING SolrCore org.apache.solr.core.SolrCore@1877d843
   [junit4]   2> 1788339 INFO  (coreCloseExecutor-4094-thread-1-processing-x:core1) [    x:collection5] o.a.s.m.SolrMetricManager Closing metric reporters for: solr.core.collection5
   [junit4]   2> 1788341 INFO  (coreCloseExecutor-4094-thread-4-processing-x:core1) [    x:collection2] o.a.s.m.SolrMetricManager Closing metric reporters for: solr.core.collection2
   [junit4]   2> 1788341 INFO  (coreCloseExecutor-4094-thread-2-processing-x:core1) [    x:collection1] o.a.s.m.SolrMetricManager Closing metric reporters for: solr.core.collection1
   [junit4]   2> 1788342 INFO  (coreCloseExecutor-4094-thread-3-processing-x:core1) [    x:collection4] o.a.s.m.SolrMetricManager Closing metric reporters for: solr.core.collection4
   [junit4]   2> 1788343 INFO  (TEST-TestLazyCores.testLazySearch-seed#[59AE304D60FF3D46]) [    x:core1] o.a.s.m.SolrMetricManager Closing metric reporters for: solr.node
   [junit4]   2> 1788343 INFO  (TEST-TestLazyCores.testLazySearch-seed#[59AE304D60FF3D46]) [    x:core1] o.a.s.SolrTestCaseJ4 ###Ending testLazySearch
   [junit4]   2> 1788343 INFO  (SUITE-TestLazyCores-seed#[59AE304D60FF3D46]-worker) [    x:core1] o.a.s.SolrTestCaseJ4 ###deleteCore
   [junit4]   2> 1788343 INFO  (SUITE-TestLazyCores-seed#[59AE304D60FF3D46]-worker) [    x:core1] o.a.s.c.CoreContainer Shutting down CoreContainer instance=1868775534
   [junit4]   2> 1788343 INFO  (SUITE-TestLazyCores-seed#[59AE304D60FF3D46]-worker) [    x:core1] o.a.s.m.SolrMetricManager Closing metric reporters for: solr.node
   [junit4]   2> NOTE: leaving temporary files on disk at: /Users/jenkins/workspace/Lucene-Solr-master-MacOSX/solr/build/solr-core/test/J0/temp/solr.core.TestLazyCores_59AE304D60FF3D46-001
   [junit4]   2> Feb 02, 2017 7:00:17 PM com.carrotsearch.randomizedtesting.ThreadLeakControl checkThreadLeaks
   [junit4]   2> WARNING: Will linger awaiting termination of 1 leaked thread(s).
   [junit4]   2> Feb 02, 2017 7:00:37 PM com.carrotsearch.randomizedtesting.ThreadLeakControl checkThreadLeaks
   [junit4]   2> SEVERE: 1 thread leaked from SUITE scope at org.apache.solr.core.TestLazyCores: 
   [junit4]   2>    1) Thread[id=9816, name=searcherExecutor-3954-thread-1, state=WAITING, group=TGRP-TestLazyCores]
   [junit4]   2>         at sun.misc.Unsafe.park(Native Method)
   [junit4]   2>         at java.util.concurrent.locks.LockSupport.park(LockSupport.java:175)
   [junit4]   2>         at java.util.concurrent.locks.AbstractQueuedSynchronizer$ConditionObject.await(AbstractQueuedSynchronizer.java:2039)
   [junit4]   2>         at java.util.concurrent.LinkedBlockingQueue.take(LinkedBlockingQueue.java:442)
   [junit4]   2>         at java.util.concurrent.ThreadPoolExecutor.getTask(ThreadPoolExecutor.java:1067)
   [junit4]   2>         at java.util.concurrent.ThreadPoolExecutor.runWorker(ThreadPoolExecutor.java:1127)
   [junit4]   2>         at java.util.concurrent.ThreadPoolExecutor$Worker.run(ThreadPoolExecutor.java:617)
   [junit4]   2>         at java.lang.Thread.run(Thread.java:745)
   [junit4]   2> Feb 02, 2017 7:00:37 PM com.carrotsearch.randomizedtesting.ThreadLeakControl tryToInterruptAll
   [junit4]   2> INFO: Starting to interrupt leaked threads:
   [junit4]   2>    1) Thread[id=9816, name=searcherExecutor-3954-thread-1, state=WAITING, group=TGRP-TestLazyCores]
   [junit4]   2> Feb 02, 2017 7:00:40 PM com.carrotsearch.randomizedtesting.ThreadLeakControl tryToInterruptAll
   [junit4]   2> SEVERE: There are still zombie threads that couldn't be terminated:
   [junit4]   2>    1) Thread[id=9816, name=searcherExecutor-3954-thread-1, state=WAITING, group=TGRP-TestLazyCores]
   [junit4]   2>         at sun.misc.Unsafe.park(Native Method)
   [junit4]   2>         at java.util.concurrent.locks.LockSupport.park(LockSupport.java:175)
   [junit4]   2>         at java.util.concurrent.locks.AbstractQueuedSynchronizer$ConditionObject.await(AbstractQueuedSynchronizer.java:2039)
   [junit4]   2>         at java.util.concurrent.LinkedBlockingQueue.take(LinkedBlockingQueue.java:442)
   [junit4]   2>         at java.util.concurrent.ThreadPoolExecutor.getTask(ThreadPoolExecutor.java:1067)
   [junit4]   2>         at java.util.concurrent.ThreadPoolExecutor.runWorker(ThreadPoolExecutor.java:1127)
   [junit4]   2>         at java.util.concurrent.ThreadPoolExecutor$Worker.run(ThreadPoolExecutor.java:617)
   [junit4]   2>         at java.lang.Thread.run(Thread.java:745)
   [junit4]   2> NOTE: test params are: codec=Lucene70, sim=RandomSimilarity(queryNorm=false): {}, locale=ms-MY, timezone=America/St_Lucia
   [junit4]   2> NOTE: Mac OS X 10.11.6 x86_64/Oracle Corporation 1.8.0_121 (64-bit)/cpus=3,threads=2,free=152006432,total=422576128
   [junit4]   2> NOTE: All tests run in this JVM: [TestLeaderInitiatedRecoveryThread, TolerantUpdateProcessorTest, TestFieldResource, TestSolrCloudSnapshots, TestCryptoKeys, TestDocBasedVersionConstraints, TestSurroundQueryParser, TestMacroExpander, TestRuleBasedAuthorizationPlugin, TestRestoreCore, HdfsDirectoryTest, ZkNodePropsTest, MoreLikeThisHandlerTest, DistribJoinFromCollectionTest, TestReRankQParserPlugin, TestSolrFieldCacheMBean, TestCharFilters, TestFieldCacheReopen, SyncSliceTest, TestSimpleQParserPlugin, FileUtilsTest, DistributedFacetPivotWhiteBoxTest, TestDistributedSearch, HLLSerializationTest, CdcrReplicationHandlerTest, TestDelegationWithHadoopAuth, CdcrBootstrapTest, DOMUtilTest, TestFieldCacheVsDocValues, TestTolerantSearch, TestElisionMultitermQuery, TestPseudoReturnFields, PingRequestHandlerTest, LeaderFailureAfterFreshStartTest, SystemInfoHandlerTest, TestJsonRequest, TestLRUCache, TestSolrCLIRunExample, PreAnalyzedUpdateProcessorTest, UnloadDistributedZkTest, FacetPivotSmallTest, TestStressLucene, TestBulkSchemaConcurrent, TestStressUserVersions, LeaderElectionTest, TestDefaultStatsCache, BlockDirectoryTest, SolrCoreMetricManagerTest, DistributedQueryComponentOptimizationTest, TestLockTree, TestDistributedStatsComponentCardinality, TestCoreAdminApis, MergeStrategyTest, SecurityConfHandlerTest, TestManagedSynonymFilterFactory, SimpleFacetsTest, ConfigSetsAPITest, SolrCoreTest, TestCorePropertiesReload, TestSolrJ, DisMaxRequestHandlerTest, TriLevelCompositeIdRoutingTest, TestReplicaProperties, TestTolerantUpdateProcessorRandomCloud, TestSizeLimitedDistributedMap, SolrCLIZkUtilsTest, XmlUpdateRequestHandlerTest, TestSolrCloudWithKerberosAlt, OverseerTaskQueueTest, SparseHLLTest, TestCSVResponseWriter, TestCollectionAPI, TestXIncludeConfig, RulesTest, TestOnReconnectListenerSupport, ReplaceNodeTest, TestNRTOpen, DistributedMLTComponentTest, TestPerFieldSimilarity, TestUniqueKeyFieldResource, TemplateUpdateProcessorTest, TestNumericTerms64, TestLFUCache, DistribCursorPagingTest, ForceLeaderTest, LeaderInitiatedRecoveryOnShardRestartTest, TestHashQParserPlugin, TestSolrCloudWithHadoopAuthPlugin, TimeZoneUtilsTest, DocumentBuilderTest, BinaryUpdateRequestHandlerTest, ShardRoutingTest, TestCloudRecovery, TestSortByMinMaxFunction, TestPostingsSolrHighlighter, HdfsThreadLeakTest, ConnectionReuseTest, TestQuerySenderNoQuery, CollectionReloadTest, FastVectorHighlighterTest, StatelessScriptUpdateProcessorFactoryTest, AsyncCallRequestStatusResponseTest, TestBinaryResponseWriter, TestLazyCores]
   [junit4]   2> NOTE: reproduce with: ant test  -Dtestcase=TestLazyCores -Dtests.seed=59AE304D60FF3D46 -Dtests.slow=true -Dtests.locale=ms-MY -Dtests.timezone=America/St_Lucia -Dtests.asserts=true -Dtests.file.encoding=UTF-8
   [junit4] ERROR   0.00s J0 | TestLazyCores (suite) <<<
   [junit4]    > Throwable #1: com.carrotsearch.randomizedtesting.ThreadLeakError: 1 thread leaked from SUITE scope at org.apache.solr.core.TestLazyCores: 
   [junit4]    >    1) Thread[id=9816, name=searcherExecutor-3954-thread-1, state=WAITING, group=TGRP-TestLazyCores]
   [junit4]    >         at sun.misc.Unsafe.park(Native Method)
   [junit4]    >         at java.util.concurrent.locks.LockSupport.park(LockSupport.java:175)
   [junit4]    >         at java.util.concurrent.locks.AbstractQueuedSynchronizer$ConditionObject.await(AbstractQueuedSynchronizer.java:2039)
   [junit4]    >         at java.util.concurrent.LinkedBlockingQueue.take(LinkedBlockingQueue.java:442)
   [junit4]    >         at java.util.concurrent.ThreadPoolExecutor.getTask(ThreadPoolExecutor.java:1067)
   [junit4]    >         at java.util.concurrent.ThreadPoolExecutor.runWorker(ThreadPoolExecutor.java:1127)
   [junit4]    >         at java.util.concurrent.ThreadPoolExecutor$Worker.run(ThreadPoolExecutor.java:617)
   [junit4]    >         at java.lang.Thread.run(Thread.java:745)
   [junit4]    > 	at __randomizedtesting.SeedInfo.seed([59AE304D60FF3D46]:0)Throwable #2: com.carrotsearch.randomizedtesting.ThreadLeakError: There are still zombie threads that couldn't be terminated:
   [junit4]    >    1) Thread[id=9816, name=searcherExecutor-3954-thread-1, state=WAITING, group=TGRP-TestLazyCores]
   [junit4]    >         at sun.misc.Unsafe.park(Native Method)
   [junit4]    >         at java.util.concurrent.locks.LockSupport.park(LockSupport.java:175)
   [junit4]    >         at java.util.concurrent.locks.AbstractQueuedSynchronizer$ConditionObject.await(AbstractQueuedSynchronizer.java:2039)
   [junit4]    >         at java.util.concurrent.LinkedBlockingQueue.take(LinkedBlockingQueue.java:442)
   [junit4]    >         at java.util.concurrent.ThreadPoolExecutor.getTask(ThreadPoolExecutor.java:1067)
   [junit4]    >         at java.util.concurrent.ThreadPoolExecutor.runWorker(ThreadPoolExecutor.java:1127)
   [junit4]    >         at java.util.concurrent.ThreadPoolExecutor$Worker.run(ThreadPoolExecutor.java:617)
   [junit4]    >         at java.lang.Thread.run(Thread.java:745)
   [junit4]    > 	at __randomizedtesting.SeedInfo.seed([59AE304D60FF3D46]:0)
   [junit4] Completed [281/692 (1!)] on J0 in 29.77s, 9 tests, 3 errors <<< FAILURES!

[...truncated 63762 lines...]


Mime
View raw message