lucene-dev mailing list archives

Site index · List index
Message view « Date » · « Thread »
Top « Date » · « Thread »
From Apache Jenkins Server <jenk...@builds.apache.org>
Subject [JENKINS] Lucene-Solr-Tests-6.4 - Build # 17 - Still Unstable
Date Thu, 02 Feb 2017 14:09:33 GMT
Build: https://builds.apache.org/job/Lucene-Solr-Tests-6.4/17/

1 tests failed.
FAILED:  org.apache.solr.handler.admin.MBeansHandlerTest.testDiff

Error Message:
expected:<Was: [1, Now: 2], Delta: 1> but was:<Was: [4, Now: 5], Delta: 1>

Stack Trace:
org.junit.ComparisonFailure: expected:<Was: [1, Now: 2], Delta: 1> but was:<Was:
[4, Now: 5], Delta: 1>
	at __randomizedtesting.SeedInfo.seed([F8619F3A665C0844:3D775BA176EA3024]:0)
	at org.junit.Assert.assertEquals(Assert.java:125)
	at org.junit.Assert.assertEquals(Assert.java:147)
	at org.apache.solr.handler.admin.MBeansHandlerTest.testDiff(MBeansHandlerTest.java:63)
	at sun.reflect.NativeMethodAccessorImpl.invoke0(Native Method)
	at sun.reflect.NativeMethodAccessorImpl.invoke(NativeMethodAccessorImpl.java:62)
	at sun.reflect.DelegatingMethodAccessorImpl.invoke(DelegatingMethodAccessorImpl.java:43)
	at java.lang.reflect.Method.invoke(Method.java:498)
	at com.carrotsearch.randomizedtesting.RandomizedRunner.invoke(RandomizedRunner.java:1713)
	at com.carrotsearch.randomizedtesting.RandomizedRunner$8.evaluate(RandomizedRunner.java:907)
	at com.carrotsearch.randomizedtesting.RandomizedRunner$9.evaluate(RandomizedRunner.java:943)
	at com.carrotsearch.randomizedtesting.RandomizedRunner$10.evaluate(RandomizedRunner.java:957)
	at com.carrotsearch.randomizedtesting.rules.SystemPropertiesRestoreRule$1.evaluate(SystemPropertiesRestoreRule.java:57)
	at org.apache.lucene.util.TestRuleSetupTeardownChained$1.evaluate(TestRuleSetupTeardownChained.java:49)
	at org.apache.lucene.util.AbstractBeforeAfterRule$1.evaluate(AbstractBeforeAfterRule.java:45)
	at org.apache.lucene.util.TestRuleThreadAndTestName$1.evaluate(TestRuleThreadAndTestName.java:48)
	at org.apache.lucene.util.TestRuleIgnoreAfterMaxFailures$1.evaluate(TestRuleIgnoreAfterMaxFailures.java:64)
	at org.apache.lucene.util.TestRuleMarkFailure$1.evaluate(TestRuleMarkFailure.java:47)
	at com.carrotsearch.randomizedtesting.rules.StatementAdapter.evaluate(StatementAdapter.java:36)
	at com.carrotsearch.randomizedtesting.ThreadLeakControl$StatementRunner.run(ThreadLeakControl.java:367)
	at com.carrotsearch.randomizedtesting.ThreadLeakControl.forkTimeoutingTask(ThreadLeakControl.java:811)
	at com.carrotsearch.randomizedtesting.ThreadLeakControl$3.evaluate(ThreadLeakControl.java:462)
	at com.carrotsearch.randomizedtesting.RandomizedRunner.runSingleTest(RandomizedRunner.java:916)
	at com.carrotsearch.randomizedtesting.RandomizedRunner$5.evaluate(RandomizedRunner.java:802)
	at com.carrotsearch.randomizedtesting.RandomizedRunner$6.evaluate(RandomizedRunner.java:852)
	at com.carrotsearch.randomizedtesting.RandomizedRunner$7.evaluate(RandomizedRunner.java:863)
	at com.carrotsearch.randomizedtesting.rules.StatementAdapter.evaluate(StatementAdapter.java:36)
	at com.carrotsearch.randomizedtesting.rules.SystemPropertiesRestoreRule$1.evaluate(SystemPropertiesRestoreRule.java:57)
	at org.apache.lucene.util.AbstractBeforeAfterRule$1.evaluate(AbstractBeforeAfterRule.java:45)
	at com.carrotsearch.randomizedtesting.rules.StatementAdapter.evaluate(StatementAdapter.java:36)
	at org.apache.lucene.util.TestRuleStoreClassName$1.evaluate(TestRuleStoreClassName.java:41)
	at com.carrotsearch.randomizedtesting.rules.NoShadowingOrOverridesOnMethodsRule$1.evaluate(NoShadowingOrOverridesOnMethodsRule.java:40)
	at com.carrotsearch.randomizedtesting.rules.NoShadowingOrOverridesOnMethodsRule$1.evaluate(NoShadowingOrOverridesOnMethodsRule.java:40)
	at com.carrotsearch.randomizedtesting.rules.StatementAdapter.evaluate(StatementAdapter.java:36)
	at com.carrotsearch.randomizedtesting.rules.StatementAdapter.evaluate(StatementAdapter.java:36)
	at com.carrotsearch.randomizedtesting.rules.StatementAdapter.evaluate(StatementAdapter.java:36)
	at org.apache.lucene.util.TestRuleAssertionsRequired$1.evaluate(TestRuleAssertionsRequired.java:53)
	at org.apache.lucene.util.TestRuleMarkFailure$1.evaluate(TestRuleMarkFailure.java:47)
	at org.apache.lucene.util.TestRuleIgnoreAfterMaxFailures$1.evaluate(TestRuleIgnoreAfterMaxFailures.java:64)
	at org.apache.lucene.util.TestRuleIgnoreTestSuites$1.evaluate(TestRuleIgnoreTestSuites.java:54)
	at com.carrotsearch.randomizedtesting.rules.StatementAdapter.evaluate(StatementAdapter.java:36)
	at com.carrotsearch.randomizedtesting.ThreadLeakControl$StatementRunner.run(ThreadLeakControl.java:367)
	at java.lang.Thread.run(Thread.java:745)




Build Log:
[...truncated 12111 lines...]
   [junit4] Suite: org.apache.solr.handler.admin.MBeansHandlerTest
   [junit4]   2> Creating dataDir: /x1/jenkins/jenkins-slave/workspace/Lucene-Solr-Tests-6.4/solr/build/solr-core/test/J2/temp/solr.handler.admin.MBeansHandlerTest_F8619F3A665C0844-001/init-core-data-001
   [junit4]   2> 1468733 INFO  (SUITE-MBeansHandlerTest-seed#[F8619F3A665C0844]-worker)
[    ] o.a.s.SolrTestCaseJ4 Randomized ssl (true) and clientAuth (false) via: @org.apache.solr.util.RandomizeSSL(reason=,
ssl=NaN, value=NaN, clientAuth=NaN)
   [junit4]   2> 1468734 INFO  (SUITE-MBeansHandlerTest-seed#[F8619F3A665C0844]-worker)
[    ] o.a.s.SolrTestCaseJ4 ####initCore
   [junit4]   2> 1468734 INFO  (SUITE-MBeansHandlerTest-seed#[F8619F3A665C0844]-worker)
[    ] o.a.s.c.SolrResourceLoader [null] Added 2 libs to classloader, from paths: [/x1/jenkins/jenkins-slave/workspace/Lucene-Solr-Tests-6.4/solr/core/src/test-files/solr/collection1/lib,
/x1/jenkins/jenkins-slave/workspace/Lucene-Solr-Tests-6.4/solr/core/src/test-files/solr/collection1/lib/classes]
   [junit4]   2> 1468784 INFO  (SUITE-MBeansHandlerTest-seed#[F8619F3A665C0844]-worker)
[    ] o.a.s.c.SolrConfig Using Lucene MatchVersion: 6.4.1
   [junit4]   2> 1468807 INFO  (SUITE-MBeansHandlerTest-seed#[F8619F3A665C0844]-worker)
[    ] o.a.s.s.IndexSchema [null] Schema name=test
   [junit4]   2> 1468905 WARN  (SUITE-MBeansHandlerTest-seed#[F8619F3A665C0844]-worker)
[    ] o.a.s.s.IndexSchema [null] default search field in schema is text. WARNING: Deprecated,
please use 'df' on request instead.
   [junit4]   2> 1468907 INFO  (SUITE-MBeansHandlerTest-seed#[F8619F3A665C0844]-worker)
[    ] o.a.s.s.IndexSchema Loaded schema test/1.0 with uniqueid field id
   [junit4]   2> 1468916 INFO  (SUITE-MBeansHandlerTest-seed#[F8619F3A665C0844]-worker)
[    ] o.a.s.u.UpdateShardHandler Creating UpdateShardHandler HTTP client with params: socketTimeout=30000&connTimeout=30000&retry=true
   [junit4]   2> 1468918 WARN  (SUITE-MBeansHandlerTest-seed#[F8619F3A665C0844]-worker)
[    ] o.a.s.m.r.SolrJmxReporter No serviceUrl or agentId was configured, using first MBeanServer.
   [junit4]   2> 1468921 INFO  (SUITE-MBeansHandlerTest-seed#[F8619F3A665C0844]-worker)
[    ] o.a.s.m.r.SolrJmxReporter JMX monitoring enabled at server: com.sun.jmx.mbeanserver.JmxMBeanServer@44dc92a4
   [junit4]   2> 1468921 WARN  (SUITE-MBeansHandlerTest-seed#[F8619F3A665C0844]-worker)
[    ] o.a.s.m.r.SolrJmxReporter No serviceUrl or agentId was configured, using first MBeanServer.
   [junit4]   2> 1468925 INFO  (SUITE-MBeansHandlerTest-seed#[F8619F3A665C0844]-worker)
[    ] o.a.s.m.r.SolrJmxReporter JMX monitoring enabled at server: com.sun.jmx.mbeanserver.JmxMBeanServer@44dc92a4
   [junit4]   2> 1468925 WARN  (SUITE-MBeansHandlerTest-seed#[F8619F3A665C0844]-worker)
[    ] o.a.s.m.r.SolrJmxReporter No serviceUrl or agentId was configured, using first MBeanServer.
   [junit4]   2> 1468925 INFO  (SUITE-MBeansHandlerTest-seed#[F8619F3A665C0844]-worker)
[    ] o.a.s.m.r.SolrJmxReporter JMX monitoring enabled at server: com.sun.jmx.mbeanserver.JmxMBeanServer@44dc92a4
   [junit4]   2> 1468927 INFO  (coreLoadExecutor-6565-thread-1) [    x:collection1] o.a.s.c.SolrResourceLoader
[null] Added 2 libs to classloader, from paths: [/x1/jenkins/jenkins-slave/workspace/Lucene-Solr-Tests-6.4/solr/core/src/test-files/solr/collection1/lib,
/x1/jenkins/jenkins-slave/workspace/Lucene-Solr-Tests-6.4/solr/core/src/test-files/solr/collection1/lib/classes]
   [junit4]   2> 1468953 INFO  (coreLoadExecutor-6565-thread-1) [    x:collection1] o.a.s.c.SolrConfig
Using Lucene MatchVersion: 6.4.1
   [junit4]   2> 1468977 INFO  (coreLoadExecutor-6565-thread-1) [    x:collection1] o.a.s.s.IndexSchema
[collection1] Schema name=test
   [junit4]   2> 1469068 WARN  (coreLoadExecutor-6565-thread-1) [    x:collection1] o.a.s.s.IndexSchema
[collection1] default search field in schema is text. WARNING: Deprecated, please use 'df'
on request instead.
   [junit4]   2> 1469070 INFO  (coreLoadExecutor-6565-thread-1) [    x:collection1] o.a.s.s.IndexSchema
Loaded schema test/1.0 with uniqueid field id
   [junit4]   2> 1469077 INFO  (coreLoadExecutor-6565-thread-1) [    x:collection1] o.a.s.c.CoreContainer
Creating SolrCore 'collection1' using configuration from instancedir /x1/jenkins/jenkins-slave/workspace/Lucene-Solr-Tests-6.4/solr/core/src/test-files/solr/collection1
   [junit4]   2> 1469077 WARN  (coreLoadExecutor-6565-thread-1) [    x:collection1] o.a.s.m.r.SolrJmxReporter
No serviceUrl or agentId was configured, using first MBeanServer.
   [junit4]   2> 1469077 INFO  (coreLoadExecutor-6565-thread-1) [    x:collection1] o.a.s.m.r.SolrJmxReporter
JMX monitoring enabled at server: com.sun.jmx.mbeanserver.JmxMBeanServer@44dc92a4
   [junit4]   2> 1469077 INFO  (coreLoadExecutor-6565-thread-1) [    x:collection1] o.a.s.c.SolrCore
[[collection1] ] Opening new SolrCore at [/x1/jenkins/jenkins-slave/workspace/Lucene-Solr-Tests-6.4/solr/core/src/test-files/solr/collection1],
dataDir=[/x1/jenkins/jenkins-slave/workspace/Lucene-Solr-Tests-6.4/solr/build/solr-core/test/J2/temp/solr.handler.admin.MBeansHandlerTest_F8619F3A665C0844-001/init-core-data-001/]
   [junit4]   2> 1469078 INFO  (coreLoadExecutor-6565-thread-1) [    x:collection1] o.a.s.c.JmxMonitoredMap
JMX monitoring is enabled. Adding Solr mbeans to JMX Server: com.sun.jmx.mbeanserver.JmxMBeanServer@44dc92a4
   [junit4]   2> 1469079 INFO  (coreLoadExecutor-6565-thread-1) [    x:collection1] o.a.s.u.RandomMergePolicy
RandomMergePolicy wrapping class org.apache.lucene.index.LogByteSizeMergePolicy: [LogByteSizeMergePolicy:
minMergeSize=1677721, mergeFactor=26, maxMergeSize=2147483648, maxMergeSizeForForcedMerge=9223372036854775807,
calibrateSizeByDeletes=false, maxMergeDocs=2147483647, maxCFSSegmentSizeMB=8.796093022207999E12,
noCFSRatio=0.2022950829647135]
   [junit4]   2> 1469109 INFO  (coreLoadExecutor-6565-thread-1) [    x:collection1] o.a.s.u.UpdateHandler
Using UpdateLog implementation: org.apache.solr.update.UpdateLog
   [junit4]   2> 1469109 INFO  (coreLoadExecutor-6565-thread-1) [    x:collection1] o.a.s.u.UpdateLog
Initializing UpdateLog: dataDir= defaultSyncLevel=FLUSH numRecordsToKeep=100 maxNumLogsToKeep=10
numVersionBuckets=65536
   [junit4]   2> 1469110 INFO  (coreLoadExecutor-6565-thread-1) [    x:collection1] o.a.s.u.CommitTracker
Hard AutoCommit: disabled
   [junit4]   2> 1469110 INFO  (coreLoadExecutor-6565-thread-1) [    x:collection1] o.a.s.u.CommitTracker
Soft AutoCommit: disabled
   [junit4]   2> 1469111 INFO  (coreLoadExecutor-6565-thread-1) [    x:collection1] o.a.s.u.RandomMergePolicy
RandomMergePolicy wrapping class org.apache.lucene.index.TieredMergePolicy: [TieredMergePolicy:
maxMergeAtOnce=50, maxMergeAtOnceExplicit=36, maxMergedSegmentMB=99.9599609375, floorSegmentMB=0.205078125,
forceMergeDeletesPctAllowed=11.886103575492426, segmentsPerTier=15.0, maxCFSSegmentSizeMB=8.796093022207999E12,
noCFSRatio=0.0
   [junit4]   2> 1469111 INFO  (coreLoadExecutor-6565-thread-1) [    x:collection1] o.a.s.s.SolrIndexSearcher
Opening [Searcher@159a08c5[collection1] main]
   [junit4]   2> 1469112 INFO  (coreLoadExecutor-6565-thread-1) [    x:collection1] o.a.s.h.c.SpellCheckComponent
Initializing spell checkers
   [junit4]   2> 1469119 INFO  (coreLoadExecutor-6565-thread-1) [    x:collection1] o.a.s.s.DirectSolrSpellChecker
init: {name=direct,classname=DirectSolrSpellChecker,field=lowerfilt,minQueryLength=3}
   [junit4]   2> 1469147 INFO  (coreLoadExecutor-6565-thread-1) [    x:collection1] o.a.s.h.ReplicationHandler
Commits will be reserved for  10000
   [junit4]   2> 1469147 INFO  (searcherExecutor-6566-thread-1-processing-x:collection1)
[    x:collection1] o.a.s.h.c.SpellCheckComponent Loading spell index for spellchecker: default
   [junit4]   2> 1469147 INFO  (searcherExecutor-6566-thread-1-processing-x:collection1)
[    x:collection1] o.a.s.h.c.SpellCheckComponent Loading spell index for spellchecker: direct
   [junit4]   2> 1469147 INFO  (searcherExecutor-6566-thread-1-processing-x:collection1)
[    x:collection1] o.a.s.h.c.SpellCheckComponent Loading spell index for spellchecker: wordbreak
   [junit4]   2> 1469148 INFO  (searcherExecutor-6566-thread-1-processing-x:collection1)
[    x:collection1] o.a.s.h.c.SpellCheckComponent Loading spell index for spellchecker: multipleFields
   [junit4]   2> 1469148 INFO  (searcherExecutor-6566-thread-1-processing-x:collection1)
[    x:collection1] o.a.s.h.c.SpellCheckComponent Loading spell index for spellchecker: jarowinkler
   [junit4]   2> 1469148 INFO  (searcherExecutor-6566-thread-1-processing-x:collection1)
[    x:collection1] o.a.s.h.c.SpellCheckComponent Loading spell index for spellchecker: external
   [junit4]   2> 1469148 INFO  (searcherExecutor-6566-thread-1-processing-x:collection1)
[    x:collection1] o.a.s.h.c.SpellCheckComponent Loading spell index for spellchecker: freq
   [junit4]   2> 1469148 INFO  (coreLoadExecutor-6565-thread-1) [    x:collection1] o.a.s.u.UpdateLog
Could not find max version in index or recent updates, using new clock 1558228295234879488
   [junit4]   2> 1469149 INFO  (searcherExecutor-6566-thread-1-processing-x:collection1)
[    x:collection1] o.a.s.h.c.SpellCheckComponent Loading spell index for spellchecker: fqcn
   [junit4]   2> 1469149 INFO  (searcherExecutor-6566-thread-1-processing-x:collection1)
[    x:collection1] o.a.s.h.c.SpellCheckComponent Loading spell index for spellchecker: perDict
   [junit4]   2> 1469150 INFO  (searcherExecutor-6566-thread-1-processing-x:collection1)
[    x:collection1] o.a.s.c.SolrCore [collection1] Registered new searcher Searcher@159a08c5[collection1]
main{ExitableDirectoryReader(UninvertingDirectoryReader())}
   [junit4]   2> 1469151 INFO  (SUITE-MBeansHandlerTest-seed#[F8619F3A665C0844]-worker)
[    ] o.a.s.SolrTestCaseJ4 ####initCore end
   [junit4]   2> 1469154 INFO  (TEST-MBeansHandlerTest.testXMLDiffWithExternalEntity-seed#[F8619F3A665C0844])
[    ] o.a.s.SolrTestCaseJ4 ###Starting testXMLDiffWithExternalEntity
   [junit4]   2> 1469155 INFO  (TEST-MBeansHandlerTest.testXMLDiffWithExternalEntity-seed#[F8619F3A665C0844])
[    ] o.a.s.SolrTestCaseJ4 ###Ending testXMLDiffWithExternalEntity
   [junit4]   2> 1469156 INFO  (TEST-MBeansHandlerTest.testBackCompatNames-seed#[F8619F3A665C0844])
[    ] o.a.s.SolrTestCaseJ4 ###Starting testBackCompatNames
   [junit4]   2> 1469158 INFO  (TEST-MBeansHandlerTest.testBackCompatNames-seed#[F8619F3A665C0844])
[    ] o.a.s.c.S.Request [collection1]  webapp=null path=null params={qt=/admin/mbeans&wt=xml}
status=0 QTime=1
   [junit4]   2> 1469164 INFO  (TEST-MBeansHandlerTest.testBackCompatNames-seed#[F8619F3A665C0844])
[    ] o.a.s.c.S.Request [collection1]  webapp=null path=null params={qt=/admin/mbeans&cat=QUERYHANDLER&wt=xml}
status=0 QTime=0
   [junit4]   2> 1469165 INFO  (TEST-MBeansHandlerTest.testBackCompatNames-seed#[F8619F3A665C0844])
[    ] o.a.s.c.S.Request [collection1]  webapp=null path=null params={qt=/admin/mbeans&cat=UPDATE&wt=xml}
status=0 QTime=0
   [junit4]   2> 1469166 INFO  (TEST-MBeansHandlerTest.testBackCompatNames-seed#[F8619F3A665C0844])
[    ] o.a.s.SolrTestCaseJ4 ###Ending testBackCompatNames
   [junit4]   2> 1469177 INFO  (TEST-MBeansHandlerTest.testDiff-seed#[F8619F3A665C0844])
[    ] o.a.s.SolrTestCaseJ4 ###Starting testDiff
   [junit4]   2> 1469183 INFO  (TEST-MBeansHandlerTest.testDiff-seed#[F8619F3A665C0844])
[    ] o.a.s.c.S.Request [collection1]  webapp=null path=null params={qt=/admin/mbeans&stats=true&wt=xml}
status=0 QTime=5
   [junit4]   2> 1469220 INFO  (TEST-MBeansHandlerTest.testDiff-seed#[F8619F3A665C0844])
[    ] o.a.s.c.S.Request [collection1]  webapp=null path=null params={qt=/admin/mbeans&stats=true&diff=true&wt=xml}
status=0 QTime=35
   [junit4]   2> 1469224 INFO  (TEST-MBeansHandlerTest.testDiff-seed#[F8619F3A665C0844])
[    ] o.a.s.SolrTestCaseJ4 ###Ending testDiff
   [junit4]   2> NOTE: reproduce with: ant test  -Dtestcase=MBeansHandlerTest -Dtests.method=testDiff
-Dtests.seed=F8619F3A665C0844 -Dtests.multiplier=2 -Dtests.slow=true -Dtests.locale=fi-FI
-Dtests.timezone=Asia/Tokyo -Dtests.asserts=true -Dtests.file.encoding=UTF-8
   [junit4] FAILURE 0.07s J2 | MBeansHandlerTest.testDiff <<<
   [junit4]    > Throwable #1: org.junit.ComparisonFailure: expected:<Was: [1, Now:
2], Delta: 1> but was:<Was: [4, Now: 5], Delta: 1>
   [junit4]    > 	at __randomizedtesting.SeedInfo.seed([F8619F3A665C0844:3D775BA176EA3024]:0)
   [junit4]    > 	at org.apache.solr.handler.admin.MBeansHandlerTest.testDiff(MBeansHandlerTest.java:63)
   [junit4]    > 	at java.lang.Thread.run(Thread.java:745)
   [junit4]   2> 1469238 INFO  (SUITE-MBeansHandlerTest-seed#[F8619F3A665C0844]-worker)
[    ] o.a.s.SolrTestCaseJ4 ###deleteCore
   [junit4]   2> 1469238 INFO  (SUITE-MBeansHandlerTest-seed#[F8619F3A665C0844]-worker)
[    ] o.a.s.c.CoreContainer Shutting down CoreContainer instance=1384754021
   [junit4]   2> 1469256 INFO  (coreCloseExecutor-6571-thread-1) [    x:collection1] o.a.s.c.SolrCore
[collection1]  CLOSING SolrCore org.apache.solr.core.SolrCore@56e2c28e
   [junit4]   2> 1469314 INFO  (coreCloseExecutor-6571-thread-1) [    x:collection1] o.a.s.m.SolrMetricManager
Closing metric reporters for: solr.core.collection1
   [junit4]   2> 1469317 INFO  (SUITE-MBeansHandlerTest-seed#[F8619F3A665C0844]-worker)
[    ] o.a.s.m.SolrMetricManager Closing metric reporters for: solr.node
   [junit4]   2> NOTE: leaving temporary files on disk at: /x1/jenkins/jenkins-slave/workspace/Lucene-Solr-Tests-6.4/solr/build/solr-core/test/J2/temp/solr.handler.admin.MBeansHandlerTest_F8619F3A665C0844-001
   [junit4]   2> NOTE: test params are: codec=Lucene62, sim=RandomSimilarity(queryNorm=true,coord=no):
{}, locale=fi-FI, timezone=Asia/Tokyo
   [junit4]   2> NOTE: Linux 3.13.0-85-generic amd64/Oracle Corporation 1.8.0_102 (64-bit)/cpus=4,threads=1,free=205960472,total=531103744
   [junit4]   2> NOTE: All tests run in this JVM: [SolrCoreMetricManagerTest, FieldMutatingUpdateProcessorTest,
ParsingFieldUpdateProcessorsTest, VersionInfoTest, SuggesterWFSTTest, AddBlockUpdateTest,
QueryParsingTest, PKIAuthenticationIntegrationTest, TestDistributedMissingSort, OverseerModifyCollectionTest,
TestManagedSynonymFilterFactory, BadIndexSchemaTest, ConnectionReuseTest, CircularListTest,
FieldAnalysisRequestHandlerTest, SuggesterTest, TestRuleBasedAuthorizationPlugin, TestLeaderInitiatedRecoveryThread,
TestCollapseQParserPlugin, LeaderInitiatedRecoveryOnShardRestartTest, TestSolrQueryResponse,
TestSolrConfigHandlerCloud, TestBinaryResponseWriter, BufferStoreTest, DirectUpdateHandlerTest,
TestIndexSearcher, OverseerTest, RestartWhileUpdatingTest, TestIndexingPerformance, TestManagedResourceStorage,
LeaderElectionTest, TestUseDocValuesAsStored2, MetricsHandlerTest, CdcrBootstrapTest, LeaderFailoverAfterPartitionTest,
TestSolrXml, HardAutoCommitTest, TestConfigSetsAPIZkFailure, ClassificationUpdateProcessorFactoryTest,
RecoveryZkTest, TestMiniSolrCloudCluster, UnloadDistributedZkTest, TestTolerantSearch, HdfsRecoverLeaseTest,
TestTrieFacet, CollectionsAPISolrJTest, TestSolrJ, TestRTimerTree, TestRebalanceLeaders, MinimalSchemaTest,
StatelessScriptUpdateProcessorFactoryTest, TestFieldCacheVsDocValues, TestSmileRequest, SolrTestCaseJ4Test,
AutoCommitTest, TestStressReorder, RequestHandlersTest, TestMergePolicyConfig, ShowFileRequestHandlerTest,
CleanupOldIndexTest, TestCoreDiscovery, TestDefaultStatsCache, CdcrRequestHandlerTest, SolrPluginUtilsTest,
TestAnalyzedSuggestions, DistributedQueryComponentCustomSortTest, HdfsDirectoryFactoryTest,
NoCacheHeaderTest, TestJmxMonitoredMap, TestDynamicLoading, UpdateParamsTest, TimeZoneUtilsTest,
SolrCoreCheckLockOnStartupTest, TestCollectionAPI, TestReload, TestFieldCacheSanityChecker,
BasicDistributedZk2Test, TestWriterPerf, TestHighFrequencyDictionaryFactory, TestInitParams,
StatsComponentTest, TestPhraseSuggestions, CoreSorterTest, DistributedQueueTest, TestSolrQueryParser,
BlobRepositoryCloudTest, HdfsBasicDistributedZk2Test, DeleteInactiveReplicaTest, DistributedFacetExistsSmallTest,
TestDocBasedVersionConstraints, TlogReplayBufferedWhileIndexingTest, LukeRequestHandlerTest,
TestBinaryField, TestShardHandlerFactory, RequestLoggingTest, TestCustomSort, TestSchemaVersionResource,
SpellPossibilityIteratorTest, OverseerTaskQueueTest, TestZkChroot, CollectionStateFormat2Test,
TestSolrQueryParserResource, TestDocTermOrds, TestConfigSets, TestShortCircuitedRequests,
ResponseLogComponentTest, DocValuesMultiTest, SimpleFacetsTest, TestHdfsCloudBackupRestore,
ChangedSchemaMergeTest, ChaosMonkeySafeLeaderTest, LeaderElectionIntegrationTest, ShardRoutingTest,
ClusterStateUpdateTest, ZkSolrClientTest, TestDistributedGrouping, TestRecovery, TestHashPartitioner,
DistributedSpellCheckComponentTest, TermVectorComponentDistributedTest, TestRealTimeGet, DistributedTermsComponentTest,
TestCoreContainer, TestSolr4Spatial, QueryElevationComponentTest, ConvertedLegacyTest, BasicFunctionalityTest,
SoftAutoCommitTest, CoreAdminHandlerTest, SuggesterTSTTest, TestStressLucene, PolyFieldTest,
WordBreakSolrSpellCheckerTest, SchemaVersionSpecificBehaviorTest, TestPseudoReturnFields,
TestWordDelimiterFilterFactory, QueryEqualityTest, DirectUpdateHandlerOptimizeTest, SortByFunctionTest,
TestRemoteStreaming, TestSolrDeletionPolicy1, XsltUpdateRequestHandlerTest, DebugComponentTest,
TestQueryUtils, DirectSolrSpellCheckerTest, DocumentAnalysisRequestHandlerTest, TestQueryTypes,
XmlUpdateRequestHandlerTest, TestValueSourceCache, RequiredFieldsTest, IndexSchemaTest, TestCollationField,
ReturnFieldsTest, MBeansHandlerTest]
   [junit4] Completed [407/680 (1!)] on J2 in 0.60s, 3 tests, 1 failure <<< FAILURES!

[...truncated 63268 lines...]



Mime
View raw message