lucene-dev mailing list archives

Site index · List index
Message view « Date » · « Thread »
Top « Date » · « Thread »
From Policeman Jenkins Server <jenk...@thetaphi.de>
Subject [JENKINS] Lucene-Solr-5.5-Linux (32bit/jdk1.7.0_80) - Build # 461 - Unstable!
Date Sat, 11 Feb 2017 23:05:42 GMT
Build: https://jenkins.thetaphi.de/job/Lucene-Solr-5.5-Linux/461/
Java: 32bit/jdk1.7.0_80 -client -XX:+UseParallelGC

1 tests failed.
FAILED:  org.apache.solr.schema.TestManagedSchemaAPI.test

Error Message:
Error from server at http://127.0.0.1:38644/solr/testschemaapi_shard1_replica2: ERROR: [doc=2] unknown field 'myNewField1'

Stack Trace:
org.apache.solr.client.solrj.impl.CloudSolrClient$RouteException: Error from server at http://127.0.0.1:38644/solr/testschemaapi_shard1_replica2: ERROR: [doc=2] unknown field 'myNewField1'
	at __randomizedtesting.SeedInfo.seed([5F57653C84414398:D7035AE62ABD2E60]:0)
	at org.apache.solr.client.solrj.impl.CloudSolrClient.directUpdate(CloudSolrClient.java:653)
	at org.apache.solr.client.solrj.impl.CloudSolrClient.sendRequest(CloudSolrClient.java:1002)
	at org.apache.solr.client.solrj.impl.CloudSolrClient.requestWithRetryOnStaleState(CloudSolrClient.java:891)
	at org.apache.solr.client.solrj.impl.CloudSolrClient.request(CloudSolrClient.java:827)
	at org.apache.solr.schema.TestManagedSchemaAPI.testAddFieldAndDocument(TestManagedSchemaAPI.java:101)
	at org.apache.solr.schema.TestManagedSchemaAPI.test(TestManagedSchemaAPI.java:69)
	at sun.reflect.NativeMethodAccessorImpl.invoke0(Native Method)
	at sun.reflect.NativeMethodAccessorImpl.invoke(NativeMethodAccessorImpl.java:57)
	at sun.reflect.DelegatingMethodAccessorImpl.invoke(DelegatingMethodAccessorImpl.java:43)
	at java.lang.reflect.Method.invoke(Method.java:606)
	at com.carrotsearch.randomizedtesting.RandomizedRunner.invoke(RandomizedRunner.java:1764)
	at com.carrotsearch.randomizedtesting.RandomizedRunner$8.evaluate(RandomizedRunner.java:871)
	at com.carrotsearch.randomizedtesting.RandomizedRunner$9.evaluate(RandomizedRunner.java:907)
	at com.carrotsearch.randomizedtesting.RandomizedRunner$10.evaluate(RandomizedRunner.java:921)
	at com.carrotsearch.randomizedtesting.rules.SystemPropertiesRestoreRule$1.evaluate(SystemPropertiesRestoreRule.java:57)
	at org.apache.lucene.util.TestRuleSetupTeardownChained$1.evaluate(TestRuleSetupTeardownChained.java:49)
	at org.apache.lucene.util.AbstractBeforeAfterRule$1.evaluate(AbstractBeforeAfterRule.java:45)
	at org.apache.lucene.util.TestRuleThreadAndTestName$1.evaluate(TestRuleThreadAndTestName.java:48)
	at org.apache.lucene.util.TestRuleIgnoreAfterMaxFailures$1.evaluate(TestRuleIgnoreAfterMaxFailures.java:64)
	at org.apache.lucene.util.TestRuleMarkFailure$1.evaluate(TestRuleMarkFailure.java:47)
	at com.carrotsearch.randomizedtesting.rules.StatementAdapter.evaluate(StatementAdapter.java:36)
	at com.carrotsearch.randomizedtesting.ThreadLeakControl$StatementRunner.run(ThreadLeakControl.java:367)
	at com.carrotsearch.randomizedtesting.ThreadLeakControl.forkTimeoutingTask(ThreadLeakControl.java:809)
	at com.carrotsearch.randomizedtesting.ThreadLeakControl$3.evaluate(ThreadLeakControl.java:460)
	at com.carrotsearch.randomizedtesting.RandomizedRunner.runSingleTest(RandomizedRunner.java:880)
	at com.carrotsearch.randomizedtesting.RandomizedRunner$5.evaluate(RandomizedRunner.java:781)
	at com.carrotsearch.randomizedtesting.RandomizedRunner$6.evaluate(RandomizedRunner.java:816)
	at com.carrotsearch.randomizedtesting.RandomizedRunner$7.evaluate(RandomizedRunner.java:827)
	at com.carrotsearch.randomizedtesting.rules.StatementAdapter.evaluate(StatementAdapter.java:36)
	at com.carrotsearch.randomizedtesting.rules.SystemPropertiesRestoreRule$1.evaluate(SystemPropertiesRestoreRule.java:57)
	at org.apache.lucene.util.AbstractBeforeAfterRule$1.evaluate(AbstractBeforeAfterRule.java:45)
	at com.carrotsearch.randomizedtesting.rules.StatementAdapter.evaluate(StatementAdapter.java:36)
	at org.apache.lucene.util.TestRuleStoreClassName$1.evaluate(TestRuleStoreClassName.java:41)
	at com.carrotsearch.randomizedtesting.rules.NoShadowingOrOverridesOnMethodsRule$1.evaluate(NoShadowingOrOverridesOnMethodsRule.java:40)
	at com.carrotsearch.randomizedtesting.rules.NoShadowingOrOverridesOnMethodsRule$1.evaluate(NoShadowingOrOverridesOnMethodsRule.java:40)
	at com.carrotsearch.randomizedtesting.rules.StatementAdapter.evaluate(StatementAdapter.java:36)
	at com.carrotsearch.randomizedtesting.rules.StatementAdapter.evaluate(StatementAdapter.java:36)
	at com.carrotsearch.randomizedtesting.rules.StatementAdapter.evaluate(StatementAdapter.java:36)
	at org.apache.lucene.util.TestRuleAssertionsRequired$1.evaluate(TestRuleAssertionsRequired.java:53)
	at org.apache.lucene.util.TestRuleMarkFailure$1.evaluate(TestRuleMarkFailure.java:47)
	at org.apache.lucene.util.TestRuleIgnoreAfterMaxFailures$1.evaluate(TestRuleIgnoreAfterMaxFailures.java:64)
	at org.apache.lucene.util.TestRuleIgnoreTestSuites$1.evaluate(TestRuleIgnoreTestSuites.java:54)
	at com.carrotsearch.randomizedtesting.rules.StatementAdapter.evaluate(StatementAdapter.java:36)
	at com.carrotsearch.randomizedtesting.ThreadLeakControl$StatementRunner.run(ThreadLeakControl.java:367)
	at java.lang.Thread.run(Thread.java:745)
Caused by: org.apache.solr.client.solrj.impl.HttpSolrClient$RemoteSolrException: Error from server at http://127.0.0.1:38644/solr/testschemaapi_shard1_replica2: ERROR: [doc=2] unknown field 'myNewField1'
	at org.apache.solr.client.solrj.impl.HttpSolrClient.executeMethod(HttpSolrClient.java:577)
	at org.apache.solr.client.solrj.impl.HttpSolrClient.request(HttpSolrClient.java:241)
	at org.apache.solr.client.solrj.impl.HttpSolrClient.request(HttpSolrClient.java:230)
	at org.apache.solr.client.solrj.impl.LBHttpSolrClient.doRequest(LBHttpSolrClient.java:372)
	at org.apache.solr.client.solrj.impl.LBHttpSolrClient.request(LBHttpSolrClient.java:325)
	at org.apache.solr.client.solrj.impl.CloudSolrClient$2.call(CloudSolrClient.java:628)
	at org.apache.solr.client.solrj.impl.CloudSolrClient$2.call(CloudSolrClient.java:625)
	at java.util.concurrent.FutureTask.run(FutureTask.java:262)
	at org.apache.solr.common.util.ExecutorUtil$MDCAwareThreadPoolExecutor$1.run(ExecutorUtil.java:231)
	at java.util.concurrent.ThreadPoolExecutor.runWorker(ThreadPoolExecutor.java:1145)
	at java.util.concurrent.ThreadPoolExecutor$Worker.run(ThreadPoolExecutor.java:615)
	... 1 more




Build Log:
[...truncated 11258 lines...]
   [junit4] Suite: org.apache.solr.schema.TestManagedSchemaAPI
   [junit4]   2> Creating dataDir: /home/jenkins/workspace/Lucene-Solr-5.5-Linux/solr/build/solr-core/test/J2/temp/solr.schema.TestManagedSchemaAPI_5F57653C84414398-001/init-core-data-001
   [junit4]   2> 630168 INFO  (SUITE-TestManagedSchemaAPI-seed#[5F57653C84414398]-worker) [    ] o.a.s.SolrTestCaseJ4 Randomized ssl (false) and clientAuth (true)
   [junit4]   2> 630169 INFO  (TEST-TestManagedSchemaAPI.test-seed#[5F57653C84414398]) [    ] o.a.s.SolrTestCaseJ4 ###Starting test
   [junit4]   2> 630170 INFO  (TEST-TestManagedSchemaAPI.test-seed#[5F57653C84414398]) [    ] o.a.s.c.ZkTestServer STARTING ZK TEST SERVER
   [junit4]   2> 630170 INFO  (Thread-1541) [    ] o.a.s.c.ZkTestServer client port:0.0.0.0/0.0.0.0:0
   [junit4]   2> 630170 INFO  (Thread-1541) [    ] o.a.s.c.ZkTestServer Starting server
   [junit4]   2> 630270 INFO  (TEST-TestManagedSchemaAPI.test-seed#[5F57653C84414398]) [    ] o.a.s.c.ZkTestServer start zk server on port:33113
   [junit4]   2> 630271 INFO  (TEST-TestManagedSchemaAPI.test-seed#[5F57653C84414398]) [    ] o.a.s.c.c.SolrZkClient Using default ZkCredentialsProvider
   [junit4]   2> 630271 INFO  (TEST-TestManagedSchemaAPI.test-seed#[5F57653C84414398]) [    ] o.a.s.c.c.ConnectionManager Waiting for client to connect to ZooKeeper
   [junit4]   2> 630273 INFO  (zkCallback-768-thread-1) [    ] o.a.s.c.c.ConnectionManager Watcher org.apache.solr.common.cloud.ConnectionManager@11d2e47 name:ZooKeeperConnection Watcher:127.0.0.1:33113 got event WatchedEvent state:SyncConnected type:None path:null path:null type:None
   [junit4]   2> 630273 INFO  (TEST-TestManagedSchemaAPI.test-seed#[5F57653C84414398]) [    ] o.a.s.c.c.ConnectionManager Client is connected to ZooKeeper
   [junit4]   2> 630273 INFO  (TEST-TestManagedSchemaAPI.test-seed#[5F57653C84414398]) [    ] o.a.s.c.c.SolrZkClient Using default ZkACLProvider
   [junit4]   2> 630273 INFO  (TEST-TestManagedSchemaAPI.test-seed#[5F57653C84414398]) [    ] o.a.s.c.c.SolrZkClient makePath: /solr/solr.xml
   [junit4]   2> 630276 INFO  (jetty-launcher-767-thread-2) [    ] o.e.j.s.Server jetty-9.2.13.v20150730
   [junit4]   2> 630276 INFO  (jetty-launcher-767-thread-1) [    ] o.e.j.s.Server jetty-9.2.13.v20150730
   [junit4]   2> 630276 INFO  (jetty-launcher-767-thread-2) [    ] o.e.j.s.h.ContextHandler Started o.e.j.s.ServletContextHandler@312745{/solr,null,AVAILABLE}
   [junit4]   2> 630277 INFO  (jetty-launcher-767-thread-1) [    ] o.e.j.s.h.ContextHandler Started o.e.j.s.ServletContextHandler@1095873{/solr,null,AVAILABLE}
   [junit4]   2> 630277 INFO  (jetty-launcher-767-thread-2) [    ] o.e.j.s.ServerConnector Started ServerConnector@17a5285{HTTP/1.1}{127.0.0.1:38644}
   [junit4]   2> 630277 INFO  (jetty-launcher-767-thread-1) [    ] o.e.j.s.ServerConnector Started ServerConnector@45c4e3{HTTP/1.1}{127.0.0.1:43268}
   [junit4]   2> 630277 INFO  (jetty-launcher-767-thread-2) [    ] o.e.j.s.Server Started @631489ms
   [junit4]   2> 630277 INFO  (jetty-launcher-767-thread-1) [    ] o.e.j.s.Server Started @631489ms
   [junit4]   2> 630277 INFO  (jetty-launcher-767-thread-2) [    ] o.a.s.c.s.e.JettySolrRunner Jetty properties: {hostContext=/solr, hostPort=38644}
   [junit4]   2> 630277 INFO  (jetty-launcher-767-thread-1) [    ] o.a.s.c.s.e.JettySolrRunner Jetty properties: {hostPort=43268, hostContext=/solr}
   [junit4]   2> 630277 INFO  (jetty-launcher-767-thread-2) [    ] o.a.s.s.SolrDispatchFilter SolrDispatchFilter.init(): sun.misc.Launcher$AppClassLoader@b0f0ae
   [junit4]   2> 630277 INFO  (jetty-launcher-767-thread-1) [    ] o.a.s.s.SolrDispatchFilter SolrDispatchFilter.init(): sun.misc.Launcher$AppClassLoader@b0f0ae
   [junit4]   2> 630277 INFO  (jetty-launcher-767-thread-2) [    ] o.a.s.c.SolrResourceLoader new SolrResourceLoader for directory: '/home/jenkins/workspace/Lucene-Solr-5.5-Linux/solr/build/solr-core/test/J2/temp/solr.schema.TestManagedSchemaAPI_5F57653C84414398-001/tempDir-001/node2'
   [junit4]   2> 630277 INFO  (jetty-launcher-767-thread-1) [    ] o.a.s.c.SolrResourceLoader new SolrResourceLoader for directory: '/home/jenkins/workspace/Lucene-Solr-5.5-Linux/solr/build/solr-core/test/J2/temp/solr.schema.TestManagedSchemaAPI_5F57653C84414398-001/tempDir-001/node1'
   [junit4]   2> 630277 INFO  (jetty-launcher-767-thread-2) [    ] o.a.s.c.SolrResourceLoader JNDI not configured for solr (NoInitialContextEx)
   [junit4]   2> 630277 INFO  (jetty-launcher-767-thread-1) [    ] o.a.s.c.SolrResourceLoader JNDI not configured for solr (NoInitialContextEx)
   [junit4]   2> 630277 INFO  (jetty-launcher-767-thread-2) [    ] o.a.s.c.SolrResourceLoader solr home defaulted to 'solr/' (could not find system property or JNDI)
   [junit4]   2> 630277 INFO  (jetty-launcher-767-thread-1) [    ] o.a.s.c.SolrResourceLoader solr home defaulted to 'solr/' (could not find system property or JNDI)
   [junit4]   2> 630278 INFO  (jetty-launcher-767-thread-2) [    ] o.a.s.c.c.SolrZkClient Using default ZkCredentialsProvider
   [junit4]   2> 630278 INFO  (jetty-launcher-767-thread-1) [    ] o.a.s.c.c.SolrZkClient Using default ZkCredentialsProvider
   [junit4]   2> 630278 INFO  (jetty-launcher-767-thread-2) [    ] o.a.s.c.c.ConnectionManager Waiting for client to connect to ZooKeeper
   [junit4]   2> 630278 INFO  (jetty-launcher-767-thread-1) [    ] o.a.s.c.c.ConnectionManager Waiting for client to connect to ZooKeeper
   [junit4]   2> 630278 INFO  (zkCallback-769-thread-1) [    ] o.a.s.c.c.ConnectionManager Watcher org.apache.solr.common.cloud.ConnectionManager@3c5abe name:ZooKeeperConnection Watcher:127.0.0.1:33113/solr got event WatchedEvent state:SyncConnected type:None path:null path:null type:None
   [junit4]   2> 630278 INFO  (jetty-launcher-767-thread-2) [    ] o.a.s.c.c.ConnectionManager Client is connected to ZooKeeper
   [junit4]   2> 630278 INFO  (zkCallback-770-thread-1) [    ] o.a.s.c.c.ConnectionManager Watcher org.apache.solr.common.cloud.ConnectionManager@48aefa name:ZooKeeperConnection Watcher:127.0.0.1:33113/solr got event WatchedEvent state:SyncConnected type:None path:null path:null type:None
   [junit4]   2> 630279 INFO  (jetty-launcher-767-thread-1) [    ] o.a.s.c.c.ConnectionManager Client is connected to ZooKeeper
   [junit4]   2> 630279 INFO  (jetty-launcher-767-thread-2) [    ] o.a.s.c.c.SolrZkClient Using default ZkACLProvider
   [junit4]   2> 630279 INFO  (jetty-launcher-767-thread-1) [    ] o.a.s.c.c.SolrZkClient Using default ZkACLProvider
   [junit4]   2> 630279 INFO  (jetty-launcher-767-thread-2) [    ] o.a.s.s.SolrDispatchFilter solr.xml found in ZooKeeper. Loading...
   [junit4]   2> 630279 INFO  (jetty-launcher-767-thread-1) [    ] o.a.s.s.SolrDispatchFilter solr.xml found in ZooKeeper. Loading...
   [junit4]   2> 630292 INFO  (jetty-launcher-767-thread-1) [    ] o.a.s.c.CorePropertiesLocator Config-defined core root directory: /home/jenkins/workspace/Lucene-Solr-5.5-Linux/solr/build/solr-core/test/J2/temp/solr.schema.TestManagedSchemaAPI_5F57653C84414398-001/tempDir-001/node1/.
   [junit4]   2> 630292 INFO  (jetty-launcher-767-thread-2) [    ] o.a.s.c.CorePropertiesLocator Config-defined core root directory: /home/jenkins/workspace/Lucene-Solr-5.5-Linux/solr/build/solr-core/test/J2/temp/solr.schema.TestManagedSchemaAPI_5F57653C84414398-001/tempDir-001/node2/.
   [junit4]   2> 630292 INFO  (jetty-launcher-767-thread-1) [    ] o.a.s.c.CoreContainer New CoreContainer 2647634
   [junit4]   2> 630292 WARN  (NIOServerCxn.Factory:0.0.0.0/0.0.0.0:0) [    ] o.a.z.s.NIOServerCnxn caught end of stream exception
   [junit4]   2> EndOfStreamException: Unable to read additional data from client sessionid 0x15a2f4d4fc40001, likely client has closed socket
   [junit4]   2> 	at org.apache.zookeeper.server.NIOServerCnxn.doIO(NIOServerCnxn.java:228)
   [junit4]   2> 	at org.apache.zookeeper.server.NIOServerCnxnFactory.run(NIOServerCnxnFactory.java:208)
   [junit4]   2> 	at java.lang.Thread.run(Thread.java:745)
   [junit4]   2> 630293 INFO  (jetty-launcher-767-thread-1) [    ] o.a.s.c.CoreContainer Loading cores into CoreContainer [instanceDir=/home/jenkins/workspace/Lucene-Solr-5.5-Linux/solr/build/solr-core/test/J2/temp/solr.schema.TestManagedSchemaAPI_5F57653C84414398-001/tempDir-001/node1]
   [junit4]   2> 630293 INFO  (jetty-launcher-767-thread-2) [    ] o.a.s.c.CoreContainer New CoreContainer 5611765
   [junit4]   2> 630293 INFO  (jetty-launcher-767-thread-2) [    ] o.a.s.c.CoreContainer Loading cores into CoreContainer [instanceDir=/home/jenkins/workspace/Lucene-Solr-5.5-Linux/solr/build/solr-core/test/J2/temp/solr.schema.TestManagedSchemaAPI_5F57653C84414398-001/tempDir-001/node2]
   [junit4]   2> 630293 WARN  (jetty-launcher-767-thread-1) [    ] o.a.s.c.CoreContainer Couldn't add files from /home/jenkins/workspace/Lucene-Solr-5.5-Linux/solr/build/solr-core/test/J2/temp/solr.schema.TestManagedSchemaAPI_5F57653C84414398-001/tempDir-001/node1/lib to classpath: /home/jenkins/workspace/Lucene-Solr-5.5-Linux/solr/build/solr-core/test/J2/temp/solr.schema.TestManagedSchemaAPI_5F57653C84414398-001/tempDir-001/node1/lib
   [junit4]   2> 630293 WARN  (jetty-launcher-767-thread-2) [    ] o.a.s.c.CoreContainer Couldn't add files from /home/jenkins/workspace/Lucene-Solr-5.5-Linux/solr/build/solr-core/test/J2/temp/solr.schema.TestManagedSchemaAPI_5F57653C84414398-001/tempDir-001/node2/lib to classpath: /home/jenkins/workspace/Lucene-Solr-5.5-Linux/solr/build/solr-core/test/J2/temp/solr.schema.TestManagedSchemaAPI_5F57653C84414398-001/tempDir-001/node2/lib
   [junit4]   2> 630293 INFO  (jetty-launcher-767-thread-1) [    ] o.a.s.h.c.HttpShardHandlerFactory created with socketTimeout : 90000,urlScheme : ,connTimeout : 15000,maxConnectionsPerHost : 20,maxConnections : 10000,corePoolSize : 0,maximumPoolSize : 2147483647,maxThreadIdleTime : 5,sizeOfQueue : -1,fairnessPolicy : false,useRetries : false,connectionsEvictorSleepDelay : 5000,maxConnectionIdleTime : 40000,
   [junit4]   2> 630293 INFO  (jetty-launcher-767-thread-2) [    ] o.a.s.h.c.HttpShardHandlerFactory created with socketTimeout : 90000,urlScheme : ,connTimeout : 15000,maxConnectionsPerHost : 20,maxConnections : 10000,corePoolSize : 0,maximumPoolSize : 2147483647,maxThreadIdleTime : 5,sizeOfQueue : -1,fairnessPolicy : false,useRetries : false,connectionsEvictorSleepDelay : 5000,maxConnectionIdleTime : 40000,
   [junit4]   2> 630294 INFO  (jetty-launcher-767-thread-2) [    ] o.a.s.u.UpdateShardHandler Creating UpdateShardHandler HTTP client with params: socketTimeout=340000&connTimeout=45000&retry=true
   [junit4]   2> 630294 INFO  (jetty-launcher-767-thread-1) [    ] o.a.s.u.UpdateShardHandler Creating UpdateShardHandler HTTP client with params: socketTimeout=340000&connTimeout=45000&retry=true
   [junit4]   2> 630295 INFO  (jetty-launcher-767-thread-2) [    ] o.a.s.l.LogWatcher SLF4J impl is org.slf4j.impl.Log4jLoggerFactory
   [junit4]   2> 630295 INFO  (jetty-launcher-767-thread-2) [    ] o.a.s.l.LogWatcher Registering Log Listener [Log4j (org.slf4j.impl.Log4jLoggerFactory)]
   [junit4]   2> 630295 INFO  (jetty-launcher-767-thread-2) [    ] o.a.s.c.ZkContainer Zookeeper client=127.0.0.1:33113/solr
   [junit4]   2> 630295 INFO  (jetty-launcher-767-thread-1) [    ] o.a.s.l.LogWatcher SLF4J impl is org.slf4j.impl.Log4jLoggerFactory
   [junit4]   2> 630295 INFO  (jetty-launcher-767-thread-2) [    ] o.a.s.c.ZkController zkHost includes chroot
   [junit4]   2> 630295 INFO  (jetty-launcher-767-thread-1) [    ] o.a.s.l.LogWatcher Registering Log Listener [Log4j (org.slf4j.impl.Log4jLoggerFactory)]
   [junit4]   2> 630295 INFO  (jetty-launcher-767-thread-2) [    ] o.a.s.c.c.SolrZkClient Using default ZkCredentialsProvider
   [junit4]   2> 630295 INFO  (jetty-launcher-767-thread-1) [    ] o.a.s.c.ZkContainer Zookeeper client=127.0.0.1:33113/solr
   [junit4]   2> 630295 INFO  (jetty-launcher-767-thread-1) [    ] o.a.s.c.ZkController zkHost includes chroot
   [junit4]   2> 630295 INFO  (jetty-launcher-767-thread-1) [    ] o.a.s.c.c.SolrZkClient Using default ZkCredentialsProvider
   [junit4]   2> 630295 INFO  (jetty-launcher-767-thread-2) [    ] o.a.s.c.c.ConnectionManager Waiting for client to connect to ZooKeeper
   [junit4]   2> 630296 INFO  (jetty-launcher-767-thread-1) [    ] o.a.s.c.c.ConnectionManager Waiting for client to connect to ZooKeeper
   [junit4]   2> 630296 INFO  (zkCallback-775-thread-1) [    ] o.a.s.c.c.ConnectionManager Watcher org.apache.solr.common.cloud.ConnectionManager@1fcabb name:ZooKeeperConnection Watcher:127.0.0.1:33113 got event WatchedEvent state:SyncConnected type:None path:null path:null type:None
   [junit4]   2> 630296 INFO  (jetty-launcher-767-thread-2) [    ] o.a.s.c.c.ConnectionManager Client is connected to ZooKeeper
   [junit4]   2> 630296 INFO  (zkCallback-776-thread-1) [    ] o.a.s.c.c.ConnectionManager Watcher org.apache.solr.common.cloud.ConnectionManager@12bd7b1 name:ZooKeeperConnection Watcher:127.0.0.1:33113 got event WatchedEvent state:SyncConnected type:None path:null path:null type:None
   [junit4]   2> 630296 INFO  (jetty-launcher-767-thread-1) [    ] o.a.s.c.c.ConnectionManager Client is connected to ZooKeeper
   [junit4]   2> 630296 INFO  (jetty-launcher-767-thread-2) [    ] o.a.s.c.c.SolrZkClient Using default ZkACLProvider
   [junit4]   2> 630297 INFO  (jetty-launcher-767-thread-1) [    ] o.a.s.c.c.SolrZkClient Using default ZkACLProvider
   [junit4]   2> 630297 INFO  (jetty-launcher-767-thread-2) [n:127.0.0.1:38644_solr    ] o.a.s.c.ZkController Added new OnReconnect listener org.apache.solr.cloud.ZkController$6@e70912
   [junit4]   2> 630297 INFO  (jetty-launcher-767-thread-1) [n:127.0.0.1:43268_solr    ] o.a.s.c.ZkController Added new OnReconnect listener org.apache.solr.cloud.ZkController$6@494cc
   [junit4]   2> 630297 WARN  (NIOServerCxn.Factory:0.0.0.0/0.0.0.0:0) [    ] o.a.z.s.NIOServerCnxn caught end of stream exception
   [junit4]   2> EndOfStreamException: Unable to read additional data from client sessionid 0x15a2f4d4fc40004, likely client has closed socket
   [junit4]   2> 	at org.apache.zookeeper.server.NIOServerCnxn.doIO(NIOServerCnxn.java:228)
   [junit4]   2> 	at org.apache.zookeeper.server.NIOServerCnxnFactory.run(NIOServerCnxnFactory.java:208)
   [junit4]   2> 	at java.lang.Thread.run(Thread.java:745)
   [junit4]   2> 630297 INFO  (jetty-launcher-767-thread-2) [n:127.0.0.1:38644_solr    ] o.a.s.c.c.ConnectionManager Waiting for client to connect to ZooKeeper
   [junit4]   2> 630297 INFO  (jetty-launcher-767-thread-1) [n:127.0.0.1:43268_solr    ] o.a.s.c.c.ConnectionManager Waiting for client to connect to ZooKeeper
   [junit4]   2> 630298 INFO  (zkCallback-777-thread-1-processing-n:127.0.0.1:38644_solr) [n:127.0.0.1:38644_solr    ] o.a.s.c.c.ConnectionManager Watcher org.apache.solr.common.cloud.ConnectionManager@180ab23 name:ZooKeeperConnection Watcher:127.0.0.1:33113/solr got event WatchedEvent state:SyncConnected type:None path:null path:null type:None
   [junit4]   2> 630298 INFO  (jetty-launcher-767-thread-2) [n:127.0.0.1:38644_solr    ] o.a.s.c.c.ConnectionManager Client is connected to ZooKeeper
   [junit4]   2> 630298 INFO  (zkCallback-778-thread-1-processing-n:127.0.0.1:43268_solr) [n:127.0.0.1:43268_solr    ] o.a.s.c.c.ConnectionManager Watcher org.apache.solr.common.cloud.ConnectionManager@16e96e1 name:ZooKeeperConnection Watcher:127.0.0.1:33113/solr got event WatchedEvent state:SyncConnected type:None path:null path:null type:None
   [junit4]   2> 630298 INFO  (jetty-launcher-767-thread-1) [n:127.0.0.1:43268_solr    ] o.a.s.c.c.ConnectionManager Client is connected to ZooKeeper
   [junit4]   2> 630299 INFO  (jetty-launcher-767-thread-2) [n:127.0.0.1:38644_solr    ] o.a.s.c.c.SolrZkClient makePath: /overseer/queue
   [junit4]   2> 630299 INFO  (jetty-launcher-767-thread-1) [n:127.0.0.1:43268_solr    ] o.a.s.c.c.SolrZkClient makePath: /overseer/queue
   [junit4]   2> 630299 INFO  (jetty-launcher-767-thread-2) [n:127.0.0.1:38644_solr    ] o.a.s.c.c.SolrZkClient makePath: /overseer/collection-queue-work
   [junit4]   2> 630299 INFO  (jetty-launcher-767-thread-1) [n:127.0.0.1:43268_solr    ] o.a.s.c.c.SolrZkClient makePath: /overseer/collection-queue-work
   [junit4]   2> 630301 INFO  (jetty-launcher-767-thread-1) [n:127.0.0.1:43268_solr    ] o.a.s.c.c.SolrZkClient makePath: /overseer/collection-map-running
   [junit4]   2> 630301 INFO  (jetty-launcher-767-thread-2) [n:127.0.0.1:38644_solr    ] o.a.s.c.c.SolrZkClient makePath: /overseer/collection-map-running
   [junit4]   2> 630302 INFO  (jetty-launcher-767-thread-2) [n:127.0.0.1:38644_solr    ] o.a.s.c.c.SolrZkClient makePath: /overseer/collection-map-completed
   [junit4]   2> 630302 INFO  (jetty-launcher-767-thread-1) [n:127.0.0.1:43268_solr    ] o.a.s.c.c.SolrZkClient makePath: /overseer/collection-map-completed
   [junit4]   2> 630302 INFO  (jetty-launcher-767-thread-1) [n:127.0.0.1:43268_solr    ] o.a.s.c.c.SolrZkClient makePath: /overseer/collection-map-failure
   [junit4]   2> 630302 INFO  (jetty-launcher-767-thread-2) [n:127.0.0.1:38644_solr    ] o.a.s.c.c.SolrZkClient makePath: /overseer/collection-map-failure
   [junit4]   2> 630304 INFO  (jetty-launcher-767-thread-1) [n:127.0.0.1:43268_solr    ] o.a.s.c.c.SolrZkClient makePath: /live_nodes
   [junit4]   2> 630304 INFO  (jetty-launcher-767-thread-2) [n:127.0.0.1:38644_solr    ] o.a.s.c.c.SolrZkClient makePath: /live_nodes
   [junit4]   2> 630305 INFO  (jetty-launcher-767-thread-1) [n:127.0.0.1:43268_solr    ] o.a.s.c.c.SolrZkClient makePath: /collections
   [junit4]   2> 630305 INFO  (jetty-launcher-767-thread-2) [n:127.0.0.1:38644_solr    ] o.a.s.c.c.SolrZkClient makePath: /collections
   [junit4]   2> 630305 INFO  (jetty-launcher-767-thread-1) [n:127.0.0.1:43268_solr    ] o.a.s.c.c.SolrZkClient makePath: /aliases.json
   [junit4]   2> 630305 INFO  (jetty-launcher-767-thread-2) [n:127.0.0.1:38644_solr    ] o.a.s.c.c.SolrZkClient makePath: /aliases.json
   [junit4]   2> 630306 INFO  (jetty-launcher-767-thread-1) [n:127.0.0.1:43268_solr    ] o.a.s.c.c.SolrZkClient makePath: /clusterstate.json
   [junit4]   2> 630306 INFO  (jetty-launcher-767-thread-2) [n:127.0.0.1:38644_solr    ] o.a.s.c.c.SolrZkClient makePath: /clusterstate.json
   [junit4]   2> 630306 INFO  (jetty-launcher-767-thread-1) [n:127.0.0.1:43268_solr    ] o.a.s.c.c.SolrZkClient makePath: /security.json
   [junit4]   2> 630307 INFO  (jetty-launcher-767-thread-2) [n:127.0.0.1:38644_solr    ] o.a.s.c.c.SolrZkClient makePath: /security.json
   [junit4]   2> 630307 INFO  (jetty-launcher-767-thread-1) [n:127.0.0.1:43268_solr    ] o.a.s.c.ZkController Register node as live in ZooKeeper:/live_nodes/127.0.0.1:43268_solr
   [junit4]   2> 630307 INFO  (jetty-launcher-767-thread-2) [n:127.0.0.1:38644_solr    ] o.a.s.c.ZkController Register node as live in ZooKeeper:/live_nodes/127.0.0.1:38644_solr
   [junit4]   2> 630307 INFO  (jetty-launcher-767-thread-1) [n:127.0.0.1:43268_solr    ] o.a.s.c.c.SolrZkClient makePath: /live_nodes/127.0.0.1:43268_solr
   [junit4]   2> 630307 INFO  (jetty-launcher-767-thread-2) [n:127.0.0.1:38644_solr    ] o.a.s.c.c.SolrZkClient makePath: /live_nodes/127.0.0.1:38644_solr
   [junit4]   2> 630308 INFO  (jetty-launcher-767-thread-1) [n:127.0.0.1:43268_solr    ] o.a.s.c.c.SolrZkClient makePath: /overseer_elect
   [junit4]   2> 630308 INFO  (jetty-launcher-767-thread-2) [n:127.0.0.1:38644_solr    ] o.a.s.c.c.SolrZkClient makePath: /overseer_elect
   [junit4]   2> 630309 INFO  (jetty-launcher-767-thread-1) [n:127.0.0.1:43268_solr    ] o.a.s.c.c.SolrZkClient makePath: /overseer_elect/election
   [junit4]   2> 630309 INFO  (jetty-launcher-767-thread-2) [n:127.0.0.1:38644_solr    ] o.a.s.c.c.SolrZkClient makePath: /overseer_elect/election
   [junit4]   2> 630309 INFO  (jetty-launcher-767-thread-1) [n:127.0.0.1:43268_solr    ] o.a.s.c.Overseer Overseer (id=null) closing
   [junit4]   2> 630309 INFO  (jetty-launcher-767-thread-2) [n:127.0.0.1:38644_solr    ] o.a.s.c.Overseer Overseer (id=null) closing
   [junit4]   2> 630310 INFO  (jetty-launcher-767-thread-1) [n:127.0.0.1:43268_solr    ] o.a.s.c.LeaderElector Joined leadership election with path: /overseer_elect/election/97442351039119366-127.0.0.1:43268_solr-n_0000000000
   [junit4]   2> 630310 INFO  (jetty-launcher-767-thread-2) [n:127.0.0.1:38644_solr    ] o.a.s.c.LeaderElector Joined leadership election with path: /overseer_elect/election/97442351039119365-127.0.0.1:38644_solr-n_0000000001
   [junit4]   2> 630310 INFO  (jetty-launcher-767-thread-1) [n:127.0.0.1:43268_solr    ] o.a.s.c.OverseerElectionContext I am going to be the leader 127.0.0.1:43268_solr
   [junit4]   2> 630310 INFO  (jetty-launcher-767-thread-1) [n:127.0.0.1:43268_solr    ] o.a.s.c.c.SolrZkClient makePath: /overseer_elect/leader
   [junit4]   2> 630310 INFO  (jetty-launcher-767-thread-2) [n:127.0.0.1:38644_solr    ] o.a.s.c.LeaderElector Watching path /overseer_elect/election/97442351039119366-127.0.0.1:43268_solr-n_0000000000 to know if I could be the leader
   [junit4]   2> 630310 INFO  (jetty-launcher-767-thread-2) [n:127.0.0.1:38644_solr    ] o.a.s.c.c.ZkStateReader Updating cluster state from ZooKeeper... 
   [junit4]   2> 630311 INFO  (jetty-launcher-767-thread-1) [n:127.0.0.1:43268_solr    ] o.a.s.c.Overseer Overseer (id=97442351039119366-127.0.0.1:43268_solr-n_0000000000) starting
   [junit4]   2> 630311 INFO  (jetty-launcher-767-thread-1) [n:127.0.0.1:43268_solr    ] o.a.s.c.c.SolrZkClient makePath: /overseer/queue-work
   [junit4]   2> 630313 INFO  (jetty-launcher-767-thread-1) [n:127.0.0.1:43268_solr    ] o.a.s.c.OverseerAutoReplicaFailoverThread Starting OverseerAutoReplicaFailoverThread autoReplicaFailoverWorkLoopDelay=10000 autoReplicaFailoverWaitAfterExpiration=30000 autoReplicaFailoverBadNodeExpiration=60000
   [junit4]   2> 630314 INFO  (jetty-launcher-767-thread-1) [n:127.0.0.1:43268_solr    ] o.a.s.c.c.ZkStateReader Updating cluster state from ZooKeeper... 
   [junit4]   2> 630314 INFO  (OverseerCollectionConfigSetProcessor-97442351039119366-127.0.0.1:43268_solr-n_0000000000) [n:127.0.0.1:43268_solr    ] o.a.s.c.OverseerTaskProcessor Process current queue of overseer operations
   [junit4]   2> 630314 INFO  (OverseerStateUpdate-97442351039119366-127.0.0.1:43268_solr-n_0000000000) [n:127.0.0.1:43268_solr    ] o.a.s.c.Overseer Starting to work on the main queue
   [junit4]   2> 630335 INFO  (jetty-launcher-767-thread-1) [n:127.0.0.1:43268_solr    ] o.a.s.c.CoreContainer Security conf doesn't exist. Skipping setup for authorization module.
   [junit4]   2> 630335 INFO  (jetty-launcher-767-thread-1) [n:127.0.0.1:43268_solr    ] o.a.s.c.CoreContainer No authentication plugin used.
   [junit4]   2> 630336 INFO  (jetty-launcher-767-thread-1) [n:127.0.0.1:43268_solr    ] o.a.s.c.CorePropertiesLocator Looking for core definitions underneath /home/jenkins/workspace/Lucene-Solr-5.5-Linux/solr/build/solr-core/test/J2/temp/solr.schema.TestManagedSchemaAPI_5F57653C84414398-001/tempDir-001/node1/.
   [junit4]   2> 630336 INFO  (jetty-launcher-767-thread-1) [n:127.0.0.1:43268_solr    ] o.a.s.c.CorePropertiesLocator Found 0 core definitions
   [junit4]   2> 630336 INFO  (jetty-launcher-767-thread-1) [n:127.0.0.1:43268_solr    ] o.a.s.s.SolrDispatchFilter user.dir=/home/jenkins/workspace/Lucene-Solr-5.5-Linux/solr/build/solr-core/test/J2
   [junit4]   2> 630336 INFO  (jetty-launcher-767-thread-1) [n:127.0.0.1:43268_solr    ] o.a.s.s.SolrDispatchFilter SolrDispatchFilter.init() done
   [junit4]   2> 630336 INFO  (jetty-launcher-767-thread-2) [n:127.0.0.1:38644_solr    ] o.a.s.c.CoreContainer Security conf doesn't exist. Skipping setup for authorization module.
   [junit4]   2> 630336 INFO  (jetty-launcher-767-thread-2) [n:127.0.0.1:38644_solr    ] o.a.s.c.CoreContainer No authentication plugin used.
   [junit4]   2> 630337 INFO  (jetty-launcher-767-thread-2) [n:127.0.0.1:38644_solr    ] o.a.s.c.CorePropertiesLocator Looking for core definitions underneath /home/jenkins/workspace/Lucene-Solr-5.5-Linux/solr/build/solr-core/test/J2/temp/solr.schema.TestManagedSchemaAPI_5F57653C84414398-001/tempDir-001/node2/.
   [junit4]   2> 630337 INFO  (jetty-launcher-767-thread-2) [n:127.0.0.1:38644_solr    ] o.a.s.c.CorePropertiesLocator Found 0 core definitions
   [junit4]   2> 630337 INFO  (jetty-launcher-767-thread-2) [n:127.0.0.1:38644_solr    ] o.a.s.s.SolrDispatchFilter user.dir=/home/jenkins/workspace/Lucene-Solr-5.5-Linux/solr/build/solr-core/test/J2
   [junit4]   2> 630337 INFO  (jetty-launcher-767-thread-2) [n:127.0.0.1:38644_solr    ] o.a.s.s.SolrDispatchFilter SolrDispatchFilter.init() done
   [junit4]   2> 630337 INFO  (TEST-TestManagedSchemaAPI.test-seed#[5F57653C84414398]) [    ] o.a.s.c.c.SolrZkClient Using default ZkCredentialsProvider
   [junit4]   2> 630338 INFO  (TEST-TestManagedSchemaAPI.test-seed#[5F57653C84414398]) [    ] o.a.s.c.c.ConnectionManager Waiting for client to connect to ZooKeeper
   [junit4]   2> 630346 INFO  (zkCallback-779-thread-1) [    ] o.a.s.c.c.ConnectionManager Watcher org.apache.solr.common.cloud.ConnectionManager@2d48c name:ZooKeeperConnection Watcher:127.0.0.1:33113 got event WatchedEvent state:SyncConnected type:None path:null path:null type:None
   [junit4]   2> 630346 INFO  (TEST-TestManagedSchemaAPI.test-seed#[5F57653C84414398]) [    ] o.a.s.c.c.ConnectionManager Client is connected to ZooKeeper
   [junit4]   2> 630347 INFO  (TEST-TestManagedSchemaAPI.test-seed#[5F57653C84414398]) [    ] o.a.s.c.c.SolrZkClient Using default ZkACLProvider
   [junit4]   2> 630347 INFO  (TEST-TestManagedSchemaAPI.test-seed#[5F57653C84414398]) [    ] o.a.s.c.c.SolrZkClient Using default ZkCredentialsProvider
   [junit4]   2> 630348 INFO  (TEST-TestManagedSchemaAPI.test-seed#[5F57653C84414398]) [    ] o.a.s.c.c.ConnectionManager Waiting for client to connect to ZooKeeper
   [junit4]   2> 630348 INFO  (zkCallback-781-thread-1) [    ] o.a.s.c.c.ConnectionManager Watcher org.apache.solr.common.cloud.ConnectionManager@1abb415 name:ZooKeeperConnection Watcher:127.0.0.1:33113/solr got event WatchedEvent state:SyncConnected type:None path:null path:null type:None
   [junit4]   2> 630348 INFO  (TEST-TestManagedSchemaAPI.test-seed#[5F57653C84414398]) [    ] o.a.s.c.c.ConnectionManager Client is connected to ZooKeeper
   [junit4]   2> 630349 INFO  (TEST-TestManagedSchemaAPI.test-seed#[5F57653C84414398]) [    ] o.a.s.c.c.SolrZkClient Using default ZkACLProvider
   [junit4]   2> 630350 INFO  (TEST-TestManagedSchemaAPI.test-seed#[5F57653C84414398]) [    ] o.a.s.c.c.SolrZkClient makePath: /configs/conf1/solrconfig.xml
   [junit4]   2> 630351 INFO  (TEST-TestManagedSchemaAPI.test-seed#[5F57653C84414398]) [    ] o.a.s.c.c.SolrZkClient makePath: /configs/conf1/managed-schema
   [junit4]   2> 630353 INFO  (TEST-TestManagedSchemaAPI.test-seed#[5F57653C84414398]) [    ] o.a.s.c.c.SolrZkClient Using default ZkCredentialsProvider
   [junit4]   2> 630353 INFO  (TEST-TestManagedSchemaAPI.test-seed#[5F57653C84414398]) [    ] o.a.s.c.c.ConnectionManager Waiting for client to connect to ZooKeeper
   [junit4]   2> 630353 INFO  (zkCallback-782-thread-1) [    ] o.a.s.c.c.ConnectionManager Watcher org.apache.solr.common.cloud.ConnectionManager@e50a33 name:ZooKeeperConnection Watcher:127.0.0.1:33113/solr got event WatchedEvent state:SyncConnected type:None path:null path:null type:None
   [junit4]   2> 630354 INFO  (TEST-TestManagedSchemaAPI.test-seed#[5F57653C84414398]) [    ] o.a.s.c.c.ConnectionManager Client is connected to ZooKeeper
   [junit4]   2> 630354 INFO  (TEST-TestManagedSchemaAPI.test-seed#[5F57653C84414398]) [    ] o.a.s.c.c.SolrZkClient Using default ZkACLProvider
   [junit4]   2> 630354 INFO  (TEST-TestManagedSchemaAPI.test-seed#[5F57653C84414398]) [    ] o.a.s.c.c.ZkStateReader Updating cluster state from ZooKeeper... 
   [junit4]   2> 630357 INFO  (qtp5891478-4782) [n:127.0.0.1:38644_solr    ] o.a.s.h.a.CollectionsHandler Invoked Collection Action :create with params action=CREATE&version=2&collection.configName=conf1&replicationFactor=2&numShards=1&wt=javabin&name=testschemaapi and sendToOCPQueue=true
   [junit4]   2> 630358 INFO  (OverseerCollectionConfigSetProcessor-97442351039119366-127.0.0.1:43268_solr-n_0000000000) [n:127.0.0.1:43268_solr    ] o.a.s.c.OverseerTaskProcessor Overseer Collection Message Handler: Get the message id:/overseer/collection-queue-work/qn-0000000000 message:{
   [junit4]   2>   "name":"testschemaapi",
   [junit4]   2>   "fromApi":"true",
   [junit4]   2>   "replicationFactor":"2",
   [junit4]   2>   "collection.configName":"conf1",
   [junit4]   2>   "numShards":"1",
   [junit4]   2>   "stateFormat":"2",
   [junit4]   2>   "operation":"create"}
   [junit4]   2> 630358 INFO  (OverseerThreadFactory-2376-thread-1-processing-n:127.0.0.1:43268_solr) [n:127.0.0.1:43268_solr    ] o.a.s.c.OverseerCollectionMessageHandler OverseerCollectionMessageHandler.processMessage : create , {
   [junit4]   2>   "name":"testschemaapi",
   [junit4]   2>   "fromApi":"true",
   [junit4]   2>   "replicationFactor":"2",
   [junit4]   2>   "collection.configName":"conf1",
   [junit4]   2>   "numShards":"1",
   [junit4]   2>   "stateFormat":"2",
   [junit4]   2>   "operation":"create"}
   [junit4]   2> 630359 INFO  (OverseerThreadFactory-2376-thread-1-processing-n:127.0.0.1:43268_solr) [n:127.0.0.1:43268_solr    ] o.a.s.c.OverseerCollectionMessageHandler Create collection testschemaapi
   [junit4]   2> 630359 INFO  (OverseerThreadFactory-2376-thread-1-processing-n:127.0.0.1:43268_solr) [n:127.0.0.1:43268_solr    ] o.a.s.c.OverseerCollectionMessageHandler creating collections conf node /collections/testschemaapi 
   [junit4]   2> 630359 INFO  (OverseerThreadFactory-2376-thread-1-processing-n:127.0.0.1:43268_solr) [n:127.0.0.1:43268_solr    ] o.a.s.c.c.SolrZkClient makePath: /collections/testschemaapi
   [junit4]   2> 630360 INFO  (zkCallback-778-thread-1-processing-n:127.0.0.1:43268_solr) [n:127.0.0.1:43268_solr    ] o.a.s.c.c.ZkStateReader A collections change: [WatchedEvent state:SyncConnected type:NodeChildrenChanged path:/collections], has occurred - updating...
   [junit4]   2> 630360 INFO  (zkCallback-782-thread-1) [    ] o.a.s.c.c.ZkStateReader A collections change: [WatchedEvent state:SyncConnected type:NodeChildrenChanged path:/collections], has occurred - updating...
   [junit4]   2> 630360 INFO  (zkCallback-777-thread-1-processing-n:127.0.0.1:38644_solr) [n:127.0.0.1:38644_solr    ] o.a.s.c.c.ZkStateReader A collections change: [WatchedEvent state:SyncConnected type:NodeChildrenChanged path:/collections], has occurred - updating...
   [junit4]   2> 630361 INFO  (OverseerStateUpdate-97442351039119366-127.0.0.1:43268_solr-n_0000000000) [n:127.0.0.1:43268_solr    ] o.a.s.c.Overseer processMessage: queueSize: 1, message = {
   [junit4]   2>   "name":"testschemaapi",
   [junit4]   2>   "fromApi":"true",
   [junit4]   2>   "replicationFactor":"2",
   [junit4]   2>   "collection.configName":"conf1",
   [junit4]   2>   "numShards":"1",
   [junit4]   2>   "stateFormat":"2",
   [junit4]   2>   "operation":"create"} current state version: 0
   [junit4]   2> 630361 INFO  (OverseerStateUpdate-97442351039119366-127.0.0.1:43268_solr-n_0000000000) [n:127.0.0.1:43268_solr    ] o.a.s.c.o.ClusterStateMutator building a new cName: testschemaapi
   [junit4]   2> 630361 INFO  (OverseerStateUpdate-97442351039119366-127.0.0.1:43268_solr-n_0000000000) [n:127.0.0.1:43268_solr    ] o.a.s.c.o.ZkStateWriter going to create_collection /collections/testschemaapi/state.json
   [junit4]   2> 630461 INFO  (OverseerThreadFactory-2376-thread-1-processing-n:127.0.0.1:43268_solr) [n:127.0.0.1:43268_solr    ] o.a.s.c.OverseerCollectionMessageHandler Creating SolrCores for new collection testschemaapi, shardNames [shard1] , replicationFactor : 2
   [junit4]   2> 630461 INFO  (OverseerThreadFactory-2376-thread-1-processing-n:127.0.0.1:43268_solr) [n:127.0.0.1:43268_solr    ] o.a.s.c.OverseerCollectionMessageHandler Creating core testschemaapi_shard1_replica2 as part of shard shard1 of collection testschemaapi on 127.0.0.1:38644_solr
   [junit4]   2> 630461 INFO  (OverseerThreadFactory-2376-thread-1-processing-n:127.0.0.1:43268_solr) [n:127.0.0.1:43268_solr    ] o.a.s.c.OverseerCollectionMessageHandler Creating core testschemaapi_shard1_replica1 as part of shard shard1 of collection testschemaapi on 127.0.0.1:43268_solr
   [junit4]   2> 630463 INFO  (qtp5891478-4784) [n:127.0.0.1:38644_solr    ] o.a.s.h.a.CoreAdminOperation core create command action=CREATE&collection=testschemaapi&collection.configName=conf1&qt=/admin/cores&version=2&numShards=1&wt=javabin&name=testschemaapi_shard1_replica2&shard=shard1
   [junit4]   2> 630463 INFO  (qtp5891478-4784) [n:127.0.0.1:38644_solr    ] o.a.s.c.CoreDescriptor Created CoreDescriptor: {dataDir=data/, configSetProperties=configsetprops.json, schema=schema.xml, name=testschemaapi_shard1_replica2, collection=testschemaapi, loadOnStartup=true, shard=shard1, config=solrconfig.xml, transient=false, numShards=1, collection.configName=conf1}
   [junit4]   2> 630464 INFO  (qtp5891478-4785) [n:127.0.0.1:43268_solr    ] o.a.s.h.a.CoreAdminOperation core create command action=CREATE&collection=testschemaapi&collection.configName=conf1&qt=/admin/cores&version=2&numShards=1&wt=javabin&name=testschemaapi_shard1_replica1&shard=shard1
   [junit4]   2> 630464 INFO  (qtp5891478-4785) [n:127.0.0.1:43268_solr    ] o.a.s.c.CoreDescriptor Created CoreDescriptor: {config=solrconfig.xml, schema=schema.xml, collection.configName=conf1, configSetProperties=configsetprops.json, transient=false, loadOnStartup=true, shard=shard1, name=testschemaapi_shard1_replica1, collection=testschemaapi, numShards=1, dataDir=data/}
   [junit4]   2> 630464 INFO  (qtp5891478-4784) [n:127.0.0.1:38644_solr c:testschemaapi s:shard1  x:testschemaapi_shard1_replica2] o.a.s.c.ZkController publishing state=down
   [junit4]   2> 630464 INFO  (qtp5891478-4785) [n:127.0.0.1:43268_solr c:testschemaapi s:shard1  x:testschemaapi_shard1_replica1] o.a.s.c.ZkController publishing state=down
   [junit4]   2> 630464 INFO  (qtp5891478-4784) [n:127.0.0.1:38644_solr c:testschemaapi s:shard1  x:testschemaapi_shard1_replica2] o.a.s.c.ZkController Registering watch for collection testschemaapi
   [junit4]   2> 630465 INFO  (qtp5891478-4784) [n:127.0.0.1:38644_solr c:testschemaapi s:shard1  x:testschemaapi_shard1_replica2] o.a.s.c.c.ZkStateReader addZkWatch [testschemaapi]
   [junit4]   2> 630465 INFO  (OverseerStateUpdate-97442351039119366-127.0.0.1:43268_solr-n_0000000000) [n:127.0.0.1:43268_solr    ] o.a.s.c.Overseer processMessage: queueSize: 1, message = {
   [junit4]   2>   "base_url":"http://127.0.0.1:38644/solr",
   [junit4]   2>   "state":"down",
   [junit4]   2>   "collection":"testschemaapi",
   [junit4]   2>   "core":"testschemaapi_shard1_replica2",
   [junit4]   2>   "numShards":"1",
   [junit4]   2>   "roles":null,
   [junit4]   2>   "operation":"state",
   [junit4]   2>   "node_name":"127.0.0.1:38644_solr",
   [junit4]   2>   "shard":"shard1"} current state version: 0
   [junit4]   2> 630465 INFO  (qtp5891478-4784) [n:127.0.0.1:38644_solr c:testschemaapi s:shard1  x:testschemaapi_shard1_replica2] o.a.s.c.c.ZkStateReader Add data for [testschemaapi] ver [0]
   [junit4]   2> 630465 INFO  (qtp5891478-4785) [n:127.0.0.1:43268_solr c:testschemaapi s:shard1  x:testschemaapi_shard1_replica1] o.a.s.c.ZkController Registering watch for collection testschemaapi
   [junit4]   2> 630465 INFO  (qtp5891478-4784) [n:127.0.0.1:38644_solr c:testschemaapi s:shard1  x:testschemaapi_shard1_replica2] o.a.s.c.ZkController look for our core node name
   [junit4]   2> 630465 INFO  (qtp5891478-4785) [n:127.0.0.1:43268_solr c:testschemaapi s:shard1  x:testschemaapi_shard1_replica1] o.a.s.c.c.ZkStateReader addZkWatch [testschemaapi]
   [junit4]   2> 630465 INFO  (OverseerStateUpdate-97442351039119366-127.0.0.1:43268_solr-n_0000000000) [n:127.0.0.1:43268_solr    ] o.a.s.c.o.ReplicaMutator Update state numShards=1 message={
   [junit4]   2>   "base_url":"http://127.0.0.1:38644/solr",
   [junit4]   2>   "state":"down",
   [junit4]   2>   "collection":"testschemaapi",
   [junit4]   2>   "core":"testschemaapi_shard1_replica2",
   [junit4]   2>   "numShards":"1",
   [junit4]   2>   "roles":null,
   [junit4]   2>   "operation":"state",
   [junit4]   2>   "node_name":"127.0.0.1:38644_solr",
   [junit4]   2>   "shard":"shard1"}
   [junit4]   2> 630465 INFO  (qtp5891478-4785) [n:127.0.0.1:43268_solr c:testschemaapi s:shard1  x:testschemaapi_shard1_replica1] o.a.s.c.c.ZkStateReader Add data for [testschemaapi] ver [0]
   [junit4]   2> 630465 INFO  (qtp5891478-4785) [n:127.0.0.1:43268_solr c:testschemaapi s:shard1  x:testschemaapi_shard1_replica1] o.a.s.c.ZkController look for our core node name
   [junit4]   2> 630466 INFO  (OverseerStateUpdate-97442351039119366-127.0.0.1:43268_solr-n_0000000000) [n:127.0.0.1:43268_solr    ] o.a.s.c.Overseer processMessage: queueSize: 1, message = {
   [junit4]   2>   "base_url":"http://127.0.0.1:43268/solr",
   [junit4]   2>   "state":"down",
   [junit4]   2>   "collection":"testschemaapi",
   [junit4]   2>   "core":"testschemaapi_shard1_replica1",
   [junit4]   2>   "numShards":"1",
   [junit4]   2>   "roles":null,
   [junit4]   2>   "operation":"state",
   [junit4]   2>   "node_name":"127.0.0.1:43268_solr",
   [junit4]   2>   "shard":"shard1"} current state version: 0
   [junit4]   2> 630466 INFO  (OverseerStateUpdate-97442351039119366-127.0.0.1:43268_solr-n_0000000000) [n:127.0.0.1:43268_solr    ] o.a.s.c.o.ReplicaMutator Update state numShards=1 message={
   [junit4]   2>   "base_url":"http://127.0.0.1:43268/solr",
   [junit4]   2>   "state":"down",
   [junit4]   2>   "collection":"testschemaapi",
   [junit4]   2>   "core":"testschemaapi_shard1_replica1",
   [junit4]   2>   "numShards":"1",
   [junit4]   2>   "roles":null,
   [junit4]   2>   "operation":"state",
   [junit4]   2>   "node_name":"127.0.0.1:43268_solr",
   [junit4]   2>   "shard":"shard1"}
   [junit4]   2> 630567 INFO  (OverseerStateUpdate-97442351039119366-127.0.0.1:43268_solr-n_0000000000) [n:127.0.0.1:43268_solr    ] o.a.s.c.o.ZkStateWriter going to update_collection /collections/testschemaapi/state.json version: 0
   [junit4]   2> 630567 INFO  (zkCallback-778-thread-2-processing-n:127.0.0.1:43268_solr) [n:127.0.0.1:43268_solr    ] o.a.s.c.c.ZkStateReader A cluster state change: [WatchedEvent state:SyncConnected type:NodeDataChanged path:/collections/testschemaapi/state.json] for collection [testschemaapi] has occurred - updating... (live nodes size: [2])
   [junit4]   2> 630567 INFO  (zkCallback-777-thread-1-processing-n:127.0.0.1:38644_solr) [n:127.0.0.1:38644_solr    ] o.a.s.c.c.ZkStateReader A cluster state change: [WatchedEvent state:SyncConnected type:NodeDataChanged path:/collections/testschemaapi/state.json] for collection [testschemaapi] has occurred - updating... (live nodes size: [2])
   [junit4]   2> 630568 INFO  (zkCallback-778-thread-2-processing-n:127.0.0.1:43268_solr) [n:127.0.0.1:43268_solr    ] o.a.s.c.c.ZkStateReader Updating data for [testschemaapi] from [0] to [1]
   [junit4]   2> 630568 INFO  (zkCallback-777-thread-1-processing-n:127.0.0.1:38644_solr) [n:127.0.0.1:38644_solr    ] o.a.s.c.c.ZkStateReader Updating data for [testschemaapi] from [0] to [1]
   [junit4]   2> 631465 INFO  (qtp5891478-4784) [n:127.0.0.1:38644_solr c:testschemaapi s:shard1  x:testschemaapi_shard1_replica2] o.a.s.c.ZkController waiting to find shard id in clusterstate for testschemaapi_shard1_replica2
   [junit4]   2> 631465 INFO  (qtp5891478-4784) [n:127.0.0.1:38644_solr c:testschemaapi s:shard1  x:testschemaapi_shard1_replica2] o.a.s.c.ZkController Check for collection zkNode:testschemaapi
   [junit4]   2> 631465 INFO  (qtp5891478-4785) [n:127.0.0.1:43268_solr c:testschemaapi s:shard1  x:testschemaapi_shard1_replica1] o.a.s.c.ZkController waiting to find shard id in clusterstate for testschemaapi_shard1_replica1
   [junit4]   2> 631465 INFO  (qtp5891478-4785) [n:127.0.0.1:43268_solr c:testschemaapi s:shard1  x:testschemaapi_shard1_replica1] o.a.s.c.ZkController Check for collection zkNode:testschemaapi
   [junit4]   2> 631465 INFO  (qtp5891478-4784) [n:127.0.0.1:38644_solr c:testschemaapi s:shard1  x:testschemaapi_shard1_replica2] o.a.s.c.ZkController Collection zkNode exists
   [junit4]   2> 631465 INFO  (qtp5891478-4785) [n:127.0.0.1:43268_solr c:testschemaapi s:shard1  x:testschemaapi_shard1_replica1] o.a.s.c.ZkController Collection zkNode exists
   [junit4]   2> 631465 INFO  (qtp5891478-4784) [n:127.0.0.1:38644_solr c:testschemaapi s:shard1  x:testschemaapi_shard1_replica2] o.a.s.c.c.ZkStateReader Load collection config from: [/collections/testschemaapi]
   [junit4]   2> 631465 INFO  (qtp5891478-4785) [n:127.0.0.1:43268_solr c:testschemaapi s:shard1  x:testschemaapi_shard1_replica1] o.a.s.c.c.ZkStateReader Load collection config from: [/collections/testschemaapi]
   [junit4]   2> 631466 INFO  (qtp5891478-4784) [n:127.0.0.1:38644_solr c:testschemaapi s:shard1  x:testschemaapi_shard1_replica2] o.a.s.c.c.ZkStateReader path=[/collections/testschemaapi] [configName]=[conf1] specified config exists in ZooKeeper
   [junit4]   2> 631466 INFO  (qtp5891478-4785) [n:127.0.0.1:43268_solr c:testschemaapi s:shard1  x:testschemaapi_shard1_replica1] o.a.s.c.c.ZkStateReader path=[/collections/testschemaapi] [configName]=[conf1] specified config exists in ZooKeeper
   [junit4]   2> 631466 INFO  (qtp5891478-4784) [n:127.0.0.1:38644_solr c:testschemaapi s:shard1  x:testschemaapi_shard1_replica2] o.a.s.c.SolrResourceLoader new SolrResourceLoader for directory: '/home/jenkins/workspace/Lucene-Solr-5.5-Linux/solr/build/solr-core/test/J2/temp/solr.schema.TestManagedSchemaAPI_5F57653C84414398-001/tempDir-001/node2/testschemaapi_shard1_replica2'
   [junit4]   2> 631466 INFO  (qtp5891478-4785) [n:127.0.0.1:43268_solr c:testschemaapi s:shard1  x:testschemaapi_shard1_replica1] o.a.s.c.SolrResourceLoader new SolrResourceLoader for directory: '/home/jenkins/workspace/Lucene-Solr-5.5-Linux/solr/build/solr-core/test/J2/temp/solr.schema.TestManagedSchemaAPI_5F57653C84414398-001/tempDir-001/node1/testschemaapi_shard1_replica1'
   [junit4]   2> 631466 INFO  (qtp5891478-4784) [n:127.0.0.1:38644_solr c:testschemaapi s:shard1  x:testschemaapi_shard1_replica2] o.a.s.c.SolrResourceLoader JNDI not configured for solr (NoInitialContextEx)
   [junit4]   2> 631466 INFO  (qtp5891478-4785) [n:127.0.0.1:43268_solr c:testschemaapi s:shard1  x:testschemaapi_shard1_replica1] o.a.s.c.SolrResourceLoader JNDI not configured for solr (NoInitialContextEx)
   [junit4]   2> 631466 INFO  (qtp5891478-4784) [n:127.0.0.1:38644_solr c:testschemaapi s:shard1  x:testschemaapi_shard1_replica2] o.a.s.c.SolrResourceLoader solr home defaulted to 'solr/' (could not find system property or JNDI)
   [junit4]   2> 631466 INFO  (qtp5891478-4785) [n:127.0.0.1:43268_solr c:testschemaapi s:shard1  x:testschemaapi_shard1_replica1] o.a.s.c.SolrResourceLoader solr home defaulted to 'solr/' (could not find system property or JNDI)
   [junit4]   2> 631468 INFO  (qtp5891478-4785) [n:127.0.0.1:43268_solr c:testschemaapi s:shard1  x:testschemaapi_shard1_replica1] o.a.s.c.Config loaded config solrconfig.xml with version 0 
   [junit4]   2> 631468 INFO  (qtp5891478-4784) [n:127.0.0.1:38644_solr c:testschemaapi s:shard1  x:testschemaapi_shard1_replica2] o.a.s.c.Config loaded config solrconfig.xml with version 0 
   [junit4]   2> 631472 INFO  (qtp5891478-4784) [n:127.0.0.1:38644_solr c:testschemaapi s:shard1  x:testschemaapi_shard1_replica2] o.a.s.c.SolrConfig current version of requestparams : -1
   [junit4]   2> 631472 INFO  (qtp5891478-4785) [n:127.0.0.1:43268_solr c:testschemaapi s:shard1  x:testschemaapi_shard1_replica1] o.a.s.c.SolrConfig current version of requestparams : -1
   [junit4]   2> 631482 INFO  (qtp5891478-4784) [n:127.0.0.1:38644_solr c:testschemaapi s:shard1  x:testschemaapi_shard1_replica2] o.a.s.c.SolrConfig Using Lucene MatchVersion: 5.5.4
   [junit4]   2> 631482 INFO  (qtp5891478-4785) [n:127.0.0.1:43268_solr c:testschemaapi s:shard1  x:testschemaapi_shard1_replica1] o.a.s.c.SolrConfig Using Lucene MatchVersion: 5.5.4
   [junit4]   2> 631503 INFO  (qtp5891478-4784) [n:127.0.0.1:38644_solr c:testschemaapi s:shard1  x:testschemaapi_shard1_replica2] o.a.s.c.SolrConfig Loaded SolrConfig: solrconfig.xml
   [junit4]   2> 631503 INFO  (qtp5891478-4785) [n:127.0.0.1:43268_solr c:testschemaapi s:shard1  x:testschemaapi_shard1_replica1] o.a.s.c.SolrConfig Loaded SolrConfig: solrconfig.xml
   [junit4]   2> 631507 INFO  (qtp5891478-4785) [n:127.0.0.1:43268_solr c:testschemaapi s:shard1  x:testschemaapi_shard1_replica1] o.a.s.s.IndexSchema [testschemaapi_shard1_replica1] Schema name=minimal
   [junit4]   2> 631507 INFO  (qtp5891478-4784) [n:127.0.0.1:38644_solr c:testschemaapi s:shard1  x:testschemaapi_shard1_replica2] o.a.s.s.IndexSchema [testschemaapi_shard1_replica2] Schema name=minimal
   [junit4]   2> 631516 INFO  (qtp5891478-4785) [n:127.0.0.1:43268_solr c:testschemaapi s:shard1  x:testschemaapi_shard1_replica1] o.a.s.s.IndexSchema unique key field: id
   [junit4]   2> 631516 INFO  (qtp5891478-4784) [n:127.0.0.1:38644_solr c:testschemaapi s:shard1  x:testschemaapi_shard1_replica2] o.a.s.s.IndexSchema unique key field: id
   [junit4]   2> 631517 INFO  (qtp5891478-4784) [n:127.0.0.1:38644_solr c:testschemaapi s:shard1  x:testschemaapi_shard1_replica2] o.a.s.c.ConfigSetProperties Did not find ConfigSet properties, assuming default properties: Can't find resource 'configsetprops.json' in classpath or '/configs/conf1', cwd=/home/jenkins/workspace/Lucene-Solr-5.5-Linux/solr/build/solr-core/test/J2
   [junit4]   2> 631517 INFO  (qtp5891478-4784) [n:127.0.0.1:38644_solr c:testschemaapi s:shard1  x:testschemaapi_shard1_replica2] o.a.s.c.CoreContainer Creating SolrCore 'testschemaapi_shard1_replica2' using configuration from collection testschemaapi
   [junit4]   2> 631517 INFO  (qtp5891478-4785) [n:127.0.0.1:43268_solr c:testschemaapi s:shard1  x:testschemaapi_shard1_replica1] o.a.s.c.ConfigSetProperties Did not find ConfigSet properties, assuming default properties: Can't find resource 'configsetprops.json' in classpath or '/configs/conf1', cwd=/home/jenkins/workspace/Lucene-Solr-5.5-Linux/solr/build/solr-core/test/J2
   [junit4]   2> 631518 INFO  (qtp5891478-4785) [n:127.0.0.1:43268_solr c:testschemaapi s:shard1  x:testschemaapi_shard1_replica1] o.a.s.c.CoreContainer Creating SolrCore 'testschemaapi_shard1_replica1' using configuration from collection testschemaapi
   [junit4]   2> 631518 INFO  (qtp5891478-4784) [n:127.0.0.1:38644_solr c:testschemaapi s:shard1 r:core_node1 x:testschemaapi_shard1_replica2] o.a.s.c.SolrCore org.apache.solr.core.MockDirectoryFactory
   [junit4]   2> 631518 INFO  (qtp5891478-4785) [n:127.0.0.1:43268_solr c:testschemaapi s:shard1 r:core_node2 x:testschemaapi_shard1_replica1] o.a.s.c.SolrCore org.apache.solr.core.MockDirectoryFactory
   [junit4]   2> 631518 INFO  (qtp5891478-4784) [n:127.0.0.1:38644_solr c:testschemaapi s:shard1 r:core_node1 x:testschemaapi_shard1_replica2] o.a.s.c.SolrCore [[testschemaapi_shard1_replica2] ] Opening new SolrCore at [/home/jenkins/workspace/Lucene-Solr-5.5-Linux/solr/build/solr-core/test/J2/temp/solr.schema.TestManagedSchemaAPI_5F57653C84414398-001/tempDir-001/node2/testschemaapi_shard1_replica2], dataDir=[/home/jenkins/workspace/Lucene-Solr-5.5-Linux/solr/build/solr-core/test/J2/temp/solr.schema.TestManagedSchemaAPI_5F57653C84414398-001/tempDir-001/node2/./testschemaapi_shard1_replica2/data/]
   [junit4]   2> 631518 INFO  (qtp5891478-4785) [n:127.0.0.1:43268_solr c:testschemaapi s:shard1 r:core_node2 x:testschemaapi_shard1_replica1] o.a.s.c.SolrCore [[testschemaapi_shard1_replica1] ] Opening new SolrCore at [/home/jenkins/workspace/Lucene-Solr-5.5-Linux/solr/build/solr-core/test/J2/temp/solr.schema.TestManagedSchemaAPI_5F57653C84414398-001/tempDir-001/node1/testschemaapi_shard1_replica1], dataDir=[/home/jenkins/workspace/Lucene-Solr-5.5-Linux/solr/build/solr-core/test/J2/temp/solr.schema.TestManagedSchemaAPI_5F57653C84414398-001/tempDir-001/node1/./testschemaapi_shard1_replica1/data/]
   [junit4]   2> 631518 INFO  (qtp5891478-4784) [n:127.0.0.1:38644_solr c:testschemaapi s:shard1 r:core_node1 x:testschemaapi_shard1_replica2] o.a.s.c.SolrCore JMX monitoring not detected for core: testschemaapi_shard1_replica2
   [junit4]   2> 631518 INFO  (qtp5891478-4785) [n:127.0.0.1:43268_solr c:testschemaapi s:shard1 r:core_node2 x:testschemaapi_shard1_replica1] o.a.s.c.SolrCore JMX monitoring not detected for core: testschemaapi_shard1_replica1
   [junit4]   2> 631519 INFO  (qtp5891478-4784) [n:127.0.0.1:38644_solr c:testschemaapi s:shard1 r:core_node1 x:testschemaapi_shard1_replica2] o.a.s.c.CachingDirectoryFactory return new directory for /home/jenkins/workspace/Lucene-Solr-5.5-Linux/solr/build/solr-core/test/J2/temp/solr.schema.TestManagedSchemaAPI_5F57653C84414398-001/tempDir-001/node2/./testschemaapi_shard1_replica2/data
   [junit4]   2> 631519 INFO  (qtp5891478-4784) [n:127.0.0.1:38644_solr c:testschemaapi s:shard1 r:core_node1 x:testschemaapi_shard1_replica2] o.a.s.c.SolrCore New index directory detected: old=null new=/home/jenkins/workspace/Lucene-Solr-5.5-Linux/solr/build/solr-core/test/J2/temp/solr.schema.TestManagedSchemaAPI_5F57653C84414398-001/tempDir-001/node2/./testschemaapi_shard1_replica2/data/index/
   [junit4]   2> 631519 WARN  (qtp5891478-4784) [n:127.0.0.1:38644_solr c:testschemaapi s:shard1 r:core_node1 x:testschemaapi_shard1_replica2] o.a.s.c.SolrCore [testschemaapi_shard1_replica2] Solr index directory '/home/jenkins/workspace/Lucene-Solr-5.5-Linux/solr/build/solr-core/test/J2/temp/solr.schema.TestManagedSchemaAPI_5F57653C84414398-001/tempDir-001/node2/./testschemaapi_shard1_replica2/data/index' doesn't exist. Creating new index...
   [junit4]   2> 631519 INFO  (qtp5891478-4785) [n:127.0.0.1:43268_solr c:testschemaapi s:shard1 r:core_node2 x:testschemaapi_shard1_replica1] o.a.s.c.CachingDirectoryFactory return new directory for /home/jenkins/workspace/Lucene-Solr-5.5-Linux/solr/build/solr-core/test/J2/temp/solr.schema.TestManagedSchemaAPI_5F57653C84414398-001/tempDir-001/node1/./testschemaapi_shard1_replica1/data
   [junit4]   2> 631520 INFO  (qtp5891478-4785) [n:127.0.0.1:43268_solr c:testschemaapi s:shard1 r:core_node2 x:testschemaapi_shard1_replica1] o.a.s.c.SolrCore New index directory detected: old=null new=/home/jenkins/workspace/Lucene-Solr-5.5-Linux/solr/build/solr-core/test/J2/temp/solr.schema.TestManagedSchemaAPI_5F57653C84414398-001/tempDir-001/node1/./testschemaapi_shard1_replica1/data/index/
   [junit4]   2> 631520 WARN  (qtp5891478-4785) [n:127.0.0.1:43268_solr c:testschemaapi s:shard1 r:core_node2 x:testschemaapi_shard1_replica1] o.a.s.c.SolrCore [testschemaapi_shard1_replica1] Solr index directory '/home/jenkins/workspace/Lucene-Solr-5.5-Linux/solr/build/solr-core/test/J2/temp/solr.schema.TestManagedSchemaAPI_5F57653C84414398-001/tempDir-001/node1/./testschemaapi_shard1_replica1/data/index' doesn't exist. Creating new index...
   [junit4]   2> 631520 INFO  (qtp5891478-4784) [n:127.0.0.1:38644_solr c:testschemaapi s:shard1 r:core_node1 x:testschemaapi_shard1_replica2] o.a.s.c.CachingDirectoryFactory return new directory for /home/jenkins/workspace/Lucene-Solr-5.5-Linux/solr/build/solr-core/test/J2/temp/solr.schema.TestManagedSchemaAPI_5F57653C84414398-001/tempDir-001/node2/./testschemaapi_shard1_replica2/data/index
   [junit4]   2> 631520 INFO  (qtp5891478-4785) [n:127.0.0.1:43268_solr c:testschemaapi s:shard1 r:core_node2 x:testschemaapi_shard1_replica1] o.a.s.c.CachingDirectoryFactory return new directory for /home/jenkins/workspace/Lucene-Solr-5.5-Linux/solr/build/solr-core/test/J2/temp/solr.schema.TestManagedSchemaAPI_5F57653C84414398-001/tempDir-001/node1/./testschemaapi_shard1_replica1/data/index
   [junit4]   2> 631520 INFO  (qtp5891478-4784) [n:127.0.0.1:38644_solr c:testschemaapi s:shard1 r:core_node1 x:testschemaapi_shard1_replica2] o.a.s.c.SolrDeletionPolicy SolrDeletionPolicy.onCommit: commits: num=1
   [junit4]   2> 	commit{dir=MockDirectoryWrapper(RAMDirectory@abdd8 lockFactory=org.apache.lucene.store.SingleInstanceLockFactory@135df1d),segFN=segments_1,generation=1}
   [junit4]   2> 631520 INFO  (qtp5891478-4784) [n:127.0.0.1:38644_solr c:testschemaapi s:shard1 r:core_node1 x:testschemaapi_shard1_replica2] o.a.s.c.SolrDeletionPolicy newest commit generation = 1
   [junit4]   2> 631520 INFO  (OldIndexDirectoryCleanupThreadForCore-testschemaapi_shard1_replica2) [n:127.0.0.1:38644_solr c:testschemaapi s:shard1 r:core_node1 x:testschemaapi_shard1_replica2] o.a.s.c.SolrCore Looking for old index directories to cleanup for core testschemaapi_shard1_replica2 in /home/jenkins/workspace/Lucene-Solr-5.5-Linux/solr/build/solr-core/test/J2/temp/solr.schema.TestManagedSchemaAPI_5F57653C84414398-001/tempDir-001/node2/./testschemaapi_shard1_replica2/data/
   [junit4]   2> 631520 INFO  (qtp5891478-4785) [n:127.0.0.1:43268_solr c:testschemaapi s:shard1 r:core_node2 x:testschemaapi_shard1_replica1] o.a.s.c.SolrDeletionPolicy SolrDeletionPolicy.onCommit: commits: num=1
   [junit4]   2> 	commit{dir=MockDirectoryWrapper(RAMDirectory@8b449c lockFactory=org.apache.lucene.store.SingleInstanceLockFactory@145881a),segFN=segments_1,generation=1}
   [junit4]   2> 631520 INFO  (qtp5891478-4785) [n:127.0.0.1:43268_solr c:testschemaapi s:shard1 r:core_node2 x:testschemaapi_shard1_replica1] o.a.s.c.SolrDeletionPolicy newest commit generation = 1
   [junit4]   2> 631520 WARN  (OldIndexDirectoryCleanupThreadForCore-testschemaapi_shard1_replica2) [n:127.0.0.1:38644_solr c:testschemaapi s:shard1 r:core_node1 x:testschemaapi_shard1_replica2] o.a.s.c.DirectoryFactory /home/jenkins/workspace/Lucene-Solr-5.5-Linux/solr/build/solr-core/test/J2/temp/solr.schema.TestManagedSchemaAPI_5F57653C84414398-001/tempDir-001/node2/./testschemaapi_shard1_replica2/data/ does not point to a valid data directory; skipping clean-up of old index directories.
   [junit4]   2> 631521 INFO  (OldIndexDirectoryCleanupThreadForCore-testschemaapi_shard1_replica1) [n:127.0.0.1:43268_solr c:testschemaapi s:shard1 r:core_node2 x:testschemaapi_shard1_replica1] o.a.s.c.SolrCore Looking for old index directories to cleanup for core testschemaapi_shard1_replica1 in /home/jenkins/workspace/Lucene-Solr-5.5-Linux/solr/build/solr-core/test/J2/temp/solr.schema.TestManagedSchemaAPI_5F57653C84414398-001/tempDir-001/node1/./testschemaapi_shard1_replica1/data/
   [junit4]   2> 631521 WARN  (OldIndexDirectoryCleanupThreadForCore-testschemaapi_shard1_replica1) [n:127.0.0.1:43268_solr c:testschemaapi s:shard1 r:core_node2 x:testschemaapi_shard1_replica1] o.a.s.c.DirectoryFactory /home/jenkins/workspace/Lucene-Solr-5.5-Linux/solr/build/solr-core/test/J2/temp/solr.schema.TestManagedSchemaAPI_5F57653C84414398-001/tempDir-001/node1/./testschemaapi_shard1_replica1/data/ does not point to a valid data directory; skipping clean-up of old index directories.
   [junit4]   2> 631521 INFO  (qtp5891478-4784) [n:127.0.0.1:38644_solr c:testschemaapi s:shard1 r:core_node1 x:testschemaapi_shard1_replica2] o.a.s.c.SolrCore no updateRequestProcessorChain defined as default, creating implicit default
   [junit4]   2> 631522 INFO  (qtp5891478-4785) [n:127.0.0.1:43268_solr c:testschemaapi s:shard1 r:core_node2 x:testschemaapi_shard1_replica1] o.a.s.c.SolrCore no updateRequestProcessorChain defined as default, creating implicit default
   [junit4]   2> 631523 INFO  (qtp5891478-4784) [n:127.0.0.1:38644_solr c:testschemaapi s:shard1 r:core_node1 x:testschemaapi_shard1_replica2] o.a.s.h.l.XMLLoader xsltCacheLifetimeSeconds=60
   [junit4]   2> 631523 INFO  (qtp5891478-4785) [n:127.0.0.1:43268_solr c:testschemaapi s:shard1 r:core_node2 x:testschemaapi_shard1_replica1] o.a.s.h.l.XMLLoader xsltCacheLifetimeSeconds=60
   [junit4]   2> 631524 INFO  (qtp5891478-4784) [n:127.0.0.1:38644_solr c:testschemaapi s:shard1 r:core_node1 x:testschemaapi_shard1_replica2] o.a.s.h.l.XMLLoader xsltCacheLifetimeSeconds=60
   [junit4]   2> 631525 INFO  (qtp5891478-4785) [n:127.0.0.1:43268_solr c:testschemaapi s:shard1 r:core_node2 x:testschemaapi_shard1_replica1] o.a.s.h.l.XMLLoader xsltCacheLifetimeSeconds=60
   [junit4]   2> 631525 INFO  (qtp5891478-4784) [n:127.0.0.1:38644_solr c:testschemaapi s:shard1 r:core_node1 x:testschemaapi_shard1_replica2] o.a.s.h.l.XMLLoader xsltCacheLifetimeSeconds=60
   [junit4]   2> 631526 INFO  (qtp5891478-4784) [n:127.0.0.1:38644_solr c:testschemaapi s:shard1 r:core_node1 x:testschemaapi_shard1_replica2] o.a.s.h.l.XMLLoader xsltCacheLifetimeSeconds=60
   [junit4]   2> 631526 INFO  (qtp5891478-4785) [n:127.0.0.1:43268_solr c:testschemaapi s:shard1 r:core_node2 x:testschemaapi_shard1_replica1] o.a.s.h.l.XMLLoader xsltCacheLifetimeSeconds=60
   [junit4]   2> 631526 INFO  (qtp5891478-4784) [n:127.0.0.1:38644_solr c:testschemaapi s:shard1 r:core_node1 x:testschemaapi_shard1_replica2] o.a.s.c.RequestHandlers Registered paths: /config,/admin/system,/admin/plugins,/admin/mbeans,/admin/file,/admin/luke,/admin/threads,/select,/admin/segments,/update/csv,/update/json/docs,/update/json,/replication,/schema,/admin/properties,/get,/admin/logging,/update,/admin/ping
   [junit4]   2> 631528 INFO  (qtp5891478-4785) [n:127.0.0.1:43268_solr c:testschemaapi s:shard1 r:core_node2 x:testschemaapi_shard1_replica1] o.a.s.h.l.XMLLoader xsltCacheLifetimeSeconds=60
   [junit4]   2> 631528 INFO  (qtp5891478-4784) [n:127.0.0.1:38644_solr c:testschemaapi s:shard1 r:core_node1 x:testschemaapi_shard1_replica2] o.a.s.c.SolrCore Using default statsCache cache: org.apache.solr.search.stats.LocalStatsCache
   [junit4]   2> 631529 INFO  (qtp5891478-4784) [n:127.0.0.1:38644_solr c:testschemaapi s:shard1 r:core_node1 x:testschemaapi_shard1_replica2] o.a.s.u.UpdateHandler Using UpdateLog implementation: org.apache.solr.update.UpdateLog
   [junit4]   2> 631529 INFO  (qtp5891478-4784) [n:127.0.0.1:38644_solr c:testschemaapi s:shard1 r:core_node1 x:testschemaapi_shard1_replica2] o.a.s.u.UpdateLog Initializing UpdateLog: dataDir=null defaultSyncLevel=FLUSH numRecordsToKeep=100 maxNumLogsToKeep=10 numVersionBuckets=65536
   [junit4]   2> 631529 INFO  (qtp5891478-4785) [n:127.0.0.1:43268_solr c:testschemaapi s:shard1 r:core_node2 x:testschemaapi_shard1_replica1] o.a.s.c.RequestHandlers Registered paths: /config,/admin/system,/admin/plugins,/admin/mbeans,/admin/file,/admin/luke,/admin/threads,/select,/admin/segments,/update/csv,/update/json/docs,/update/json,/replication,/schema,/admin/properties,/get,/admin/logging,/update,/admin/ping
   [junit4]   2> 631530 INFO  (qtp5891478-4784) [n:127.0.0.1:38644_solr c:testschemaapi s:shard1 r:core_node1 x:testschemaapi_shard1_replica2] o.a.s.u.CommitTracker Hard AutoCommit: disabled
   [junit4]   2> 631530 INFO  (qtp5891478-4784) [n:127.0.0.1:38644_solr c:testschemaapi s:shard1 r:core_node1 x:testschemaapi_shard1_replica2] o.a.s.u.CommitTracker Soft AutoCommit: disabled
   [junit4]   2> 631530 INFO  (qtp5891478-4784) [n:127.0.0.1:38644_solr c:testschemaapi s:shard1 r:core_node1 x:testschemaapi_shard1_replica2] o.a.s.c.SolrDeletionPolicy SolrDeletionPolicy.onInit: commits: num=1
   [junit4]   2> 	commit{dir=MockDirectoryWrapper(RAMDirectory@abdd8 lockFactory=org.apache.lucene.store.SingleInstanceLockFactory@135df1d),segFN=segments_1,generation=1}
   [junit4]   2> 631530 INFO  (qtp5891478-4784) [n:127.0.0.1:38644_solr c:testschemaapi s:shard1 r:core_node1 x:testschemaapi_shard1_replica2] o.a.s.c.SolrDeletionPolicy newest commit generation = 1
   [junit4]   2> 631530 INFO  (qtp5891478-4784) [n:127.0.0.1:38644_solr c:testschemaapi s:shard1 r:core_node1 x:testschemaapi_shard1_replica2] o.a.s.s.SolrIndexSearcher Opening Searcher@15fa3ac[testschemaapi_shard1_replica2] main
   [junit4]   2> 631530 INFO  (qtp5891478-4784) [n:127.0.0.1:38644_solr c:testschemaapi s:shard1 r:core_node1 x:testschemaapi_shard1_replica2] o.a.s.c.c.ZkStateReader Load collection config from: [/collections/testschemaapi]
   [junit4]   2> 631531 INFO  (qtp5891478-4784) [n:127.0.0.1:38644_solr c:testschemaapi s:shard1 r:core_node1 x:testschemaapi_shard1_replica2] o.a.s.c.c.ZkStateReader path=[/collections/testschemaapi] [configName]=[conf1] specified config exists in ZooKeeper
   [junit4]   2> 631531 INFO  (qtp5891478-4784) [n:127.0.0.1:38644_solr c:testschemaapi s:shard1 r:core_node1 x:testschemaapi_shard1_replica2] o.a.s.r.ManagedResourceStorage Setting up ZooKeeper-based storage for the RestManager with znodeBase: /configs/conf1
   [junit4]   2> 631531 INFO  (qtp5891478-4784) [n:127.0.0.1:38644_solr c:testschemaapi s:shard1 r:core_node1 x:testschemaapi_shard1_replica2] o.a.s.r.ManagedResourceStorage Configured ZooKeeperStorageIO with znodeBase: /configs/conf1
   [junit4]   2> 631531 INFO  (qtp5891478-4785) [n:127.0.0.1:43268_solr c:testschemaapi s:shard1 r:core_node2 x:testschemaapi_shard1_replica1] o.a.s.c.SolrCore Using default statsCache cache: org.apache.solr.search.stats.LocalStatsCache
   [junit4]   2> 631531 INFO  (qtp5891478-4784) [n:127.0.0.1:38644_solr c:testschemaapi s:shard1 r:core_node1 x:testschemaapi_shard1_replica2] o.a.s.r.RestManager Initializing RestManager with initArgs: {}
   [junit4]   2> 631531 INFO  (qtp5891478-4784) [n:127.0.0.1:38644_solr c:testschemaapi s:shard1 r:core_node1 x:testschemaapi_shard1_replica2] o.a.s.r.ManagedResourceStorage Reading _rest_managed.json using ZooKeeperStorageIO:path=/configs/conf1
   [junit4]   2> 631531 INFO  (qtp5891478-4784) [n:127.0.0.1:38644_solr c:testschemaapi s:shard1 r:core_node1 x:testschemaapi_shard1_replica2] o.a.s.r.ManagedResourceStorage No data found for znode /configs/conf1/_rest_managed.json
   [junit4]   2> 631531 INFO  (qtp5891478-4784) [n:127.0.0.1:38644_solr c:testschemaapi s:shard1 r:core_node1 x:testschemaapi_shard1_replica2] o.a.s.r.ManagedResourceStorage Loaded null at path _rest_managed.json using ZooKeeperStorageIO:path=/configs/conf1
   [junit4]   2> 631531 INFO  (qtp5891478-4785) [n:127.0.0.1:43268_solr c:testschemaapi s:shard1 r:core_node2 x:testschemaapi_shard1_replica1] o.a.s.u.UpdateHandler Using UpdateLog implementation: org.apache.solr.update.UpdateLog
   [junit4]   2> 631531 INFO  (qtp5891478-4784) [n:127.0.0.1:38644_solr c:testschemaapi s:shard1 r:core_node1 x:testschemaapi_shard1_replica2] o.a.s.r.RestManager Initializing 0 registered ManagedResources
   [junit4]   2> 631532 INFO  (qtp5891478-4785) [n:127.0.0.1:43268_solr c:testschemaapi s:shard1 r:core_node2 x:testschemaapi_shard1_replica1] o.a.s.u.UpdateLog Initializing UpdateLog: dataDir=null defaultSyncLevel=FLUSH numRecordsToKeep=100 maxNumLogsToKeep=10 numVersionBuckets=65536
   [junit4]   2> 631532 INFO  (qtp5891478-4784) [n:127.0.0.1:38644_solr c:testschemaapi s:shard1 r:core_node1 x:testschemaapi_shard1_replica2] o.a.s.s.ZkIndexSchemaReader Creating ZooKeeper watch for the managed schema at /configs/conf1/managed-schema
   [junit4]   2> 631532 INFO  (qtp5891478-4784) [n:127.0.0.1:38644_solr c:testschemaapi s:shard1 r:core_node1 x:testschemaapi_shard1_replica2] o.a.s.c.ZkController Added new OnReconnect listener ZkIndexSchemaReader: /configs/conf1/managed-schema, uniqueCoreId: testschemaapi_shard1_replica2:5558766862276788
   [junit4]   2> 631532 INFO  (qtp5891478-4784) [n:127.0.0.1:38644_solr c:testschemaapi s:shard1 r:core_node1 x:testschemaapi_shard1_replica2] o.a.s.h.ReplicationHandler Commits will be reserved for  10000
   [junit4]   2> 631532 INFO  (searcherExecutor-2381-thread-1-processing-c:testschemaapi x:testschemaapi_shard1_replica2 n:127.0.0.1:38644_solr r:core_node1 s:shard1) [n:127.0.0.1:38644_solr c:testschemaapi s:shard1 r:core_node1 x:testschemaapi_shard1_replica2] o.a.s.c.SolrCore [testschemaapi_shard1_replica2] Registered new searcher Searcher@15fa3ac[testschemaapi_shard1_replica2] main{ExitableDirectoryReader(UninvertingDirectoryReader())}
   [junit4]   2> 631532 INFO  (qtp5891478-4784) [n:127.0.0.1:38644_solr c:testschemaapi s:shard1 r:core_node1 x:testschemaapi_shard1_replica2] o.a.s.u.UpdateLog Looking up max value of version field to seed version buckets
   [junit4]   2> 631532 INFO  (qtp5891478-4784) [n:127.0.0.1:38644_solr c:testschemaapi s:shard1 r:core_node1 x:testschemaapi_shard1_replica2] o.a.s.u.VersionInfo Refreshing highest value of _version_ for 65536 version buckets from index
   [junit4]   2> 631532 INFO  (qtp5891478-4784) [n:127.0.0.1:38644_solr c:testschemaapi s:shard1 r:core_node1 x:testschemaapi_shard1_replica2] o.a.s.u.VersionInfo No terms found for _version_, cannot seed version bucket highest value from index
   [junit4]   2> 631532 INFO  (qtp5891478-4784) [n:127.0.0.1:38644_solr c:testschemaapi s:shard1 r:core_node1 x:testschemaapi_shard1_replica2] o.a.s.u.UpdateLog Could not find max version in index or recent updates, using new clock 1559077618051973120
   [junit4]   2> 631533 INFO  (qtp5891478-4785) [n:127.0.0.1:43268_solr c:testschemaapi s:shard1 r:core_node2 x:testschemaapi_shard1_replica1] o.a.s.u.CommitTracker Hard AutoCommit: disabled
   [junit4]   2> 631533 INFO  (qtp5891478-4785) [n:127.0.0.1:43268_solr c:testschemaapi s:shard1 r:core_node2 x:testschemaapi_shard1_replica1] o.a.s.u.CommitTracker Soft AutoCommit: disabled
   [junit4]   2> 631534 INFO  (qtp5891478-4785) [n:127.0.0.1:43268_solr c:testschemaapi s:shard1 r:core_node2 x:testschemaapi_shard1_replica1] o.a.s.c.SolrDeletionPolicy SolrDeletionPolicy.onInit: commits: num=1
   [junit4]   2> 	commit{dir=MockDirectoryWrapper(RAMDirectory@8b449c lockFactory=org.apache.lucene.store.SingleInstanceLockFactory@145881a),segFN=segments_1,generation=1}
   [junit4]   2> 631534 INFO  (qtp5891478-4785) [n:127.0.0.1:43268_solr c:testschemaapi s:shard1 r:core_node2 x:testschemaapi_shard1_replica1] o.a.s.c.SolrDeletionPolicy newest commit generation = 1
   [junit4]   2> 631534 INFO  (qtp5891478-4785) [n:127.0.0.1:43268_solr c:testschemaapi s:shard1 r:core_node2 x:testschemaapi_shard1_replica1] o.a.s.s.SolrIndexSearcher Opening Searcher@156df12[testschemaapi_shard1_replica1] main
   [junit4]   2> 631534 INFO  (qtp5891478-4784) [n:127.0.0.1:38644_solr c:testschemaapi s:shard1 r:core_node1 x:testschemaapi_shard1_replica2] o.a.s.u.UpdateLog Took 1.0ms to seed version buckets with highest version 1559077618051973120
   [junit4]   2> 631534 INFO  (qtp5891478-4784) [n:127.0.0.1:38644_solr c:testschemaapi s:shard1 r:core_node1 x:testschemaapi_shard1_replica2] o.a.s.c.ZkController watch zkdir /configs/conf1
   [junit4]   2> 631534 INFO  (qtp5891478-4785) [n:127.0.0.1:43268_solr c:testschemaapi s:shard1 r:core_node2 x:testschemaapi_shard1_replica1] o.a.s.c.c.ZkStateReader Load collection config from: [/collections/testschemaapi]
   [junit4]   2> 631534 INFO  (qtp5891478-4784) [n:127.0.0.1:38644_solr c:testschemaapi s:shard1 r:core_node1 x:testschemaapi_shard1_replica2] o.a.s.c.CoreContainer registering core: testschemaapi_shard1_replica2
   [junit4]   2> 631534 INFO  (qtp5891478-4785) [n:127.0.0.1:43268_solr c:testschemaapi s:shard1 r:core_node2 x:testschemaapi_shard1_replica1] o.a.s.c.c.ZkStateReader path=[/collections/testschemaapi] [configName]=[conf1] specified config exists in ZooKeeper
   [junit4]   2> 631534 INFO  (qtp5891478-4784) [n:127.0.0.1:38644_solr c:testschemaapi s:shard1 r:core_node1 x:testschemaapi_shard1_replica2] o.a.s.c.ZkController Register replica - core:testschemaapi_shard1_replica2 address:http://127.0.0.1:38644/solr collection:testschemaapi shard:shard1
   [junit4]   2> 631534 INFO  (qtp5891478-4785) [n:127.0.0.1:43268_solr c:testschemaapi s:shard1 r:core_node2 x:testschemaapi_shard1_replica1] o.a.s.r.ManagedResourceStorage Setting up ZooKeeper-based storage for the RestManager with znodeBase: /configs/conf1
   [junit4]   2> 631535 INFO  (qtp5891478-4785) [n:127.0.0.1:43268_solr c:testschemaapi s:shard1 r:core_node2 x:testschemaapi_shard1_replica1] o.a.s.r.ManagedResourceStorage Configured ZooKeeperStorageIO with znodeBase: /configs/conf1
   [junit4]   2> 631535 INFO  (qtp5891478-4785) [n:127.0.0.1:43268_solr c:testschemaapi s:shard1 r:core_node2 x:testschemaapi_shard1_replica1] o.a.s.r.RestManager Initializing RestManager with initArgs: {}
   [junit4]   2> 631535 INFO  (qtp5891478-4784) [n:127.0.0.1:38644_solr c:testschemaapi s:shard1 r:core_node1 x:testschemaapi_shard1_replica2] o.a.s.c.c.SolrZkClient makePath: /collections/testschemaapi/leader_elect/shard1/election
   [junit4]   2> 631535 INFO  (qtp5891478-4785) [n:127.0.0.1:43268_solr c:testschemaapi s:shard1 r:core_node2 x:testschemaapi_shard1_replica1] o.a.s.r.ManagedResourceStorage Reading _rest_managed.json using ZooKeeperStorageIO:path=/configs/conf1
   [junit4]   2> 631535 INFO  (qtp5891478-4785) [n:127.0.0.1:43268_solr c:testschemaapi s:shard1 r:core_node2 x:testschemaapi_shard1_replica1] o.a.s.r.ManagedResourceStorage No data found for znode /configs/conf1/_rest_managed.json
   [junit4]   2> 631535 INFO  (qtp5891478-4785) [n:127.0.0.1:43268_solr c:testschemaapi s:shard1 r:core_node2 x:testschemaapi_shard1_replica1] o.a.s.r.ManagedResourceStorage Loaded null at path _rest_managed.json using ZooKeeperStorageIO:path=/configs/conf1
   [junit4]   2> 631535 INFO  (qtp5891478-4785) [n:127.0.0.1:43268_solr c:testschemaapi s:shard1 r:core_node2 x:testschemaapi_shard1_replica1] o.a.s.r.RestManager Initializing 0 registered ManagedResources
   [junit4]   2> 631535 INFO  (qtp5891478-4785) [n:127.0.0.1:43268_solr c:testschemaapi s:shard1 r:core_node2 x:testschemaapi_shard1_replica1] o.a.s.s.ZkIndexSchemaReader Creating ZooKeeper watch for the managed schema at /configs/conf1/managed-schema
   [junit4]   2> 631535 INFO  (qtp5891478-4785) [n:127.0.0.1:43268_solr c:testschemaapi s:shard1 r:core_node2 x:testschemaapi_shard1_replica1] o.a.s.c.ZkController Added new OnReconnect listener ZkIndexSchemaReader: /configs/conf1/managed-schema, uniqueCoreId: testschemaapi_shard1_replica1:5558766862387721
   [junit4]   2> 631535 INFO  (qtp5891478-4785) [n:127.0.0.1:43268_solr c:testschemaapi s:shard1 r:core_node2 x:testschemaapi_shard1_replica1] o.a.s.h.ReplicationHandler Commits will be reserved for  10000
   [junit4]   2> 631536 INFO  (searcherExecutor-2382-thread-1-processing-x:testschemaapi_shard1_replica1 c:testschemaapi n:127.0.0.1:43268_solr r:core_node2 s:shard1) [n:127.0.0.1:43268_solr c:testschemaapi s:shard1 r:core_node2 x:testschemaapi_shard1_replica1] o.a.s.c.SolrCore [testschemaapi_shard1_replica1] Registered new searcher Searcher@156df12[testschemaapi_shard1_replica1] main{ExitableDirectoryReader(UninvertingDirectoryReader())}
   [junit4]   2> 631536 INFO  (qtp5891478-4785) [n:127.0.0.1:43268_solr c:testschemaapi s:shard1 r:core_node2 x:testschemaapi_shard1_replica1] o.a.s.u.UpdateLog Looking up max value of version field to seed version buckets
   [junit4]   2> 631536 INFO  (qtp5891478-4785) [n:127.0.0.1:43268_solr c:testschemaapi s:shard1 r:core_node2 x:testschemaapi_shard1_replica1] o.a.s.u.VersionInfo Refreshing highest value of _version_ for 65536 version buckets from index
   [junit4]   2> 631536 INFO  (qtp5891478-4785) [n:127.0.0.1:43268_solr c:testschemaapi s:shard1 r:core_node2 x:testschemaapi_shard1_replica1] o.a.s.u.VersionInfo No terms found for _version_, cannot seed version bucket highest value from index
   [junit4]   2> 631536 INFO  (qtp5891478-4785) [n:127.0.0.1:43268_solr c:testschemaapi s:shard1 r:core_node2 x:testschemaapi_shard1_replica1] o.a.s.u.UpdateLog Could not find max version in index or recent updates, using new clock 1559077618056167424
   [junit4]   2> 631537 INFO  (qtp5891478-4784) [n:127.0.0.1:38644_solr c:testschemaapi s:shard1 r:core_node1 x:testschemaapi_shard1_replica2] o.a.s.c.LeaderElector Joined leadership election with path: /collections/testschemaapi/leader_elect/shard1/election/97442351039119365-core_node1-n_0000000000
   [junit4]   2> 631537 INFO  (qtp5891478-4784) [n:127.0.0.1:38644_solr c:testschemaapi s:shard1 r:core_node1 x:testschemaapi_shard1_replica2] o.a.s.c.ShardLeaderElectionContext Running the leader process for shard=shard1 and weAreReplacement=false and leaderVoteWait=10000
   [junit4]   2> 631537 INFO  (qtp5891478-4785) [n:127.0.0.1:43268_solr c:testschemaapi s:shard1 r:core_node2 x:testschemaapi_shard1_replica1] o.a.s.u.UpdateLog Took 1.0ms to seed version buckets with highest version 1559077618056167424
   [junit4]   2> 631537 INFO  (qtp5891478-4785) [n:127.0.0.1:43268_solr c:testschemaapi s:shard1 r:core_node2 x:testschemaapi_shard1_replica1] o.a.s.c.ZkController watch zkdir /configs/conf1
   [junit4]   2> 631538 INFO  (qtp5891478-4784) [n:127.0.0.1:38644_solr c:testschemaapi s:shard1 r:core_node1 x:testschemaapi_shard1_replica2] o.a.s.c.ShardLeaderElectionContext Waiting until we see more replicas up for shard shard1: total=2 found=1 timeoutin=9999ms
   [junit4]   2> 631538 INFO  (OverseerStateUpdate-97442351039119366-127.0.0.1:43268_solr-n_0000000000) [n:127.0.0.1:43268_solr    ] o.a.s.c.Overseer processMessage: queueSize: 1, message = {
   [junit4]   2>   "operation":"leader",
   [junit4]   2>   "shard":"shard1",
   [junit4]   2>   "collection":"testschemaapi"} current state version: 0
   [junit4]   2> 631538 INFO  (qtp5891478-4785) [n:127.0.0.1:43268_solr c:testschemaapi s:shard1 r:core_node2 x:testschemaapi_shard1_replica1] o.a.s.c.CoreContainer registering core: testschemaapi_shard1_replica1
   [junit4]   2> 631538 INFO  (qtp5891478-4785) [n:127.0.0.1:43268_solr c:testschemaapi s:shard1 r:core_node2 x:testschemaapi_shard1_replica1] o.a.s.c.ZkController Register replica - core:testschemaapi_shard1_replica1 address:http://127.0.0.1:43268/solr collection:testschemaapi shard:shard1
   [junit4]   2> 631539 INFO  (qtp5891478-4785) [n:127.0.0.1:43268_solr c:testschemaapi s:shard1 r:core_node2 x:testschemaapi_shard1_replica1] o.a.s.c.LeaderElector Joined leadership election with path: /collections/testschemaapi/leader_elect/shard1/election/97442351039119366-core_node2-n_0000000001
   [junit4]   2> 631539 INFO  (qtp5891478-4785) [n:127.0.0.1:43268_solr c:testschemaapi s:shard1 r:core_node2 x:testschemaapi_shard1_replica1] o.a.s.c.LeaderElector Watching path /collections/testschemaapi/leader_elect/shard1/election/97442351039119365-core_node1-n_0000000000 to know if I could be the leader
   [junit4]   2> 631639 INFO  (OverseerStateUpdate-97442351039119366-127.0.0.1:43268_solr-n_0000000000) [n:127.0.0.1:43268_solr    ] o.a.s.c.o.ZkStateWriter going to update_collection /collections/testschemaapi/state.json version: 1
   [junit4]   2> 631640 INFO  (zkCallback-778-thread-2-processing-n:127.0.0.1:43268_solr) [n:127.0.0.1:43268_solr    ] o.a.s.c.c.ZkStateReader A cluster state change: [WatchedEvent state:SyncConnected type:NodeDataChanged path:/collections/testschemaapi/state.json] for collection [testschemaapi] has occurred - updating... (live nodes size: [2])
   [junit4]   2> 631640 INFO  (zkCallback-777-thread-1-processing-n:127.0.0.1:38644_solr) [n:127.0.0.1:38644_solr    ] o.a.s.c.c.ZkStateReader A cluster state change: [WatchedEvent state:SyncConnected type:NodeDataChanged path:/collections/testschemaapi/state.json] for collection [testschemaapi] has occurred - updating... (live nodes size: [2])
   [junit4]   2> 631640 INFO  (zkCallback-778-thread-2-processing-n:127.0.0.1:43268_solr) [n:127.0.0.1:43268_solr    ] o.a.s.c.c.ZkStateReader Updating data for [testschemaapi] from [1] to [2]
   [junit4]   2> 631640 INFO  (zkCallback-777-thread-1-processing-n:127.0.0.1:38644_solr) [n:127.0.0.1:38644_solr    ] o.a.s.c.c.ZkStateReader Updating data for [testschemaapi] from [1] to [2]
   [junit4]   2> 632038 INFO  (qtp5891478-4784) [n:127.0.0.1:38644_solr c:testschemaapi s:shard1 r:core_node1 x:testschemaapi_shard1_replica2] o.a.s.c.ShardLeaderElectionContext Enough replicas found to continue.
   [junit4]   2> 632038 INFO  (qtp5891478-4784) [n:127.0.0.1:38644_solr c:testschemaapi s:shard1 r:core_node1 x:testschemaapi_shard1_replica2] o.a.s.c.ShardLeaderElectionContext I may be the new leader - try and sync
   [junit4]   2> 632038 INFO  (qtp5891478-4784) [n:127.0.0.1:38644_solr c:testschemaapi s:shard1 r:core_node1 x:testschemaapi_shard1_replica2] o.a.s.c.SyncStrategy Sync replicas to http://127.0.0.1:38644/solr/testschemaapi_shard1_replica2/
   [junit4]   2> 632038 INFO  (qtp5891478-4784) [n:127.0.0.1:38644_solr c:testschemaapi s:shard1 r:core_node1 x:testschemaapi_shard1_replica2] o.a.s.u.PeerSync PeerSync: core=testschemaapi_shard1_replica2 url=http://127.0.0.1:38644/solr START replicas=[http://127.0.0.1:43268/solr/testschemaapi_shard1_replica1/] nUpdates=100
   [junit4]   2> 632039 INFO  (qtp5891478-4784) [n:127.0.0.1:38644_solr c:testschemaapi s:shard1 r:core_node1 x:testschemaapi_shard1_replica2] o.a.s.u.PeerSync PeerSync: core=testschemaapi_shard1_replica2 url=http://127.0.0.1:38644/solr DONE.  We have no versions.  sync failed.
   [junit4]   2> 632039 INFO  (qtp5891478-4784) [n:127.0.0.1:38644_solr c:testschemaapi s:shard1 r:core_node1 x:testschemaapi_shard1_replica2] o.a.s.c.SyncStrategy Leader's attempt to sync with shard failed, moving to the next candidate
   [junit4]   2> 632039 INFO  (qtp5891478-4784) [n:127.0.0.1:38644_solr c:testschemaapi s:shard1 r:core_node1 x:testschemaapi_shard1_replica2] o.a.s.c.ShardLeaderElectionContext We failed sync, but we have no versions - we can't sync in that case - we were active before, so become leader anyway
   [junit4]   2> 632040 INFO  (qtp5891478-4784) [n:127.0.0.1:38644_solr c:testschemaapi s:shard1 r:core_node1 x:testschemaapi_shard1_replica2] o.a.s.c.c.SolrZkClient makePath: /collections/testschemaapi/leaders/shard1
   [junit4]   2> 632040 INFO  (qtp5891478-4787) [n:127.0.0.1:43268_solr c:testschemaapi s:shard1 r:core_node2 x:testschemaapi_shard1_replica1] o.a.s.c.S.Request [testschemaapi_shard1_replica1]  webapp=/solr path=/get params={getVersions=100&fingerprint=false&version=2&qt=/get&distrib=false&wt=javabin} status=0 QTime=0
   [junit4]   2> 632040 INFO  (qtp5891478-4784) [n:127.0.0.1:38644_solr c:testschemaapi s:shard1 r:core_node1 x:testschemaapi_shard1_replica2] o.a.s.c.ShardLeaderElectionContextBase Creating leader registration node /collections/testschemaapi/leaders/shard1/leader after winning as /collections/testschemaapi/leader_elect/shard1/election/97442351039119365-core_node1-n_0000000000
   [junit4]   2> 632041 INFO  (qtp5891478-4784) [n:127.0.0.1:38644_solr c:testschemaapi s:shard1 r:core_node1 x:testschemaapi_shard1_replica2] o.a.s.c.ShardLeaderElectionContext I am the new leader: http://127.0.0.1:38644/solr/testschemaapi_shard1_replica2/ shard1
   [junit4]   2> 632042 INFO  (OverseerStateUpdate-97442351039119366-127.0.0.1:43268_solr-n_0000000000) [n:127.0.0.1:43268_solr    ] o.a.s.c.Overseer processMessage: queueSize: 1, message = {
   [junit4]   2>   "operation":"leader",
   [junit4]   2>   "shard":"shard1",
   [junit4]   2>   "collection":"testschemaapi",
   [junit4]   2>   "base_url":"http://127.0.0.1:38644/solr",
   [junit4]   2>   "core":"testschemaapi_shard1_replica2",
   [junit4]   2>   "state":"active"} current state version: 0
   [junit4]   2> 632143 INFO  (OverseerStateUpdate-97442351039119366-127.0.0.1:43268_solr-n_0000000000) [n:127.0.0.1:43268_solr    ] o.a.s.c.o.ZkStateWriter going to update_collection /collections/testschemaapi/state.json version: 2
   [junit4]   2> 632143 INFO  (zkCallback-778-thread-1-processing-n:127.0.0.1:43268_solr) [n:127.0.0.1:43268_solr    ] o.a.s.c.c.ZkStateReader A cluster state change: [WatchedEvent state:SyncConnected type:NodeDataChanged path:/collections/testschemaapi/state.json] for collection [testschemaapi] has occurred - updating... (live nodes size: [2])
   [junit4]   2> 632143 INFO  (zkCallback-777-thread-1-processing-n:127.0.0.1:38644_solr) [n:127.0.0.1:38644_solr    ] o.a.s.c.c.ZkStateReader A cluster state change: [WatchedEvent state:SyncConnected type:NodeDataChanged path:/collections/testschemaapi/state.json] for collection [testschemaapi] has occurred - updating... (live nodes size: [2])
   [junit4]   2> 632143 INFO  (zkCallback-778-thread-1-processing-n:127.0.0.1:43268_solr) [n:127.0.0.1:43268_solr    ] o.a.s.c.c.ZkStateReader Updating data for [testschemaapi] from [2] to [3]
   [junit4]   2> 632143 INFO  (zkCallback-777-thread-1-processing-n:127.0.0.1:38644_solr) [n:127.0.0.1:38644_solr    ] o.a.s.c.c.ZkStateReader Updating data for [testschemaapi] from [2] to [3]
   [junit4]   2> 632192 INFO  (qtp5891478-4784) [n:127.0.0.1:38644_solr c:testschemaapi s:shard1 r:core_node1 x:testschemaapi_shard1_replica2] o.a.s.c.ZkController We are http://127.0.0.1:38644/solr/testschemaapi_shard1_replica2/ and leader is http://127.0.0.1:38644/solr/testschemaapi_shard1_replica2/
   [junit4]   2> 632192 INFO  (qtp5891478-4784) [n:127.0.0.1:38644_solr c:testschemaapi s:shard1 r:core_node1 x:testschemaapi_shard1_replica2] o.a.s.c.ZkController No LogReplay needed for core=testschemaapi_shard1_replica2 baseURL=http://127.0.0.1:38644/solr
   [junit4]   2> 632192 INFO  (qtp5891478-4784) [n:127.0.0.1:38644_solr c:testschemaapi s:shard1 r:core_node1 x:testschemaapi_shard1_replica2] o.a.s.c.ZkController I am the leader, no recovery necessary
   [junit4]   2> 632192 INFO  (qtp5891478-4784) [n:127.0.0.1:38644_solr c:testschemaapi s:shard1 r:core_node1 x:testschemaapi_shard1_replica2] o.a.s.c.ZkController publishing state=active
   [junit4]   2> 632193 INFO  (OverseerStateUpdate-97442351039119366-127.0.0.1:43268_solr-n_0000000000) [n:127.0.0.1:43268_solr    ] o.a.s.c.Overseer processMessage: queueSize: 1, message = {
   [junit4]   2>   "base_url":"http://127.0.0.1:38644/solr",
   [junit4]   2>   "state":"active",
   [junit4]   2>   "collection":"testschemaapi",
   [junit4]   2>   "core":"testschemaapi_shard1_replica2",
   [junit4]   2>   "numShards":"1",
   [junit4]   2>   "roles":null,
   [junit4]   2>   "operation":"state",
   [junit4]   2>   "core_node_name":"core_node1",
   [junit4]   2>   "node_name":"127.0.0.1:38644_solr",
   [junit4]   2>   "shard":"shard1"} current state version: 0
   [junit4]   2> 632193 INFO  (OverseerStateUpdate-97442351039119366-127.0.0.1:43268_solr-n_0000000000) [n:127.0.0.1:43268_solr    ] o.a.s.c.o.ReplicaMutator Update state numShards=1 message={
   [junit4]   2>   "base_url":"http://127.0.0.1:38644/solr",
   [junit4]   2>   "state":"active",
   [junit4]   2>   "collection":"testschemaapi",
   [junit4]   2>   "core":"testschemaapi_shard1_replica2",
   [junit4]   2>   "numShards":"1",
   [junit4]   2>   "roles":null,
   [junit4]   2>   "operation":"state",
   [junit4]   2>   "core_node_name":"core_node1",
   [junit4]   2>   "node_name":"127.0.0.1:38644_solr",
   [junit4]   2>   "shard":"shard1"}
   [junit4]   2> 632193 INFO  (qtp5891478-4784) [n:127.0.0.1:38644_solr c:testschemaapi s:shard1 r:core_node1 x:testschemaapi_shard1_replica2] o.a.s.s.HttpSolrCall [admin] webapp=null path=/admin/cores params={action=CREATE&collection=testschemaapi&version=2&qt=/admin/cores&collection.configName=conf1&numShards=1&wt=javabin&shard=shard1&name=testschemaapi_shard1_replica2} status=0 QTime=1730
   [junit4]   2> 632294 INFO  (OverseerStateUpdate-97442351039119366-127.0.0.1:43268_solr-n_0000000000) [n:127.0.0.1:43268_solr    ] o.a.s.c.o.ZkStateWriter going to update_collection /collections/testschemaapi/state.json version: 3
   [junit4]   2> 632294 INFO  (zkCallback-778-thread-1-processing-n:127.0.0.1:43268_solr) [n:127.0.0.1:43268_solr    ] o.a.s.c.c.ZkStateReader A cluster state change: [WatchedEvent state:SyncConnected type:NodeDataChanged path:/collections/testschemaapi/state.json] for collection [testschemaapi] has occurred - updating... (live nodes size: [2])
   [junit4]   2> 632294 INFO  (zkCallback-777-thread-1-processing-n:127.0.0.1:38644_solr) [n:127.0.0.1:38644_solr    ] o.a.s.c.c.ZkStateReader A cluster state change: [WatchedEvent state:SyncConnected 

[...truncated too long message...]

xecute(SolrZkClient.java:345)
   [junit4]   2> 	at org.apache.solr.common.cloud.SolrZkClient$7.execute(SolrZkClient.java:342)
   [junit4]   2> 	at org.apache.solr.common.cloud.ZkCmdExecutor.retryOperation(ZkCmdExecutor.java:60)
   [junit4]   2> 	at org.apache.solr.common.cloud.SolrZkClient.getData(SolrZkClient.java:342)
   [junit4]   2> 	at org.apache.solr.schema.ManagedIndexSchemaFactory.create(ManagedIndexSchemaFactory.java:128)
   [junit4]   2> 	at org.apache.solr.schema.ManagedIndexSchemaFactory.create(ManagedIndexSchemaFactory.java:47)
   [junit4]   2> 	at org.apache.solr.schema.IndexSchemaFactory.buildIndexSchema(IndexSchemaFactory.java:70)
   [junit4]   2> 	at org.apache.solr.core.ConfigSetService.createIndexSchema(ConfigSetService.java:108)
   [junit4]   2> 	at org.apache.solr.core.ConfigSetService.getConfig(ConfigSetService.java:79)
   [junit4]   2> 	at org.apache.solr.core.CoreContainer.reload(CoreContainer.java:920)
   [junit4]   2> 	at org.apache.solr.core.SolrCore$11.run(SolrCore.java:2623)
   [junit4]   2> 	at org.apache.solr.cloud.ZkController$5.run(ZkController.java:2480)
   [junit4]   2> 640841 INFO  (Thread-1579) [n:127.0.0.1:38644_solr    ] o.a.s.c.SolrConfig Loaded SolrConfig: solrconfig.xml
   [junit4]   2> 640841 WARN  (Thread-1578) [n:127.0.0.1:43268_solr    ] o.a.s.c.ZkController listener throws error
   [junit4]   2> org.apache.solr.common.SolrException: Unable to reload core [testschemaapi_shard1_replica1]
   [junit4]   2> 	at org.apache.solr.core.CoreContainer.reload(CoreContainer.java:927)
   [junit4]   2> 	at org.apache.solr.core.SolrCore$11.run(SolrCore.java:2623)
   [junit4]   2> 	at org.apache.solr.cloud.ZkController$5.run(ZkController.java:2480)
   [junit4]   2> Caused by: org.apache.solr.common.SolrException: Could not load conf for core testschemaapi_shard1_replica1: Error attempting to access /configs/conf1/managed-schema
   [junit4]   2> 	at org.apache.solr.core.ConfigSetService.getConfig(ConfigSetService.java:84)
   [junit4]   2> 	at org.apache.solr.core.CoreContainer.reload(CoreContainer.java:920)
   [junit4]   2> 	... 2 more
   [junit4]   2> Caused by: org.apache.solr.common.SolrException: Error attempting to access /configs/conf1/managed-schema
   [junit4]   2> 	at org.apache.solr.schema.ManagedIndexSchemaFactory.create(ManagedIndexSchemaFactory.java:143)
   [junit4]   2> 	at org.apache.solr.schema.ManagedIndexSchemaFactory.create(ManagedIndexSchemaFactory.java:47)
   [junit4]   2> 	at org.apache.solr.schema.IndexSchemaFactory.buildIndexSchema(IndexSchemaFactory.java:70)
   [junit4]   2> 	at org.apache.solr.core.ConfigSetService.createIndexSchema(ConfigSetService.java:108)
   [junit4]   2> 	at org.apache.solr.core.ConfigSetService.getConfig(ConfigSetService.java:79)
   [junit4]   2> 	... 3 more
   [junit4]   2> Caused by: org.apache.zookeeper.KeeperException$SessionExpiredException: KeeperErrorCode = Session expired for /configs/conf1/managed-schema
   [junit4]   2> 	at org.apache.zookeeper.KeeperException.create(KeeperException.java:127)
   [junit4]   2> 	at org.apache.zookeeper.KeeperException.create(KeeperException.java:51)
   [junit4]   2> 	at org.apache.zookeeper.ZooKeeper.getData(ZooKeeper.java:1155)
   [junit4]   2> 	at org.apache.solr.common.cloud.SolrZkClient$7.execute(SolrZkClient.java:345)
   [junit4]   2> 	at org.apache.solr.common.cloud.SolrZkClient$7.execute(SolrZkClient.java:342)
   [junit4]   2> 	at org.apache.solr.common.cloud.ZkCmdExecutor.retryOperation(ZkCmdExecutor.java:60)
   [junit4]   2> 	at org.apache.solr.common.cloud.SolrZkClient.getData(SolrZkClient.java:342)
   [junit4]   2> 	at org.apache.solr.schema.ManagedIndexSchemaFactory.create(ManagedIndexSchemaFactory.java:128)
   [junit4]   2> 	... 7 more
   [junit4]   2> 640841 ERROR (Thread-1579) [n:127.0.0.1:38644_solr    ] o.a.s.s.ManagedIndexSchemaFactory Error attempting to access /configs/conf1/managed-schema
   [junit4]   2> org.apache.zookeeper.KeeperException$SessionExpiredException: KeeperErrorCode = Session expired for /configs/conf1/managed-schema
   [junit4]   2> 	at org.apache.zookeeper.KeeperException.create(KeeperException.java:127)
   [junit4]   2> 	at org.apache.zookeeper.KeeperException.create(KeeperException.java:51)
   [junit4]   2> 	at org.apache.zookeeper.ZooKeeper.getData(ZooKeeper.java:1155)
   [junit4]   2> 	at org.apache.solr.common.cloud.SolrZkClient$7.execute(SolrZkClient.java:345)
   [junit4]   2> 	at org.apache.solr.common.cloud.SolrZkClient$7.execute(SolrZkClient.java:342)
   [junit4]   2> 	at org.apache.solr.common.cloud.ZkCmdExecutor.retryOperation(ZkCmdExecutor.java:60)
   [junit4]   2> 	at org.apache.solr.common.cloud.SolrZkClient.getData(SolrZkClient.java:342)
   [junit4]   2> 	at org.apache.solr.schema.ManagedIndexSchemaFactory.create(ManagedIndexSchemaFactory.java:128)
   [junit4]   2> 	at org.apache.solr.schema.ManagedIndexSchemaFactory.create(ManagedIndexSchemaFactory.java:47)
   [junit4]   2> 	at org.apache.solr.schema.IndexSchemaFactory.buildIndexSchema(IndexSchemaFactory.java:70)
   [junit4]   2> 	at org.apache.solr.core.ConfigSetService.createIndexSchema(ConfigSetService.java:108)
   [junit4]   2> 	at org.apache.solr.core.ConfigSetService.getConfig(ConfigSetService.java:79)
   [junit4]   2> 	at org.apache.solr.core.CoreContainer.reload(CoreContainer.java:920)
   [junit4]   2> 	at org.apache.solr.core.SolrCore$11.run(SolrCore.java:2623)
   [junit4]   2> 	at org.apache.solr.cloud.ZkController$5.run(ZkController.java:2480)
   [junit4]   2> 640842 WARN  (Thread-1579) [n:127.0.0.1:38644_solr    ] o.a.s.c.ZkController listener throws error
   [junit4]   2> org.apache.solr.common.SolrException: Unable to reload core [testschemaapi_shard1_replica2]
   [junit4]   2> 	at org.apache.solr.core.CoreContainer.reload(CoreContainer.java:927)
   [junit4]   2> 	at org.apache.solr.core.SolrCore$11.run(SolrCore.java:2623)
   [junit4]   2> 	at org.apache.solr.cloud.ZkController$5.run(ZkController.java:2480)
   [junit4]   2> Caused by: org.apache.solr.common.SolrException: Could not load conf for core testschemaapi_shard1_replica2: Error attempting to access /configs/conf1/managed-schema
   [junit4]   2> 	at org.apache.solr.core.ConfigSetService.getConfig(ConfigSetService.java:84)
   [junit4]   2> 	at org.apache.solr.core.CoreContainer.reload(CoreContainer.java:920)
   [junit4]   2> 	... 2 more
   [junit4]   2> Caused by: org.apache.solr.common.SolrException: Error attempting to access /configs/conf1/managed-schema
   [junit4]   2> 	at org.apache.solr.schema.ManagedIndexSchemaFactory.create(ManagedIndexSchemaFactory.java:143)
   [junit4]   2> 	at org.apache.solr.schema.ManagedIndexSchemaFactory.create(ManagedIndexSchemaFactory.java:47)
   [junit4]   2> 	at org.apache.solr.schema.IndexSchemaFactory.buildIndexSchema(IndexSchemaFactory.java:70)
   [junit4]   2> 	at org.apache.solr.core.ConfigSetService.createIndexSchema(ConfigSetService.java:108)
   [junit4]   2> 	at org.apache.solr.core.ConfigSetService.getConfig(ConfigSetService.java:79)
   [junit4]   2> 	... 3 more
   [junit4]   2> Caused by: org.apache.zookeeper.KeeperException$SessionExpiredException: KeeperErrorCode = Session expired for /configs/conf1/managed-schema
   [junit4]   2> 	at org.apache.zookeeper.KeeperException.create(KeeperException.java:127)
   [junit4]   2> 	at org.apache.zookeeper.KeeperException.create(KeeperException.java:51)
   [junit4]   2> 	at org.apache.zookeeper.ZooKeeper.getData(ZooKeeper.java:1155)
   [junit4]   2> 	at org.apache.solr.common.cloud.SolrZkClient$7.execute(SolrZkClient.java:345)
   [junit4]   2> 	at org.apache.solr.common.cloud.SolrZkClient$7.execute(SolrZkClient.java:342)
   [junit4]   2> 	at org.apache.solr.common.cloud.ZkCmdExecutor.retryOperation(ZkCmdExecutor.java:60)
   [junit4]   2> 	at org.apache.solr.common.cloud.SolrZkClient.getData(SolrZkClient.java:342)
   [junit4]   2> 	at org.apache.solr.schema.ManagedIndexSchemaFactory.create(ManagedIndexSchemaFactory.java:128)
   [junit4]   2> 	... 7 more
   [junit4]   2> NOTE: test params are: codec=Asserting(Lucene54), sim=DefaultSimilarity, locale=et, timezone=Asia/Istanbul
   [junit4]   2> NOTE: Linux 4.4.0-53-generic i386/Oracle Corporation 1.7.0_80 (32-bit)/cpus=12,threads=1,free=268035256,total=400556032
   [junit4]   2> NOTE: All tests run in this JVM: [TestRestoreCore, SSLMigrationTest, PluginInfoTest, TestSerializedLuceneMatchVersion, SolrTestCaseJ4Test, TestRecovery, ReplicationFactorTest, TestHdfsUpdateLog, TestExpandComponent, TestCSVResponseWriter, FieldAnalysisRequestHandlerTest, NoCacheHeaderTest, TestRawTransformer, TestReRankQParserPlugin, CurrencyFieldXmlFileTest, UpdateParamsTest, TestManagedResource, TestBulkSchemaAPI, DistributedQueueTest, TestShardHandlerFactory, TestDynamicLoading, RuleEngineTest, TestStressRecovery, SortSpecParsingTest, DirectSolrConnectionTest, BasicDistributedZk2Test, TestWriterPerf, DateMathParserTest, SuggesterWFSTTest, TestAnalyzeInfixSuggestions, DistributedSuggestComponentTest, ShowFileRequestHandlerTest, OverseerTest, TestFuzzyAnalyzedSuggestions, TestIndexSearcher, BlockJoinFacetSimpleTest, TestSweetSpotSimilarityFactory, TestReload, JavabinLoaderTest, SliceStateTest, TestClusterStateMutator, FullSolrCloudDistribCmdsTest, TestStressReorder, TestExtendedDismaxParser, TestFieldTypeResource, OverseerRolesTest, TestCloudSchemaless, TestCoreDiscovery, SuggesterTSTTest, AtomicUpdatesTest, TestFreeTextSuggestions, ClusterStateTest, TestLeaderInitiatedRecoveryThread, DocValuesMultiTest, HdfsChaosMonkeyNothingIsSafeTest, TestClassicSimilarityFactory, PeerSyncReplicationTest, TestPHPSerializedResponseWriter, DirectUpdateHandlerOptimizeTest, LukeRequestHandlerTest, StatelessScriptUpdateProcessorFactoryTest, BadComponentTest, HighlighterConfigTest, BitVectorTest, SolrCloudExampleTest, BlockDirectoryTest, DataDrivenBlockJoinTest, BJQParserTest, InfoHandlerTest, TestManagedSchemaAPI]
   [junit4] Completed [216/575 (1!)] on J2 in 10.93s, 1 test, 1 error <<< FAILURES!

[...truncated 50248 lines...]


Mime
View raw message