lucene-dev mailing list archives

Site index · List index
Message view « Date » · « Thread »
Top « Date » · « Thread »
From Policeman Jenkins Server <jenk...@thetaphi.de>
Subject [JENKINS-EA] Lucene-Solr-6.4-Linux (64bit/jdk-9-ea+153) - Build # 98 - Still unstable!
Date Fri, 03 Feb 2017 10:00:11 GMT
Build: https://jenkins.thetaphi.de/job/Lucene-Solr-6.4-Linux/98/
Java: 64bit/jdk-9-ea+153 -XX:-UseCompressedOops -XX:+UseG1GC

1 tests failed.
FAILED:  org.apache.solr.handler.admin.MBeansHandlerTest.testDiff

Error Message:
expected:<Was: [1, Now: 2], Delta: 1> but was:<Was: [4, Now: 5], Delta: 1>

Stack Trace:
org.junit.ComparisonFailure: expected:<Was: [1, Now: 2], Delta: 1> but was:<Was:
[4, Now: 5], Delta: 1>
	at __randomizedtesting.SeedInfo.seed([26EEB70C8F754BA5:E3F873979FC373C5]:0)
	at org.junit.Assert.assertEquals(Assert.java:125)
	at org.junit.Assert.assertEquals(Assert.java:147)
	at org.apache.solr.handler.admin.MBeansHandlerTest.testDiff(MBeansHandlerTest.java:63)
	at java.base/jdk.internal.reflect.NativeMethodAccessorImpl.invoke0(Native Method)
	at java.base/jdk.internal.reflect.NativeMethodAccessorImpl.invoke(NativeMethodAccessorImpl.java:62)
	at java.base/jdk.internal.reflect.DelegatingMethodAccessorImpl.invoke(DelegatingMethodAccessorImpl.java:43)
	at java.base/java.lang.reflect.Method.invoke(Method.java:543)
	at com.carrotsearch.randomizedtesting.RandomizedRunner.invoke(RandomizedRunner.java:1713)
	at com.carrotsearch.randomizedtesting.RandomizedRunner$8.evaluate(RandomizedRunner.java:907)
	at com.carrotsearch.randomizedtesting.RandomizedRunner$9.evaluate(RandomizedRunner.java:943)
	at com.carrotsearch.randomizedtesting.RandomizedRunner$10.evaluate(RandomizedRunner.java:957)
	at com.carrotsearch.randomizedtesting.rules.SystemPropertiesRestoreRule$1.evaluate(SystemPropertiesRestoreRule.java:57)
	at org.apache.lucene.util.TestRuleSetupTeardownChained$1.evaluate(TestRuleSetupTeardownChained.java:49)
	at org.apache.lucene.util.AbstractBeforeAfterRule$1.evaluate(AbstractBeforeAfterRule.java:45)
	at org.apache.lucene.util.TestRuleThreadAndTestName$1.evaluate(TestRuleThreadAndTestName.java:48)
	at org.apache.lucene.util.TestRuleIgnoreAfterMaxFailures$1.evaluate(TestRuleIgnoreAfterMaxFailures.java:64)
	at org.apache.lucene.util.TestRuleMarkFailure$1.evaluate(TestRuleMarkFailure.java:47)
	at com.carrotsearch.randomizedtesting.rules.StatementAdapter.evaluate(StatementAdapter.java:36)
	at com.carrotsearch.randomizedtesting.ThreadLeakControl$StatementRunner.run(ThreadLeakControl.java:367)
	at com.carrotsearch.randomizedtesting.ThreadLeakControl.forkTimeoutingTask(ThreadLeakControl.java:811)
	at com.carrotsearch.randomizedtesting.ThreadLeakControl$3.evaluate(ThreadLeakControl.java:462)
	at com.carrotsearch.randomizedtesting.RandomizedRunner.runSingleTest(RandomizedRunner.java:916)
	at com.carrotsearch.randomizedtesting.RandomizedRunner$5.evaluate(RandomizedRunner.java:802)
	at com.carrotsearch.randomizedtesting.RandomizedRunner$6.evaluate(RandomizedRunner.java:852)
	at com.carrotsearch.randomizedtesting.RandomizedRunner$7.evaluate(RandomizedRunner.java:863)
	at com.carrotsearch.randomizedtesting.rules.StatementAdapter.evaluate(StatementAdapter.java:36)
	at com.carrotsearch.randomizedtesting.rules.SystemPropertiesRestoreRule$1.evaluate(SystemPropertiesRestoreRule.java:57)
	at org.apache.lucene.util.AbstractBeforeAfterRule$1.evaluate(AbstractBeforeAfterRule.java:45)
	at com.carrotsearch.randomizedtesting.rules.StatementAdapter.evaluate(StatementAdapter.java:36)
	at org.apache.lucene.util.TestRuleStoreClassName$1.evaluate(TestRuleStoreClassName.java:41)
	at com.carrotsearch.randomizedtesting.rules.NoShadowingOrOverridesOnMethodsRule$1.evaluate(NoShadowingOrOverridesOnMethodsRule.java:40)
	at com.carrotsearch.randomizedtesting.rules.NoShadowingOrOverridesOnMethodsRule$1.evaluate(NoShadowingOrOverridesOnMethodsRule.java:40)
	at com.carrotsearch.randomizedtesting.rules.StatementAdapter.evaluate(StatementAdapter.java:36)
	at com.carrotsearch.randomizedtesting.rules.StatementAdapter.evaluate(StatementAdapter.java:36)
	at org.apache.lucene.util.TestRuleAssertionsRequired$1.evaluate(TestRuleAssertionsRequired.java:53)
	at org.apache.lucene.util.TestRuleMarkFailure$1.evaluate(TestRuleMarkFailure.java:47)
	at org.apache.lucene.util.TestRuleIgnoreAfterMaxFailures$1.evaluate(TestRuleIgnoreAfterMaxFailures.java:64)
	at org.apache.lucene.util.TestRuleIgnoreTestSuites$1.evaluate(TestRuleIgnoreTestSuites.java:54)
	at com.carrotsearch.randomizedtesting.rules.StatementAdapter.evaluate(StatementAdapter.java:36)
	at com.carrotsearch.randomizedtesting.ThreadLeakControl$StatementRunner.run(ThreadLeakControl.java:367)
	at java.base/java.lang.Thread.run(Thread.java:844)




Build Log:
[...truncated 12010 lines...]
   [junit4] Suite: org.apache.solr.handler.admin.MBeansHandlerTest
   [junit4]   2> Creating dataDir: /home/jenkins/workspace/Lucene-Solr-6.4-Linux/solr/build/solr-core/test/J2/temp/solr.handler.admin.MBeansHandlerTest_26EEB70C8F754BA5-001/init-core-data-001
   [junit4]   2> 1214143 INFO  (SUITE-MBeansHandlerTest-seed#[26EEB70C8F754BA5]-worker)
[    ] o.a.s.SolrTestCaseJ4 Randomized ssl (true) and clientAuth (true) via: @org.apache.solr.util.RandomizeSSL(reason="",
ssl=0.0/0.0, value=0.0/0.0, clientAuth=0.0/0.0)
   [junit4]   2> 1214151 INFO  (SUITE-MBeansHandlerTest-seed#[26EEB70C8F754BA5]-worker)
[    ] o.a.s.SolrTestCaseJ4 ####initCore
   [junit4]   2> 1214152 INFO  (SUITE-MBeansHandlerTest-seed#[26EEB70C8F754BA5]-worker)
[    ] o.a.s.c.SolrResourceLoader [null] Added 2 libs to classloader, from paths: [/home/jenkins/workspace/Lucene-Solr-6.4-Linux/solr/core/src/test-files/solr/collection1/lib,
/home/jenkins/workspace/Lucene-Solr-6.4-Linux/solr/core/src/test-files/solr/collection1/lib/classes]
   [junit4]   2> 1214223 WARN  (SUITE-MBeansHandlerTest-seed#[26EEB70C8F754BA5]-worker)
[    ] o.a.s.c.Config Beginning with Solr 5.5, <mergePolicy> is deprecated, use <mergePolicyFactory>
instead.
   [junit4]   2> 1214224 INFO  (SUITE-MBeansHandlerTest-seed#[26EEB70C8F754BA5]-worker)
[    ] o.a.s.c.SolrConfig Using Lucene MatchVersion: 6.4.1
   [junit4]   2> 1214244 INFO  (SUITE-MBeansHandlerTest-seed#[26EEB70C8F754BA5]-worker)
[    ] o.a.s.s.IndexSchema [null] Schema name=test
   [junit4]   2> 1214314 WARN  (SUITE-MBeansHandlerTest-seed#[26EEB70C8F754BA5]-worker)
[    ] o.a.s.s.IndexSchema [null] default search field in schema is text. WARNING: Deprecated,
please use 'df' on request instead.
   [junit4]   2> 1214315 INFO  (SUITE-MBeansHandlerTest-seed#[26EEB70C8F754BA5]-worker)
[    ] o.a.s.s.IndexSchema Loaded schema test/1.0 with uniqueid field id
   [junit4]   2> 1214335 INFO  (SUITE-MBeansHandlerTest-seed#[26EEB70C8F754BA5]-worker)
[    ] o.a.s.u.UpdateShardHandler Creating UpdateShardHandler HTTP client with params: socketTimeout=30000&connTimeout=30000&retry=true
   [junit4]   2> 1214338 WARN  (SUITE-MBeansHandlerTest-seed#[26EEB70C8F754BA5]-worker)
[    ] o.a.s.m.r.SolrJmxReporter No serviceUrl or agentId was configured, using first MBeanServer.
   [junit4]   2> 1214340 INFO  (SUITE-MBeansHandlerTest-seed#[26EEB70C8F754BA5]-worker)
[    ] o.a.s.m.r.SolrJmxReporter JMX monitoring enabled at server: com.sun.jmx.mbeanserver.JmxMBeanServer@4369e729
   [junit4]   2> 1214340 WARN  (SUITE-MBeansHandlerTest-seed#[26EEB70C8F754BA5]-worker)
[    ] o.a.s.m.r.SolrJmxReporter No serviceUrl or agentId was configured, using first MBeanServer.
   [junit4]   2> 1214343 INFO  (SUITE-MBeansHandlerTest-seed#[26EEB70C8F754BA5]-worker)
[    ] o.a.s.m.r.SolrJmxReporter JMX monitoring enabled at server: com.sun.jmx.mbeanserver.JmxMBeanServer@4369e729
   [junit4]   2> 1214343 WARN  (SUITE-MBeansHandlerTest-seed#[26EEB70C8F754BA5]-worker)
[    ] o.a.s.m.r.SolrJmxReporter No serviceUrl or agentId was configured, using first MBeanServer.
   [junit4]   2> 1214343 INFO  (SUITE-MBeansHandlerTest-seed#[26EEB70C8F754BA5]-worker)
[    ] o.a.s.m.r.SolrJmxReporter JMX monitoring enabled at server: com.sun.jmx.mbeanserver.JmxMBeanServer@4369e729
   [junit4]   2> 1214345 INFO  (coreLoadExecutor-6154-thread-1) [    ] o.a.s.c.SolrResourceLoader
[null] Added 2 libs to classloader, from paths: [/home/jenkins/workspace/Lucene-Solr-6.4-Linux/solr/core/src/test-files/solr/collection1/lib,
/home/jenkins/workspace/Lucene-Solr-6.4-Linux/solr/core/src/test-files/solr/collection1/lib/classes]
   [junit4]   2> 1214422 WARN  (coreLoadExecutor-6154-thread-1) [    ] o.a.s.c.Config Beginning
with Solr 5.5, <mergePolicy> is deprecated, use <mergePolicyFactory> instead.
   [junit4]   2> 1214423 INFO  (coreLoadExecutor-6154-thread-1) [    ] o.a.s.c.SolrConfig
Using Lucene MatchVersion: 6.4.1
   [junit4]   2> 1214442 INFO  (coreLoadExecutor-6154-thread-1) [    ] o.a.s.s.IndexSchema
[collection1] Schema name=test
   [junit4]   2> 1214509 WARN  (coreLoadExecutor-6154-thread-1) [    ] o.a.s.s.IndexSchema
[collection1] default search field in schema is text. WARNING: Deprecated, please use 'df'
on request instead.
   [junit4]   2> 1214511 INFO  (coreLoadExecutor-6154-thread-1) [    ] o.a.s.s.IndexSchema
Loaded schema test/1.0 with uniqueid field id
   [junit4]   2> 1214531 INFO  (coreLoadExecutor-6154-thread-1) [    ] o.a.s.c.CoreContainer
Creating SolrCore 'collection1' using configuration from instancedir /home/jenkins/workspace/Lucene-Solr-6.4-Linux/solr/core/src/test-files/solr/collection1
   [junit4]   2> 1214531 WARN  (coreLoadExecutor-6154-thread-1) [    ] o.a.s.m.r.SolrJmxReporter
No serviceUrl or agentId was configured, using first MBeanServer.
   [junit4]   2> 1214532 INFO  (coreLoadExecutor-6154-thread-1) [    ] o.a.s.m.r.SolrJmxReporter
JMX monitoring enabled at server: com.sun.jmx.mbeanserver.JmxMBeanServer@4369e729
   [junit4]   2> 1214532 INFO  (coreLoadExecutor-6154-thread-1) [    ] o.a.s.c.SolrCore
[[collection1] ] Opening new SolrCore at [/home/jenkins/workspace/Lucene-Solr-6.4-Linux/solr/core/src/test-files/solr/collection1],
dataDir=[/home/jenkins/workspace/Lucene-Solr-6.4-Linux/solr/build/solr-core/test/J2/temp/solr.handler.admin.MBeansHandlerTest_26EEB70C8F754BA5-001/init-core-data-001/]
   [junit4]   2> 1214532 INFO  (coreLoadExecutor-6154-thread-1) [    ] o.a.s.c.JmxMonitoredMap
JMX monitoring is enabled. Adding Solr mbeans to JMX Server: com.sun.jmx.mbeanserver.JmxMBeanServer@4369e729
   [junit4]   2> 1214533 INFO  (coreLoadExecutor-6154-thread-1) [    ] o.a.s.u.RandomMergePolicy
RandomMergePolicy wrapping class org.apache.lucene.index.LogByteSizeMergePolicy: [LogByteSizeMergePolicy:
minMergeSize=1677721, mergeFactor=24, maxMergeSize=2147483648, maxMergeSizeForForcedMerge=9223372036854775807,
calibrateSizeByDeletes=false, maxMergeDocs=2147483647, maxCFSSegmentSizeMB=8.796093022207999E12,
noCFSRatio=0.43398391628100463]
   [junit4]   2> 1214552 INFO  (coreLoadExecutor-6154-thread-1) [    ] o.a.s.u.UpdateHandler
Using UpdateLog implementation: org.apache.solr.update.UpdateLog
   [junit4]   2> 1214552 INFO  (coreLoadExecutor-6154-thread-1) [    ] o.a.s.u.UpdateLog
Initializing UpdateLog: dataDir= defaultSyncLevel=FLUSH numRecordsToKeep=100 maxNumLogsToKeep=10
numVersionBuckets=65536
   [junit4]   2> 1214554 INFO  (coreLoadExecutor-6154-thread-1) [    ] o.a.s.u.CommitTracker
Hard AutoCommit: disabled
   [junit4]   2> 1214554 INFO  (coreLoadExecutor-6154-thread-1) [    ] o.a.s.u.CommitTracker
Soft AutoCommit: disabled
   [junit4]   2> 1214555 INFO  (coreLoadExecutor-6154-thread-1) [    ] o.a.s.u.RandomMergePolicy
RandomMergePolicy wrapping class org.apache.lucene.index.TieredMergePolicy: [TieredMergePolicy:
maxMergeAtOnce=49, maxMergeAtOnceExplicit=16, maxMergedSegmentMB=83.69140625, floorSegmentMB=1.2744140625,
forceMergeDeletesPctAllowed=8.008204237596443, segmentsPerTier=45.0, maxCFSSegmentSizeMB=8.796093022207999E12,
noCFSRatio=0.13699790150409205
   [junit4]   2> 1214555 INFO  (coreLoadExecutor-6154-thread-1) [    ] o.a.s.s.SolrIndexSearcher
Opening [Searcher@5184500d[collection1] main]
   [junit4]   2> 1214555 INFO  (coreLoadExecutor-6154-thread-1) [    ] o.a.s.h.c.SpellCheckComponent
Initializing spell checkers
   [junit4]   2> 1214609 INFO  (coreLoadExecutor-6154-thread-1) [    ] o.a.s.s.DirectSolrSpellChecker
init: {name=direct,classname=DirectSolrSpellChecker,field=lowerfilt,minQueryLength=3}
   [junit4]   2> 1214763 INFO  (coreLoadExecutor-6154-thread-1) [    ] o.a.s.h.ReplicationHandler
Commits will be reserved for  10000
   [junit4]   2> 1214763 INFO  (searcherExecutor-6155-thread-1) [    ] o.a.s.h.c.SpellCheckComponent
Loading spell index for spellchecker: default
   [junit4]   2> 1214764 INFO  (coreLoadExecutor-6154-thread-1) [    ] o.a.s.u.UpdateLog
Could not find max version in index or recent updates, using new clock 1558304299734269952
   [junit4]   2> 1214764 INFO  (searcherExecutor-6155-thread-1) [    ] o.a.s.h.c.SpellCheckComponent
Loading spell index for spellchecker: direct
   [junit4]   2> 1214764 INFO  (searcherExecutor-6155-thread-1) [    ] o.a.s.h.c.SpellCheckComponent
Loading spell index for spellchecker: wordbreak
   [junit4]   2> 1214764 INFO  (searcherExecutor-6155-thread-1) [    ] o.a.s.h.c.SpellCheckComponent
Loading spell index for spellchecker: multipleFields
   [junit4]   2> 1214765 INFO  (searcherExecutor-6155-thread-1) [    ] o.a.s.h.c.SpellCheckComponent
Loading spell index for spellchecker: jarowinkler
   [junit4]   2> 1214766 INFO  (SUITE-MBeansHandlerTest-seed#[26EEB70C8F754BA5]-worker)
[    ] o.a.s.SolrTestCaseJ4 ####initCore end
   [junit4]   2> 1214767 INFO  (searcherExecutor-6155-thread-1) [    ] o.a.s.h.c.SpellCheckComponent
Loading spell index for spellchecker: external
   [junit4]   2> 1214768 INFO  (TEST-MBeansHandlerTest.testBackCompatNames-seed#[26EEB70C8F754BA5])
[    ] o.a.s.SolrTestCaseJ4 ###Starting testBackCompatNames
   [junit4]   2> 1214768 INFO  (searcherExecutor-6155-thread-1) [    ] o.a.s.h.c.SpellCheckComponent
Loading spell index for spellchecker: freq
   [junit4]   2> 1214768 INFO  (TEST-MBeansHandlerTest.testBackCompatNames-seed#[26EEB70C8F754BA5])
[    ] o.a.s.c.S.Request [collection1]  webapp=null path=null params={qt=/admin/mbeans&wt=xml}
status=0 QTime=0
   [junit4]   2> 1214769 INFO  (searcherExecutor-6155-thread-1) [    ] o.a.s.h.c.SpellCheckComponent
Loading spell index for spellchecker: fqcn
   [junit4]   2> 1214770 INFO  (searcherExecutor-6155-thread-1) [    ] o.a.s.h.c.SpellCheckComponent
Loading spell index for spellchecker: perDict
   [junit4]   2> 1214771 INFO  (searcherExecutor-6155-thread-1) [    ] o.a.s.c.SolrCore
[collection1] Registered new searcher Searcher@5184500d[collection1] main{ExitableDirectoryReader(UninvertingDirectoryReader())}
   [junit4]   2> 1214772 INFO  (TEST-MBeansHandlerTest.testBackCompatNames-seed#[26EEB70C8F754BA5])
[    ] o.a.s.c.S.Request [collection1]  webapp=null path=null params={qt=/admin/mbeans&cat=QUERYHANDLER&wt=xml}
status=0 QTime=0
   [junit4]   2> 1214773 INFO  (TEST-MBeansHandlerTest.testBackCompatNames-seed#[26EEB70C8F754BA5])
[    ] o.a.s.c.S.Request [collection1]  webapp=null path=null params={qt=/admin/mbeans&cat=UPDATE&wt=xml}
status=0 QTime=0
   [junit4]   2> 1214773 INFO  (TEST-MBeansHandlerTest.testBackCompatNames-seed#[26EEB70C8F754BA5])
[    ] o.a.s.SolrTestCaseJ4 ###Ending testBackCompatNames
   [junit4]   2> 1214775 INFO  (TEST-MBeansHandlerTest.testXMLDiffWithExternalEntity-seed#[26EEB70C8F754BA5])
[    ] o.a.s.SolrTestCaseJ4 ###Starting testXMLDiffWithExternalEntity
   [junit4]   2> 1214776 INFO  (TEST-MBeansHandlerTest.testXMLDiffWithExternalEntity-seed#[26EEB70C8F754BA5])
[    ] o.a.s.SolrTestCaseJ4 ###Ending testXMLDiffWithExternalEntity
   [junit4]   2> 1214777 INFO  (TEST-MBeansHandlerTest.testDiff-seed#[26EEB70C8F754BA5])
[    ] o.a.s.SolrTestCaseJ4 ###Starting testDiff
   [junit4]   2> 1214778 INFO  (TEST-MBeansHandlerTest.testDiff-seed#[26EEB70C8F754BA5])
[    ] o.a.s.c.S.Request [collection1]  webapp=null path=null params={qt=/admin/mbeans&stats=true&wt=xml}
status=0 QTime=0
   [junit4]   2> 1214787 INFO  (TEST-MBeansHandlerTest.testDiff-seed#[26EEB70C8F754BA5])
[    ] o.a.s.c.S.Request [collection1]  webapp=null path=null params={qt=/admin/mbeans&stats=true&diff=true&wt=xml}
status=0 QTime=8
   [junit4]   2> 1214789 INFO  (TEST-MBeansHandlerTest.testDiff-seed#[26EEB70C8F754BA5])
[    ] o.a.s.SolrTestCaseJ4 ###Ending testDiff
   [junit4]   2> NOTE: reproduce with: ant test  -Dtestcase=MBeansHandlerTest -Dtests.method=testDiff
-Dtests.seed=26EEB70C8F754BA5 -Dtests.multiplier=3 -Dtests.slow=true -Dtests.locale=el-GR
-Dtests.timezone=HST -Dtests.asserts=true -Dtests.file.encoding=US-ASCII
   [junit4] FAILURE 0.01s J2 | MBeansHandlerTest.testDiff <<<
   [junit4]    > Throwable #1: org.junit.ComparisonFailure: expected:<Was: [1, Now:
2], Delta: 1> but was:<Was: [4, Now: 5], Delta: 1>
   [junit4]    > 	at __randomizedtesting.SeedInfo.seed([26EEB70C8F754BA5:E3F873979FC373C5]:0)
   [junit4]    > 	at org.apache.solr.handler.admin.MBeansHandlerTest.testDiff(MBeansHandlerTest.java:63)
   [junit4]    > 	at java.base/jdk.internal.reflect.NativeMethodAccessorImpl.invoke0(Native
Method)
   [junit4]    > 	at java.base/jdk.internal.reflect.NativeMethodAccessorImpl.invoke(NativeMethodAccessorImpl.java:62)
   [junit4]    > 	at java.base/jdk.internal.reflect.DelegatingMethodAccessorImpl.invoke(DelegatingMethodAccessorImpl.java:43)
   [junit4]    > 	at java.base/java.lang.reflect.Method.invoke(Method.java:543)
   [junit4]    > 	at java.base/java.lang.Thread.run(Thread.java:844)
   [junit4]   2> 1214791 INFO  (SUITE-MBeansHandlerTest-seed#[26EEB70C8F754BA5]-worker)
[    ] o.a.s.SolrTestCaseJ4 ###deleteCore
   [junit4]   2> 1214791 INFO  (SUITE-MBeansHandlerTest-seed#[26EEB70C8F754BA5]-worker)
[    ] o.a.s.c.CoreContainer Shutting down CoreContainer instance=729306449
   [junit4]   2> 1214791 INFO  (coreCloseExecutor-6160-thread-1) [    ] o.a.s.c.SolrCore
[collection1]  CLOSING SolrCore org.apache.solr.core.SolrCore@ad53d41
   [junit4]   2> 1214829 INFO  (coreCloseExecutor-6160-thread-1) [    ] o.a.s.m.SolrMetricManager
Closing metric reporters for: solr.core.collection1
   [junit4]   2> 1214831 INFO  (SUITE-MBeansHandlerTest-seed#[26EEB70C8F754BA5]-worker)
[    ] o.a.s.m.SolrMetricManager Closing metric reporters for: solr.node
   [junit4]   2> NOTE: leaving temporary files on disk at: /home/jenkins/workspace/Lucene-Solr-6.4-Linux/solr/build/solr-core/test/J2/temp/solr.handler.admin.MBeansHandlerTest_26EEB70C8F754BA5-001
   [junit4]   2> NOTE: test params are: codec=Asserting(Lucene62): {}, docValues:{}, maxPointsInLeafNode=1708,
maxMBSortInHeap=7.4441650964755235, sim=RandomSimilarity(queryNorm=true,coord=crazy): {},
locale=el-GR, timezone=HST
   [junit4]   2> NOTE: Linux 4.4.0-53-generic amd64/Oracle Corporation 9-ea (64-bit)/cpus=12,threads=1,free=139996248,total=374341632
   [junit4]   2> NOTE: All tests run in this JVM: [BinaryUpdateRequestHandlerTest, TestHdfsBackupRestoreCore,
TestCollectionAPI, TestOverriddenPrefixQueryForCustomFieldType, TestJsonRequest, OverseerTest,
TestPostingsSolrHighlighter, TestExactStatsCache, HLLSerializationTest, TestManagedResourceStorage,
BufferStoreTest, CollectionsAPISolrJTest, TestExtendedDismaxParser, TestShardHandlerFactory,
TestClusterStateMutator, SolrTestCaseJ4Test, SuggesterWFSTTest, TestBinaryField, TestDistribDocBasedVersion,
SOLR749Test, TestSchemaManager, ShowFileRequestHandlerTest, TestRestoreCore, SpatialHeatmapFacetsTest,
SolrCloudExampleTest, HdfsChaosMonkeySafeLeaderTest, UpdateParamsTest, UnloadDistributedZkTest,
OverseerTaskQueueTest, SolrJmxReporterTest, ChangedSchemaMergeTest, TlogReplayBufferedWhileIndexingTest,
SpellPossibilityIteratorTest, TestDFRSimilarityFactory, AddBlockUpdateTest, TestFieldCacheVsDocValues,
TestHdfsCloudBackupRestore, TestTolerantSearch, DeleteInactiveReplicaTest, DistributedQueueTest,
TestNumericTerms32, EnumFieldTest, FieldAnalysisRequestHandlerTest, NoCacheHeaderTest, TestCloudDeleteByQuery,
TestXIncludeConfig, SuggesterTSTTest, TestConfigSetsAPIZkFailure, TestStressLiveNodes, SolrMetricsIntegrationTest,
TestSolrFieldCacheMBean, TestShortCircuitedRequests, TestMaxScoreQueryParser, TestGroupingSearch,
TestSchemaNameResource, SpatialRPTFieldTypeTest, TestCloudPseudoReturnFields, TestRequestStatusCollectionAPI,
TestSolrQueryParserResource, ConnectionReuseTest, TestSmileRequest, TestUseDocValuesAsStored2,
DebugComponentTest, LeaderElectionTest, TestDocBasedVersionConstraints, PrimitiveFieldTypeTest,
MetricUtilsTest, TestReversedWildcardFilterFactory, LeaderInitiatedRecoveryOnShardRestartTest,
TestManagedSynonymFilterFactory, TestSubQueryTransformerCrossCore, StatsReloadRaceTest, CheckHdfsIndexTest,
PKIAuthenticationIntegrationTest, TestInitParams, TestRecovery, SolrPluginUtilsTest, ResponseHeaderTest,
ForceLeaderTest, TestPerFieldSimilarityClassic, PluginInfoTest, RecoveryZkTest, TimeZoneUtilsTest,
BasicDistributedZk2Test, TestSolrConfigHandlerCloud, HdfsUnloadDistributedZkTest, CollectionStateFormat2Test,
DistributedQueryComponentCustomSortTest, CdcrBootstrapTest, SimpleFacetsTest, TestRebalanceLeaders,
TestGraphTermsQParserPlugin, StatelessScriptUpdateProcessorFactoryTest, DistribCursorPagingTest,
CursorMarkTest, CloneFieldUpdateProcessorFactoryTest, TestBlendedInfixSuggestions, TestSolrXml,
TestDynamicLoading, TestZkChroot, HdfsDirectoryFactoryTest, TestWriterPerf, VersionInfoTest,
CircularListTest, DocValuesMultiTest, TestCollationField, TestIndexSearcher, ShardRoutingCustomTest,
TestFaceting, TestHashPartitioner, TermVectorComponentDistributedTest, TestStressReorder,
HardAutoCommitTest, TestRangeQuery, HighlighterTest, CurrencyFieldXmlFileTest, SolrIndexSplitterTest,
SimplePostToolTest, TestCoreDiscovery, AnalysisAfterCoreReloadTest, CoreAdminHandlerTest,
SuggesterTest, TestTrie, TestCSVLoader, PolyFieldTest, SolrCoreCheckLockOnStartupTest, TestPseudoReturnFields,
FieldMutatingUpdateProcessorTest, TestAtomicUpdateErrorCases, DirectUpdateHandlerOptimizeTest,
TestSolrDeletionPolicy1, CacheHeaderTest, LukeRequestHandlerTest, StandardRequestHandlerTest,
TestQueryTypes, XmlUpdateRequestHandlerTest, DocumentBuilderTest, TestIndexingPerformance,
TestSolrQueryParser, UpdateRequestProcessorFactoryTest, MBeansHandlerTest]
   [junit4] Completed [394/680 (1!)] on J2 in 0.70s, 3 tests, 1 failure <<< FAILURES!

[...truncated 52492 lines...]


Mime
View raw message