lucene-dev mailing list archives

Site index · List index
Message view « Date » · « Thread »
Top « Date » · « Thread »
From Apache Jenkins Server <jenk...@builds.apache.org>
Subject [JENKINS] Lucene-Solr-Tests-6.4 - Build # 19 - Unstable
Date Sat, 04 Feb 2017 23:39:49 GMT
Build: https://builds.apache.org/job/Lucene-Solr-Tests-6.4/19/

2 tests failed.
FAILED:  org.apache.lucene.analysis.core.TestRandomChains.testRandomChains

Error Message:
outputEndNode=3 vs inputTo=2

Stack Trace:
java.lang.AssertionError: outputEndNode=3 vs inputTo=2
	at __randomizedtesting.SeedInfo.seed([511DD8EA19AEFC57:6CFCF18B5EBCE197]:0)
	at org.apache.lucene.analysis.synonym.FlattenGraphFilter.incrementToken(FlattenGraphFilter.java:334)
	at org.apache.lucene.analysis.ValidatingTokenFilter.incrementToken(ValidatingTokenFilter.java:67)
	at org.apache.lucene.analysis.BaseTokenStreamTestCase.checkAnalysisConsistency(BaseTokenStreamTestCase.java:723)
	at org.apache.lucene.analysis.BaseTokenStreamTestCase.checkRandomData(BaseTokenStreamTestCase.java:634)
	at org.apache.lucene.analysis.BaseTokenStreamTestCase.checkRandomData(BaseTokenStreamTestCase.java:532)
	at org.apache.lucene.analysis.core.TestRandomChains.testRandomChains(TestRandomChains.java:842)
	at sun.reflect.NativeMethodAccessorImpl.invoke0(Native Method)
	at sun.reflect.NativeMethodAccessorImpl.invoke(NativeMethodAccessorImpl.java:62)
	at sun.reflect.DelegatingMethodAccessorImpl.invoke(DelegatingMethodAccessorImpl.java:43)
	at java.lang.reflect.Method.invoke(Method.java:498)
	at com.carrotsearch.randomizedtesting.RandomizedRunner.invoke(RandomizedRunner.java:1713)
	at com.carrotsearch.randomizedtesting.RandomizedRunner$8.evaluate(RandomizedRunner.java:907)
	at com.carrotsearch.randomizedtesting.RandomizedRunner$9.evaluate(RandomizedRunner.java:943)
	at com.carrotsearch.randomizedtesting.RandomizedRunner$10.evaluate(RandomizedRunner.java:957)
	at org.apache.lucene.util.TestRuleSetupTeardownChained$1.evaluate(TestRuleSetupTeardownChained.java:49)
	at org.apache.lucene.util.AbstractBeforeAfterRule$1.evaluate(AbstractBeforeAfterRule.java:45)
	at org.apache.lucene.util.TestRuleThreadAndTestName$1.evaluate(TestRuleThreadAndTestName.java:48)
	at org.apache.lucene.util.TestRuleIgnoreAfterMaxFailures$1.evaluate(TestRuleIgnoreAfterMaxFailures.java:64)
	at org.apache.lucene.util.TestRuleMarkFailure$1.evaluate(TestRuleMarkFailure.java:47)
	at com.carrotsearch.randomizedtesting.rules.StatementAdapter.evaluate(StatementAdapter.java:36)
	at com.carrotsearch.randomizedtesting.ThreadLeakControl$StatementRunner.run(ThreadLeakControl.java:367)
	at com.carrotsearch.randomizedtesting.ThreadLeakControl.forkTimeoutingTask(ThreadLeakControl.java:811)
	at com.carrotsearch.randomizedtesting.ThreadLeakControl$3.evaluate(ThreadLeakControl.java:462)
	at com.carrotsearch.randomizedtesting.RandomizedRunner.runSingleTest(RandomizedRunner.java:916)
	at com.carrotsearch.randomizedtesting.RandomizedRunner$5.evaluate(RandomizedRunner.java:802)
	at com.carrotsearch.randomizedtesting.RandomizedRunner$6.evaluate(RandomizedRunner.java:852)
	at com.carrotsearch.randomizedtesting.RandomizedRunner$7.evaluate(RandomizedRunner.java:863)
	at org.apache.lucene.util.AbstractBeforeAfterRule$1.evaluate(AbstractBeforeAfterRule.java:45)
	at com.carrotsearch.randomizedtesting.rules.StatementAdapter.evaluate(StatementAdapter.java:36)
	at org.apache.lucene.util.TestRuleStoreClassName$1.evaluate(TestRuleStoreClassName.java:41)
	at com.carrotsearch.randomizedtesting.rules.NoShadowingOrOverridesOnMethodsRule$1.evaluate(NoShadowingOrOverridesOnMethodsRule.java:40)
	at com.carrotsearch.randomizedtesting.rules.NoShadowingOrOverridesOnMethodsRule$1.evaluate(NoShadowingOrOverridesOnMethodsRule.java:40)
	at com.carrotsearch.randomizedtesting.rules.StatementAdapter.evaluate(StatementAdapter.java:36)
	at com.carrotsearch.randomizedtesting.rules.StatementAdapter.evaluate(StatementAdapter.java:36)
	at com.carrotsearch.randomizedtesting.rules.StatementAdapter.evaluate(StatementAdapter.java:36)
	at org.apache.lucene.util.TestRuleAssertionsRequired$1.evaluate(TestRuleAssertionsRequired.java:53)
	at org.apache.lucene.util.TestRuleMarkFailure$1.evaluate(TestRuleMarkFailure.java:47)
	at org.apache.lucene.util.TestRuleIgnoreAfterMaxFailures$1.evaluate(TestRuleIgnoreAfterMaxFailures.java:64)
	at org.apache.lucene.util.TestRuleIgnoreTestSuites$1.evaluate(TestRuleIgnoreTestSuites.java:54)
	at com.carrotsearch.randomizedtesting.rules.StatementAdapter.evaluate(StatementAdapter.java:36)
	at com.carrotsearch.randomizedtesting.ThreadLeakControl$StatementRunner.run(ThreadLeakControl.java:367)
	at java.lang.Thread.run(Thread.java:745)


FAILED:  org.apache.solr.handler.admin.MBeansHandlerTest.testDiff

Error Message:
expected:<Was: [1, Now: 2], Delta: 1> but was:<Was: [4, Now: 5], Delta: 1>

Stack Trace:
org.junit.ComparisonFailure: expected:<Was: [1, Now: 2], Delta: 1> but was:<Was:
[4, Now: 5], Delta: 1>
	at __randomizedtesting.SeedInfo.seed([BA28DE596ED23330:7F3E1AC27E640B50]:0)
	at org.junit.Assert.assertEquals(Assert.java:125)
	at org.junit.Assert.assertEquals(Assert.java:147)
	at org.apache.solr.handler.admin.MBeansHandlerTest.testDiff(MBeansHandlerTest.java:63)
	at sun.reflect.NativeMethodAccessorImpl.invoke0(Native Method)
	at sun.reflect.NativeMethodAccessorImpl.invoke(NativeMethodAccessorImpl.java:62)
	at sun.reflect.DelegatingMethodAccessorImpl.invoke(DelegatingMethodAccessorImpl.java:43)
	at java.lang.reflect.Method.invoke(Method.java:498)
	at com.carrotsearch.randomizedtesting.RandomizedRunner.invoke(RandomizedRunner.java:1713)
	at com.carrotsearch.randomizedtesting.RandomizedRunner$8.evaluate(RandomizedRunner.java:907)
	at com.carrotsearch.randomizedtesting.RandomizedRunner$9.evaluate(RandomizedRunner.java:943)
	at com.carrotsearch.randomizedtesting.RandomizedRunner$10.evaluate(RandomizedRunner.java:957)
	at com.carrotsearch.randomizedtesting.rules.SystemPropertiesRestoreRule$1.evaluate(SystemPropertiesRestoreRule.java:57)
	at org.apache.lucene.util.TestRuleSetupTeardownChained$1.evaluate(TestRuleSetupTeardownChained.java:49)
	at org.apache.lucene.util.AbstractBeforeAfterRule$1.evaluate(AbstractBeforeAfterRule.java:45)
	at org.apache.lucene.util.TestRuleThreadAndTestName$1.evaluate(TestRuleThreadAndTestName.java:48)
	at org.apache.lucene.util.TestRuleIgnoreAfterMaxFailures$1.evaluate(TestRuleIgnoreAfterMaxFailures.java:64)
	at org.apache.lucene.util.TestRuleMarkFailure$1.evaluate(TestRuleMarkFailure.java:47)
	at com.carrotsearch.randomizedtesting.rules.StatementAdapter.evaluate(StatementAdapter.java:36)
	at com.carrotsearch.randomizedtesting.ThreadLeakControl$StatementRunner.run(ThreadLeakControl.java:367)
	at com.carrotsearch.randomizedtesting.ThreadLeakControl.forkTimeoutingTask(ThreadLeakControl.java:811)
	at com.carrotsearch.randomizedtesting.ThreadLeakControl$3.evaluate(ThreadLeakControl.java:462)
	at com.carrotsearch.randomizedtesting.RandomizedRunner.runSingleTest(RandomizedRunner.java:916)
	at com.carrotsearch.randomizedtesting.RandomizedRunner$5.evaluate(RandomizedRunner.java:802)
	at com.carrotsearch.randomizedtesting.RandomizedRunner$6.evaluate(RandomizedRunner.java:852)
	at com.carrotsearch.randomizedtesting.RandomizedRunner$7.evaluate(RandomizedRunner.java:863)
	at com.carrotsearch.randomizedtesting.rules.StatementAdapter.evaluate(StatementAdapter.java:36)
	at com.carrotsearch.randomizedtesting.rules.SystemPropertiesRestoreRule$1.evaluate(SystemPropertiesRestoreRule.java:57)
	at org.apache.lucene.util.AbstractBeforeAfterRule$1.evaluate(AbstractBeforeAfterRule.java:45)
	at com.carrotsearch.randomizedtesting.rules.StatementAdapter.evaluate(StatementAdapter.java:36)
	at org.apache.lucene.util.TestRuleStoreClassName$1.evaluate(TestRuleStoreClassName.java:41)
	at com.carrotsearch.randomizedtesting.rules.NoShadowingOrOverridesOnMethodsRule$1.evaluate(NoShadowingOrOverridesOnMethodsRule.java:40)
	at com.carrotsearch.randomizedtesting.rules.NoShadowingOrOverridesOnMethodsRule$1.evaluate(NoShadowingOrOverridesOnMethodsRule.java:40)
	at com.carrotsearch.randomizedtesting.rules.StatementAdapter.evaluate(StatementAdapter.java:36)
	at com.carrotsearch.randomizedtesting.rules.StatementAdapter.evaluate(StatementAdapter.java:36)
	at com.carrotsearch.randomizedtesting.rules.StatementAdapter.evaluate(StatementAdapter.java:36)
	at org.apache.lucene.util.TestRuleAssertionsRequired$1.evaluate(TestRuleAssertionsRequired.java:53)
	at org.apache.lucene.util.TestRuleMarkFailure$1.evaluate(TestRuleMarkFailure.java:47)
	at org.apache.lucene.util.TestRuleIgnoreAfterMaxFailures$1.evaluate(TestRuleIgnoreAfterMaxFailures.java:64)
	at org.apache.lucene.util.TestRuleIgnoreTestSuites$1.evaluate(TestRuleIgnoreTestSuites.java:54)
	at com.carrotsearch.randomizedtesting.rules.StatementAdapter.evaluate(StatementAdapter.java:36)
	at com.carrotsearch.randomizedtesting.ThreadLeakControl$StatementRunner.run(ThreadLeakControl.java:367)
	at java.lang.Thread.run(Thread.java:745)




Build Log:
[...truncated 2531 lines...]
   [junit4] Suite: org.apache.lucene.analysis.core.TestRandomChains
   [junit4]   2> TEST FAIL: useCharFilter=true text='\u000b \u3a59\u7d65\u3bed\uf51a\u6b4c\u042b\ud998\udf52.
ry'
   [junit4]   2> Exception from random analyzer: 
   [junit4]   2> charfilters=
   [junit4]   2>   org.apache.lucene.analysis.fa.PersianCharFilter(java.io.StringReader@ae7b9dc)
   [junit4]   2> tokenizer=
   [junit4]   2>   org.apache.lucene.analysis.MockTokenizer(org.apache.lucene.util.AttributeFactory$1@1d8081ab)
   [junit4]   2> filters=
   [junit4]   2>   org.apache.lucene.analysis.miscellaneous.TrimFilter(ValidatingTokenFilter@8b428dd
term=,bytes=[],startOffset=0,endOffset=0,positionIncrement=1,positionLength=1,type=word)
   [junit4]   2>   org.apache.lucene.analysis.commongrams.CommonGramsQueryFilter(CommonGramsFilter@480ea94e
term=,bytes=[],startOffset=0,endOffset=0,positionIncrement=1,positionLength=1,type=word)
   [junit4]   2>   org.apache.lucene.analysis.synonym.FlattenGraphFilter(ValidatingTokenFilter@75b23c2d
term=,bytes=[],startOffset=0,endOffset=0,positionIncrement=1,positionLength=1,type=word)
   [junit4]   2> offsetsAreCorrect=false
   [junit4]   2> NOTE: reproduce with: ant test  -Dtestcase=TestRandomChains -Dtests.method=testRandomChains
-Dtests.seed=511DD8EA19AEFC57 -Dtests.multiplier=2 -Dtests.slow=true -Dtests.locale=nn-NO
-Dtests.timezone=America/Montreal -Dtests.asserts=true -Dtests.file.encoding=US-ASCII
   [junit4] FAILURE 0.78s J0 | TestRandomChains.testRandomChains <<<
   [junit4]    > Throwable #1: java.lang.AssertionError: outputEndNode=3 vs inputTo=2
   [junit4]    > 	at __randomizedtesting.SeedInfo.seed([511DD8EA19AEFC57:6CFCF18B5EBCE197]:0)
   [junit4]    > 	at org.apache.lucene.analysis.synonym.FlattenGraphFilter.incrementToken(FlattenGraphFilter.java:334)
   [junit4]    > 	at org.apache.lucene.analysis.ValidatingTokenFilter.incrementToken(ValidatingTokenFilter.java:67)
   [junit4]    > 	at org.apache.lucene.analysis.BaseTokenStreamTestCase.checkAnalysisConsistency(BaseTokenStreamTestCase.java:723)
   [junit4]    > 	at org.apache.lucene.analysis.BaseTokenStreamTestCase.checkRandomData(BaseTokenStreamTestCase.java:634)
   [junit4]    > 	at org.apache.lucene.analysis.BaseTokenStreamTestCase.checkRandomData(BaseTokenStreamTestCase.java:532)
   [junit4]    > 	at org.apache.lucene.analysis.core.TestRandomChains.testRandomChains(TestRandomChains.java:842)
   [junit4]    > 	at java.lang.Thread.run(Thread.java:745)
   [junit4]   2> NOTE: test params are: codec=Lucene62, sim=RandomSimilarity(queryNorm=false,coord=no):
{}, locale=nn-NO, timezone=America/Montreal
   [junit4]   2> NOTE: Linux 3.13.0-85-generic amd64/Oracle Corporation 1.8.0_102 (64-bit)/cpus=4,threads=1,free=257271728,total=296222720
   [junit4]   2> NOTE: All tests run in this JVM: [TestCustomAnalyzer, TestEscaped, TestRussianLightStemFilterFactory,
TestFinnishLightStemFilterFactory, TestPathHierarchyTokenizer, TestArmenianAnalyzer, TestFactories,
TestCapitalizationFilter, DateRecognizerFilterFactoryTest, TestNorwegianLightStemFilter, QueryAutoStopWordAnalyzerTest,
TestHindiNormalizer, TestStemmer, TestKeywordAnalyzer, TestGalicianMinimalStemFilter, TestPersianNormalizationFilter,
TestGalicianStemFilterFactory, TestFrenchMinimalStemFilterFactory, TestApostropheFilter, TestLimitTokenOffsetFilter,
TestCJKWidthFilter, TestIgnore, TestTurkishAnalyzer, TestHungarianAnalyzer, TestReverseStringFilter,
TestTruncateTokenFilterFactory, TestGreekLowerCaseFilterFactory, TestDecimalDigitFilter, TestTrimFilterFactory,
TestLengthFilter, TestSpanishAnalyzer, TestOnlyInCompound, TestHindiFilters, TestClassicAnalyzer,
TestPortugueseLightStemFilterFactory, TestLatvianAnalyzer, TestPortugueseLightStemFilter,
TestDependencies, TestLimitTokenPositionFilterFactory, TestCaseSensitive, TestEnglishAnalyzer,
TestGreekStemFilterFactory, TestRussianLightStemFilter, TestLithuanianAnalyzer, TestRandomChains]
   [junit4] Completed [117/275 (1!)] on J0 in 3.00s, 2 tests, 1 failure <<< FAILURES!

[...truncated 9535 lines...]
   [junit4] Suite: org.apache.solr.handler.admin.MBeansHandlerTest
   [junit4]   2> Creating dataDir: /x1/jenkins/jenkins-slave/workspace/Lucene-Solr-Tests-6.4/solr/build/solr-core/test/J2/temp/solr.handler.admin.MBeansHandlerTest_BA28DE596ED23330-001/init-core-data-001
   [junit4]   2> 1505136 INFO  (SUITE-MBeansHandlerTest-seed#[BA28DE596ED23330]-worker)
[    ] o.a.s.SolrTestCaseJ4 Randomized ssl (false) and clientAuth (false) via: @org.apache.solr.util.RandomizeSSL(reason=,
ssl=NaN, value=NaN, clientAuth=NaN)
   [junit4]   2> 1505137 INFO  (SUITE-MBeansHandlerTest-seed#[BA28DE596ED23330]-worker)
[    ] o.a.s.SolrTestCaseJ4 ####initCore
   [junit4]   2> 1505137 INFO  (SUITE-MBeansHandlerTest-seed#[BA28DE596ED23330]-worker)
[    ] o.a.s.c.SolrResourceLoader [null] Added 2 libs to classloader, from paths: [/x1/jenkins/jenkins-slave/workspace/Lucene-Solr-Tests-6.4/solr/core/src/test-files/solr/collection1/lib,
/x1/jenkins/jenkins-slave/workspace/Lucene-Solr-Tests-6.4/solr/core/src/test-files/solr/collection1/lib/classes]
   [junit4]   2> 1505190 INFO  (SUITE-MBeansHandlerTest-seed#[BA28DE596ED23330]-worker)
[    ] o.a.s.c.SolrConfig Using Lucene MatchVersion: 6.4.1
   [junit4]   2> 1505218 INFO  (SUITE-MBeansHandlerTest-seed#[BA28DE596ED23330]-worker)
[    ] o.a.s.s.IndexSchema [null] Schema name=test
   [junit4]   2> 1505316 WARN  (SUITE-MBeansHandlerTest-seed#[BA28DE596ED23330]-worker)
[    ] o.a.s.s.IndexSchema [null] default search field in schema is text. WARNING: Deprecated,
please use 'df' on request instead.
   [junit4]   2> 1505319 INFO  (SUITE-MBeansHandlerTest-seed#[BA28DE596ED23330]-worker)
[    ] o.a.s.s.IndexSchema Loaded schema test/1.0 with uniqueid field id
   [junit4]   2> 1505326 INFO  (SUITE-MBeansHandlerTest-seed#[BA28DE596ED23330]-worker)
[    ] o.a.s.u.UpdateShardHandler Creating UpdateShardHandler HTTP client with params: socketTimeout=30000&connTimeout=30000&retry=true
   [junit4]   2> 1505328 WARN  (SUITE-MBeansHandlerTest-seed#[BA28DE596ED23330]-worker)
[    ] o.a.s.m.r.SolrJmxReporter No serviceUrl or agentId was configured, using first MBeanServer.
   [junit4]   2> 1505330 INFO  (SUITE-MBeansHandlerTest-seed#[BA28DE596ED23330]-worker)
[    ] o.a.s.m.r.SolrJmxReporter JMX monitoring enabled at server: com.sun.jmx.mbeanserver.JmxMBeanServer@191a21f
   [junit4]   2> 1505330 WARN  (SUITE-MBeansHandlerTest-seed#[BA28DE596ED23330]-worker)
[    ] o.a.s.m.r.SolrJmxReporter No serviceUrl or agentId was configured, using first MBeanServer.
   [junit4]   2> 1505335 INFO  (SUITE-MBeansHandlerTest-seed#[BA28DE596ED23330]-worker)
[    ] o.a.s.m.r.SolrJmxReporter JMX monitoring enabled at server: com.sun.jmx.mbeanserver.JmxMBeanServer@191a21f
   [junit4]   2> 1505335 WARN  (SUITE-MBeansHandlerTest-seed#[BA28DE596ED23330]-worker)
[    ] o.a.s.m.r.SolrJmxReporter No serviceUrl or agentId was configured, using first MBeanServer.
   [junit4]   2> 1505335 INFO  (SUITE-MBeansHandlerTest-seed#[BA28DE596ED23330]-worker)
[    ] o.a.s.m.r.SolrJmxReporter JMX monitoring enabled at server: com.sun.jmx.mbeanserver.JmxMBeanServer@191a21f
   [junit4]   2> 1505337 INFO  (coreLoadExecutor-5893-thread-1) [    x:collection1] o.a.s.c.SolrResourceLoader
[null] Added 2 libs to classloader, from paths: [/x1/jenkins/jenkins-slave/workspace/Lucene-Solr-Tests-6.4/solr/core/src/test-files/solr/collection1/lib,
/x1/jenkins/jenkins-slave/workspace/Lucene-Solr-Tests-6.4/solr/core/src/test-files/solr/collection1/lib/classes]
   [junit4]   2> 1505365 INFO  (coreLoadExecutor-5893-thread-1) [    x:collection1] o.a.s.c.SolrConfig
Using Lucene MatchVersion: 6.4.1
   [junit4]   2> 1505396 INFO  (coreLoadExecutor-5893-thread-1) [    x:collection1] o.a.s.s.IndexSchema
[collection1] Schema name=test
   [junit4]   2> 1505495 WARN  (coreLoadExecutor-5893-thread-1) [    x:collection1] o.a.s.s.IndexSchema
[collection1] default search field in schema is text. WARNING: Deprecated, please use 'df'
on request instead.
   [junit4]   2> 1505498 INFO  (coreLoadExecutor-5893-thread-1) [    x:collection1] o.a.s.s.IndexSchema
Loaded schema test/1.0 with uniqueid field id
   [junit4]   2> 1505506 INFO  (coreLoadExecutor-5893-thread-1) [    x:collection1] o.a.s.c.CoreContainer
Creating SolrCore 'collection1' using configuration from instancedir /x1/jenkins/jenkins-slave/workspace/Lucene-Solr-Tests-6.4/solr/core/src/test-files/solr/collection1
   [junit4]   2> 1505506 WARN  (coreLoadExecutor-5893-thread-1) [    x:collection1] o.a.s.m.r.SolrJmxReporter
No serviceUrl or agentId was configured, using first MBeanServer.
   [junit4]   2> 1505506 INFO  (coreLoadExecutor-5893-thread-1) [    x:collection1] o.a.s.m.r.SolrJmxReporter
JMX monitoring enabled at server: com.sun.jmx.mbeanserver.JmxMBeanServer@191a21f
   [junit4]   2> 1505507 INFO  (coreLoadExecutor-5893-thread-1) [    x:collection1] o.a.s.c.SolrCore
[[collection1] ] Opening new SolrCore at [/x1/jenkins/jenkins-slave/workspace/Lucene-Solr-Tests-6.4/solr/core/src/test-files/solr/collection1],
dataDir=[/x1/jenkins/jenkins-slave/workspace/Lucene-Solr-Tests-6.4/solr/build/solr-core/test/J2/temp/solr.handler.admin.MBeansHandlerTest_BA28DE596ED23330-001/init-core-data-001/]
   [junit4]   2> 1505507 INFO  (coreLoadExecutor-5893-thread-1) [    x:collection1] o.a.s.c.JmxMonitoredMap
JMX monitoring is enabled. Adding Solr mbeans to JMX Server: com.sun.jmx.mbeanserver.JmxMBeanServer@191a21f
   [junit4]   2> 1505508 INFO  (coreLoadExecutor-5893-thread-1) [    x:collection1] o.a.s.u.RandomMergePolicy
RandomMergePolicy wrapping class org.apache.lucene.index.TieredMergePolicy: [TieredMergePolicy:
maxMergeAtOnce=14, maxMergeAtOnceExplicit=36, maxMergedSegmentMB=97.9501953125, floorSegmentMB=0.91796875,
forceMergeDeletesPctAllowed=26.780336645664264, segmentsPerTier=29.0, maxCFSSegmentSizeMB=8.796093022207999E12,
noCFSRatio=0.19585619971305174
   [junit4]   2> 1505544 INFO  (coreLoadExecutor-5893-thread-1) [    x:collection1] o.a.s.u.UpdateHandler
Using UpdateLog implementation: org.apache.solr.update.UpdateLog
   [junit4]   2> 1505544 INFO  (coreLoadExecutor-5893-thread-1) [    x:collection1] o.a.s.u.UpdateLog
Initializing UpdateLog: dataDir= defaultSyncLevel=FLUSH numRecordsToKeep=100 maxNumLogsToKeep=10
numVersionBuckets=65536
   [junit4]   2> 1505546 INFO  (coreLoadExecutor-5893-thread-1) [    x:collection1] o.a.s.u.CommitTracker
Hard AutoCommit: disabled
   [junit4]   2> 1505546 INFO  (coreLoadExecutor-5893-thread-1) [    x:collection1] o.a.s.u.CommitTracker
Soft AutoCommit: disabled
   [junit4]   2> 1505546 INFO  (coreLoadExecutor-5893-thread-1) [    x:collection1] o.a.s.u.RandomMergePolicy
RandomMergePolicy wrapping class org.apache.lucene.index.TieredMergePolicy: [TieredMergePolicy:
maxMergeAtOnce=37, maxMergeAtOnceExplicit=48, maxMergedSegmentMB=41.69921875, floorSegmentMB=0.365234375,
forceMergeDeletesPctAllowed=24.401147947467912, segmentsPerTier=36.0, maxCFSSegmentSizeMB=8.796093022207999E12,
noCFSRatio=0.23267016721922698
   [junit4]   2> 1505547 INFO  (coreLoadExecutor-5893-thread-1) [    x:collection1] o.a.s.s.SolrIndexSearcher
Opening [Searcher@6fd2ac14[collection1] main]
   [junit4]   2> 1505547 INFO  (coreLoadExecutor-5893-thread-1) [    x:collection1] o.a.s.h.c.SpellCheckComponent
Initializing spell checkers
   [junit4]   2> 1505554 INFO  (coreLoadExecutor-5893-thread-1) [    x:collection1] o.a.s.s.DirectSolrSpellChecker
init: {name=direct,classname=DirectSolrSpellChecker,field=lowerfilt,minQueryLength=3}
   [junit4]   2> 1505583 INFO  (coreLoadExecutor-5893-thread-1) [    x:collection1] o.a.s.h.ReplicationHandler
Commits will be reserved for  10000
   [junit4]   2> 1505583 INFO  (searcherExecutor-5894-thread-1-processing-x:collection1)
[    x:collection1] o.a.s.h.c.SpellCheckComponent Loading spell index for spellchecker: default
   [junit4]   2> 1505583 INFO  (searcherExecutor-5894-thread-1-processing-x:collection1)
[    x:collection1] o.a.s.h.c.SpellCheckComponent Loading spell index for spellchecker: direct
   [junit4]   2> 1505583 INFO  (searcherExecutor-5894-thread-1-processing-x:collection1)
[    x:collection1] o.a.s.h.c.SpellCheckComponent Loading spell index for spellchecker: wordbreak
   [junit4]   2> 1505583 INFO  (searcherExecutor-5894-thread-1-processing-x:collection1)
[    x:collection1] o.a.s.h.c.SpellCheckComponent Loading spell index for spellchecker: multipleFields
   [junit4]   2> 1505584 INFO  (searcherExecutor-5894-thread-1-processing-x:collection1)
[    x:collection1] o.a.s.h.c.SpellCheckComponent Loading spell index for spellchecker: jarowinkler
   [junit4]   2> 1505584 INFO  (searcherExecutor-5894-thread-1-processing-x:collection1)
[    x:collection1] o.a.s.h.c.SpellCheckComponent Loading spell index for spellchecker: external
   [junit4]   2> 1505584 INFO  (searcherExecutor-5894-thread-1-processing-x:collection1)
[    x:collection1] o.a.s.h.c.SpellCheckComponent Loading spell index for spellchecker: freq
   [junit4]   2> 1505585 INFO  (searcherExecutor-5894-thread-1-processing-x:collection1)
[    x:collection1] o.a.s.h.c.SpellCheckComponent Loading spell index for spellchecker: fqcn
   [junit4]   2> 1505585 INFO  (searcherExecutor-5894-thread-1-processing-x:collection1)
[    x:collection1] o.a.s.h.c.SpellCheckComponent Loading spell index for spellchecker: perDict
   [junit4]   2> 1505586 INFO  (searcherExecutor-5894-thread-1-processing-x:collection1)
[    x:collection1] o.a.s.c.SolrCore [collection1] Registered new searcher Searcher@6fd2ac14[collection1]
main{ExitableDirectoryReader(UninvertingDirectoryReader())}
   [junit4]   2> 1505587 INFO  (coreLoadExecutor-5893-thread-1) [    x:collection1] o.a.s.u.UpdateLog
Could not find max version in index or recent updates, using new clock 1558445070773911552
   [junit4]   2> 1505589 INFO  (SUITE-MBeansHandlerTest-seed#[BA28DE596ED23330]-worker)
[    ] o.a.s.SolrTestCaseJ4 ####initCore end
   [junit4]   2> 1505592 INFO  (TEST-MBeansHandlerTest.testBackCompatNames-seed#[BA28DE596ED23330])
[    ] o.a.s.SolrTestCaseJ4 ###Starting testBackCompatNames
   [junit4]   2> 1505593 INFO  (TEST-MBeansHandlerTest.testBackCompatNames-seed#[BA28DE596ED23330])
[    ] o.a.s.c.S.Request [collection1]  webapp=null path=null params={qt=/admin/mbeans&wt=xml}
status=0 QTime=1
   [junit4]   2> 1505601 INFO  (TEST-MBeansHandlerTest.testBackCompatNames-seed#[BA28DE596ED23330])
[    ] o.a.s.c.S.Request [collection1]  webapp=null path=null params={qt=/admin/mbeans&cat=QUERYHANDLER&wt=xml}
status=0 QTime=0
   [junit4]   2> 1505602 INFO  (TEST-MBeansHandlerTest.testBackCompatNames-seed#[BA28DE596ED23330])
[    ] o.a.s.c.S.Request [collection1]  webapp=null path=null params={qt=/admin/mbeans&cat=UPDATE&wt=xml}
status=0 QTime=0
   [junit4]   2> 1505602 INFO  (TEST-MBeansHandlerTest.testBackCompatNames-seed#[BA28DE596ED23330])
[    ] o.a.s.SolrTestCaseJ4 ###Ending testBackCompatNames
   [junit4]   2> 1505605 INFO  (TEST-MBeansHandlerTest.testXMLDiffWithExternalEntity-seed#[BA28DE596ED23330])
[    ] o.a.s.SolrTestCaseJ4 ###Starting testXMLDiffWithExternalEntity
   [junit4]   2> 1505652 INFO  (TEST-MBeansHandlerTest.testXMLDiffWithExternalEntity-seed#[BA28DE596ED23330])
[    ] o.a.s.SolrTestCaseJ4 ###Ending testXMLDiffWithExternalEntity
   [junit4]   2> 1505655 INFO  (TEST-MBeansHandlerTest.testDiff-seed#[BA28DE596ED23330])
[    ] o.a.s.SolrTestCaseJ4 ###Starting testDiff
   [junit4]   2> 1505657 INFO  (TEST-MBeansHandlerTest.testDiff-seed#[BA28DE596ED23330])
[    ] o.a.s.c.S.Request [collection1]  webapp=null path=null params={qt=/admin/mbeans&stats=true&wt=xml}
status=0 QTime=1
   [junit4]   2> 1505715 INFO  (TEST-MBeansHandlerTest.testDiff-seed#[BA28DE596ED23330])
[    ] o.a.s.c.S.Request [collection1]  webapp=null path=null params={qt=/admin/mbeans&stats=true&diff=true&wt=xml}
status=0 QTime=56
   [junit4]   2> 1505721 INFO  (TEST-MBeansHandlerTest.testDiff-seed#[BA28DE596ED23330])
[    ] o.a.s.SolrTestCaseJ4 ###Ending testDiff
   [junit4]   2> NOTE: reproduce with: ant test  -Dtestcase=MBeansHandlerTest -Dtests.method=testDiff
-Dtests.seed=BA28DE596ED23330 -Dtests.multiplier=2 -Dtests.slow=true -Dtests.locale=es-ES
-Dtests.timezone=Australia/Lord_Howe -Dtests.asserts=true -Dtests.file.encoding=UTF-8
   [junit4] FAILURE 0.07s J2 | MBeansHandlerTest.testDiff <<<
   [junit4]    > Throwable #1: org.junit.ComparisonFailure: expected:<Was: [1, Now:
2], Delta: 1> but was:<Was: [4, Now: 5], Delta: 1>
   [junit4]    > 	at __randomizedtesting.SeedInfo.seed([BA28DE596ED23330:7F3E1AC27E640B50]:0)
   [junit4]    > 	at org.apache.solr.handler.admin.MBeansHandlerTest.testDiff(MBeansHandlerTest.java:63)
   [junit4]    > 	at java.lang.Thread.run(Thread.java:745)
   [junit4]   2> 1505725 INFO  (SUITE-MBeansHandlerTest-seed#[BA28DE596ED23330]-worker)
[    ] o.a.s.SolrTestCaseJ4 ###deleteCore
   [junit4]   2> 1505725 INFO  (SUITE-MBeansHandlerTest-seed#[BA28DE596ED23330]-worker)
[    ] o.a.s.c.CoreContainer Shutting down CoreContainer instance=1798384335
   [junit4]   2> 1505725 INFO  (coreCloseExecutor-5899-thread-1) [    x:collection1] o.a.s.c.SolrCore
[collection1]  CLOSING SolrCore org.apache.solr.core.SolrCore@4112e9cb
   [junit4]   2> 1505754 INFO  (coreCloseExecutor-5899-thread-1) [    x:collection1] o.a.s.m.SolrMetricManager
Closing metric reporters for: solr.core.collection1
   [junit4]   2> 1505757 INFO  (SUITE-MBeansHandlerTest-seed#[BA28DE596ED23330]-worker)
[    ] o.a.s.m.SolrMetricManager Closing metric reporters for: solr.node
   [junit4]   2> NOTE: leaving temporary files on disk at: /x1/jenkins/jenkins-slave/workspace/Lucene-Solr-Tests-6.4/solr/build/solr-core/test/J2/temp/solr.handler.admin.MBeansHandlerTest_BA28DE596ED23330-001
   [junit4]   2> NOTE: test params are: codec=DummyCompressingStoredFields(storedFieldsFormat=CompressingStoredFieldsFormat(compressionMode=DUMMY,
chunkSize=21176, maxDocsPerChunk=770, blockSize=10), termVectorsFormat=CompressingTermVectorsFormat(compressionMode=DUMMY,
chunkSize=21176, blockSize=10)), sim=RandomSimilarity(queryNorm=false,coord=no): {}, locale=es-ES,
timezone=Australia/Lord_Howe
   [junit4]   2> NOTE: Linux 3.13.0-85-generic amd64/Oracle Corporation 1.8.0_102 (64-bit)/cpus=4,threads=1,free=57962696,total=530579456
   [junit4]   2> NOTE: All tests run in this JVM: [TestFieldCacheSanityChecker, LeaderElectionTest,
TestLMJelinekMercerSimilarityFactory, HdfsBasicDistributedZk2Test, ConnectionManagerTest,
ConnectionReuseTest, NoCacheHeaderTest, HdfsDirectoryFactoryTest, TestFieldCacheVsDocValues,
LeaderInitiatedRecoveryOnShardRestartTest, TemplateUpdateProcessorTest, SuggesterTSTTest,
CollectionsAPISolrJTest, QueryParsingTest, TestConfig, DebugComponentTest, SolrTestCaseJ4Test,
TestReversedWildcardFilterFactory, TestStressLiveNodes, SolrPluginUtilsTest, DistributedQueryComponentCustomSortTest,
CoreSorterTest, TestRequestStatusCollectionAPI, DistributedFacetExistsSmallTest, TestLeaderInitiatedRecoveryThread,
AssignTest, FieldMutatingUpdateProcessorTest, TestUseDocValuesAsStored2, TestGroupingSearch,
TestSolrDeletionPolicy1, TestSubQueryTransformerCrossCore, TestManagedResourceStorage, TestSolrFieldCacheMBean,
CheckHdfsIndexTest, TestGraphTermsQParserPlugin, DataDrivenBlockJoinTest, TestIndexSearcher,
TestShortCircuitedRequests, DirectUpdateHandlerTest, TestHdfsBackupRestoreCore, RecoveryZkTest,
TestLFUCache, TestMacros, TestPerFieldSimilarityClassic, FacetPivotSmallTest, TestSort, MetricsHandlerTest,
TestGeoJSONResponseWriter, TestRestoreCore, DocValuesMultiTest, CircularListTest, BlockJoinFacetDistribTest,
OverseerTest, SolrCoreMetricManagerTest, TestManagedSchema, TestPushWriter, RequestHandlersTest,
CursorMarkTest, TestShardHandlerFactory, TestImpersonationWithHadoopAuth, TestWriterPerf,
HdfsUnloadDistributedZkTest, TestDocTermOrds, TestClusterStateMutator, TestSolrCloudWithKerberosAlt,
TestJsonRequest, TestZkChroot, TestCoreDiscovery, UnloadDistributedZkTest, TestBinaryResponseWriter,
SharedFSAutoReplicaFailoverUtilsTest, TestExactStatsCache, TermVectorComponentDistributedTest,
BasicDistributedZk2Test, TestJmxMonitoredMap, SimpleFacetsTest, TestCustomSort, TestSmileRequest,
RemoteQueryErrorTest, TestTrackingShardHandlerFactory, SpatialHeatmapFacetsTest, TestSolrConfigHandlerCloud,
BitVectorTest, TestClassicSimilarityFactory, TestMergePolicyConfig, TestSchemaNameResource,
TestDistributedStatsComponentCardinality, TestReloadDeadlock, ClassificationUpdateProcessorFactoryTest,
FieldAnalysisRequestHandlerTest, RequestLoggingTest, TestStressReorder, TestHdfsCloudBackupRestore,
TestSolrJ, CoreAdminHandlerTest, TestOrdValues, TestCollapseQParserPlugin, TestMiniSolrCloudCluster,
TestJsonFacetRefinement, CoreAdminRequestStatusTest, BufferStoreTest, TestOnReconnectListenerSupport,
ParsingFieldUpdateProcessorsTest, TestSolrQueryResponse, TestMaxScoreQueryParser, OverseerTaskQueueTest,
TestCloudPseudoReturnFields, TestSchemaVersionResource, AutoCommitTest, BasicZkTest, FullSolrCloudDistribCmdsTest,
TestRandomFaceting, TestRecovery, TestReload, TestStressVersions, HardAutoCommitTest, TestRangeQuery,
TestStressLucene, SuggesterWFSTTest, WordBreakSolrSpellCheckerTest, SolrCoreCheckLockOnStartupTest,
DirectUpdateHandlerOptimizeTest, StatelessScriptUpdateProcessorFactoryTest, DisMaxRequestHandlerTest,
TestQueryTypes, FileBasedSpellCheckerTest, DocumentBuilderTest, TermVectorComponentTest, MoreLikeThisHandlerTest,
TestSolrQueryParser, IndexSchemaRuntimeFieldTest, TestCollationField, MBeansHandlerTest]
   [junit4] Completed [391/680 (1!)] on J2 in 0.66s, 3 tests, 1 failure <<< FAILURES!

[...truncated 63344 lines...]



Mime
View raw message