lucene-dev mailing list archives

Site index · List index
Message view « Date » · « Thread »
Top « Date » · « Thread »
From Apache Jenkins Server <jenk...@builds.apache.org>
Subject [JENKINS] Lucene-Solr-Tests-6.x - Build # 686 - Unstable
Date Thu, 19 Jan 2017 10:30:34 GMT
Build: https://builds.apache.org/job/Lucene-Solr-Tests-6.x/686/

1 tests failed.
FAILED:  org.apache.lucene.codecs.lucene60.TestLucene60PointsFormat.testEstimatePointCount2Dims

Error Message:
expected:<46> but was:<92>

Stack Trace:
java.lang.AssertionError: expected:<46> but was:<92>
	at __randomizedtesting.SeedInfo.seed([C44FC0F993BFAC58:38A049B3E3FBCBC0]:0)
	at org.junit.Assert.fail(Assert.java:93)
	at org.junit.Assert.failNotEquals(Assert.java:647)
	at org.junit.Assert.assertEquals(Assert.java:128)
	at org.junit.Assert.assertEquals(Assert.java:472)
	at org.junit.Assert.assertEquals(Assert.java:456)
	at org.apache.lucene.codecs.lucene60.TestLucene60PointsFormat.testEstimatePointCount2Dims(TestLucene60PointsFormat.java:256)
	at sun.reflect.NativeMethodAccessorImpl.invoke0(Native Method)
	at sun.reflect.NativeMethodAccessorImpl.invoke(NativeMethodAccessorImpl.java:62)
	at sun.reflect.DelegatingMethodAccessorImpl.invoke(DelegatingMethodAccessorImpl.java:43)
	at java.lang.reflect.Method.invoke(Method.java:498)
	at com.carrotsearch.randomizedtesting.RandomizedRunner.invoke(RandomizedRunner.java:1713)
	at com.carrotsearch.randomizedtesting.RandomizedRunner$8.evaluate(RandomizedRunner.java:907)
	at com.carrotsearch.randomizedtesting.RandomizedRunner$9.evaluate(RandomizedRunner.java:943)
	at com.carrotsearch.randomizedtesting.RandomizedRunner$10.evaluate(RandomizedRunner.java:957)
	at org.apache.lucene.util.TestRuleSetupTeardownChained$1.evaluate(TestRuleSetupTeardownChained.java:49)
	at org.apache.lucene.util.AbstractBeforeAfterRule$1.evaluate(AbstractBeforeAfterRule.java:45)
	at org.apache.lucene.util.TestRuleThreadAndTestName$1.evaluate(TestRuleThreadAndTestName.java:48)
	at org.apache.lucene.util.TestRuleIgnoreAfterMaxFailures$1.evaluate(TestRuleIgnoreAfterMaxFailures.java:64)
	at org.apache.lucene.util.TestRuleMarkFailure$1.evaluate(TestRuleMarkFailure.java:47)
	at com.carrotsearch.randomizedtesting.rules.StatementAdapter.evaluate(StatementAdapter.java:36)
	at com.carrotsearch.randomizedtesting.ThreadLeakControl$StatementRunner.run(ThreadLeakControl.java:367)
	at com.carrotsearch.randomizedtesting.ThreadLeakControl.forkTimeoutingTask(ThreadLeakControl.java:811)
	at com.carrotsearch.randomizedtesting.ThreadLeakControl$3.evaluate(ThreadLeakControl.java:462)
	at com.carrotsearch.randomizedtesting.RandomizedRunner.runSingleTest(RandomizedRunner.java:916)
	at com.carrotsearch.randomizedtesting.RandomizedRunner$5.evaluate(RandomizedRunner.java:802)
	at com.carrotsearch.randomizedtesting.RandomizedRunner$6.evaluate(RandomizedRunner.java:852)
	at com.carrotsearch.randomizedtesting.RandomizedRunner$7.evaluate(RandomizedRunner.java:863)
	at org.apache.lucene.util.AbstractBeforeAfterRule$1.evaluate(AbstractBeforeAfterRule.java:45)
	at com.carrotsearch.randomizedtesting.rules.StatementAdapter.evaluate(StatementAdapter.java:36)
	at org.apache.lucene.util.TestRuleStoreClassName$1.evaluate(TestRuleStoreClassName.java:41)
	at com.carrotsearch.randomizedtesting.rules.NoShadowingOrOverridesOnMethodsRule$1.evaluate(NoShadowingOrOverridesOnMethodsRule.java:40)
	at com.carrotsearch.randomizedtesting.rules.NoShadowingOrOverridesOnMethodsRule$1.evaluate(NoShadowingOrOverridesOnMethodsRule.java:40)
	at com.carrotsearch.randomizedtesting.rules.StatementAdapter.evaluate(StatementAdapter.java:36)
	at com.carrotsearch.randomizedtesting.rules.StatementAdapter.evaluate(StatementAdapter.java:36)
	at com.carrotsearch.randomizedtesting.rules.StatementAdapter.evaluate(StatementAdapter.java:36)
	at org.apache.lucene.util.TestRuleAssertionsRequired$1.evaluate(TestRuleAssertionsRequired.java:53)
	at org.apache.lucene.util.TestRuleMarkFailure$1.evaluate(TestRuleMarkFailure.java:47)
	at org.apache.lucene.util.TestRuleIgnoreAfterMaxFailures$1.evaluate(TestRuleIgnoreAfterMaxFailures.java:64)
	at org.apache.lucene.util.TestRuleIgnoreTestSuites$1.evaluate(TestRuleIgnoreTestSuites.java:54)
	at com.carrotsearch.randomizedtesting.rules.StatementAdapter.evaluate(StatementAdapter.java:36)
	at com.carrotsearch.randomizedtesting.ThreadLeakControl$StatementRunner.run(ThreadLeakControl.java:367)
	at java.lang.Thread.run(Thread.java:745)




Build Log:
[...truncated 910 lines...]
   [junit4] Suite: org.apache.lucene.codecs.lucene60.TestLucene60PointsFormat
   [junit4] IGNOR/A 0.09s J1 | TestLucene60PointsFormat.testMergeStability
   [junit4]    > Assumption #1: TODO: mess with the parameters and test gets angry!
   [junit4]   2> NOTE: reproduce with: ant test  -Dtestcase=TestLucene60PointsFormat -Dtests.method=testEstimatePointCount2Dims
-Dtests.seed=C44FC0F993BFAC58 -Dtests.multiplier=2 -Dtests.slow=true -Dtests.locale=ar-KW
-Dtests.timezone=America/El_Salvador -Dtests.asserts=true -Dtests.file.encoding=UTF-8
   [junit4] FAILURE 1.14s J1 | TestLucene60PointsFormat.testEstimatePointCount2Dims <<<
   [junit4]    > Throwable #1: java.lang.AssertionError: expected:<46> but was:<92>
   [junit4]    > 	at __randomizedtesting.SeedInfo.seed([C44FC0F993BFAC58:38A049B3E3FBCBC0]:0)
   [junit4]    > 	at org.apache.lucene.codecs.lucene60.TestLucene60PointsFormat.testEstimatePointCount2Dims(TestLucene60PointsFormat.java:256)
   [junit4]    > 	at java.lang.Thread.run(Thread.java:745)
   [junit4] IGNOR/A 0.00s J1 | TestLucene60PointsFormat.testRandomBinaryBig
   [junit4]    > Assumption #1: 'nightly' test group is disabled (@Nightly())
   [junit4]   2> NOTE: leaving temporary files on disk at: /x1/jenkins/jenkins-slave/workspace/Lucene-Solr-Tests-6.x/lucene/build/core/test/J1/temp/lucene.codecs.lucene60.TestLucene60PointsFormat_C44FC0F993BFAC58-001
   [junit4]   2> NOTE: test params are: codec=Lucene62, sim=RandomSimilarity(queryNorm=false,coord=no):
{}, locale=ar-KW, timezone=America/El_Salvador
   [junit4]   2> NOTE: Linux 3.13.0-85-generic amd64/Oracle Corporation 1.8.0_102 (64-bit)/cpus=4,threads=1,free=84647304,total=187695104
   [junit4]   2> NOTE: All tests run in this JVM: [TestIndexWriterFromReader, TestTerm,
TestLongBitSet, TestBoolean2ScorerSupplier, TestFieldReuse, TestInfoStream, TestTermsEnum,
TestNRTReaderWithThreads, TestBytesRef, TestSearchAfter, TestMultiThreadTermVectors, TestLucene60FieldInfoFormat,
TestTermVectorsReader, TestIndexWriterOutOfFileDescriptors, TestWildcard, TestOmitNorms, TestDuelingCodecs,
TestDocValuesIndexing, TestMixedDocValuesUpdates, TestMultiCollector, TestIndexWriterLockRelease,
TestIndexWriterCommit, TestIndexSorting, TestDeterminism, TestUnicodeUtil, TestSizeBoundedForceMerge,
TestPerFieldDocValuesFormat, TestNeverDelete, TestDocIdSetBuilder, TestSortedSetDocValues,
TestFrequencyTrackingRingBuffer, TestGrowableByteArrayDataOutput, FiniteStringsIteratorTest,
TestNGramPhraseQuery, TestTermScorer, TestArrayUtil, TestIndexWriterOnDiskFull, TestMaxPosition,
TestSpanNotQuery, TestBinaryDocument, TestExternalCodecs, TestMergeSchedulerExternal, TestBinaryTerms,
Test4GBStoredFields, TestSubScorerFreqs, TestReqExclBulkScorer, TestReusableStringReader,
TestDuelingCodecsAtNight, TestStressNRT, TestPagedBytes, TestSortRandom, TestOmitPositions,
TestConstantScoreQuery, TestTrackingDirectoryWrapper, TestNewestSegment, TestBlockPostingsFormat3,
TestIntroSelector, TestTransactionRollback, TestBytesRefAttImpl, TestGraphQuery, TestForTooMuchCloning,
TestSimilarityProvider, TestLucene60PointsFormat]
   [junit4] Completed [211/449 (1!)] on J1 in 8.24s, 20 tests, 1 failure, 2 skipped <<<
FAILURES!

[...truncated 74576 lines...]



Mime
View raw message