lucene-dev mailing list archives

Site index · List index
Message view « Date » · « Thread »
Top « Date » · « Thread »
From Policeman Jenkins Server <jenk...@thetaphi.de>
Subject [JENKINS-EA] Lucene-Solr-master-Linux (64bit/jdk-9-ea+153) - Build # 18859 - Unstable!
Date Fri, 27 Jan 2017 23:46:40 GMT
Build: https://jenkins.thetaphi.de/job/Lucene-Solr-master-Linux/18859/
Java: 64bit/jdk-9-ea+153 -XX:+UseCompressedOops -XX:+UseG1GC

2 tests failed.
FAILED:  org.apache.solr.cloud.PeerSyncReplicationTest.test

Error Message:
timeout waiting to see all nodes active

Stack Trace:
java.lang.AssertionError: timeout waiting to see all nodes active
	at __randomizedtesting.SeedInfo.seed([D034F5D8C42E161F:5860CA026AD27BE7]:0)
	at org.junit.Assert.fail(Assert.java:93)
	at org.apache.solr.cloud.PeerSyncReplicationTest.waitTillNodesActive(PeerSyncReplicationTest.java:326)
	at org.apache.solr.cloud.PeerSyncReplicationTest.bringUpDeadNodeAndEnsureNoReplication(PeerSyncReplicationTest.java:277)
	at org.apache.solr.cloud.PeerSyncReplicationTest.forceNodeFailureAndDoPeerSync(PeerSyncReplicationTest.java:259)
	at org.apache.solr.cloud.PeerSyncReplicationTest.test(PeerSyncReplicationTest.java:138)
	at java.base/jdk.internal.reflect.NativeMethodAccessorImpl.invoke0(Native Method)
	at java.base/jdk.internal.reflect.NativeMethodAccessorImpl.invoke(NativeMethodAccessorImpl.java:62)
	at java.base/jdk.internal.reflect.DelegatingMethodAccessorImpl.invoke(DelegatingMethodAccessorImpl.java:43)
	at java.base/java.lang.reflect.Method.invoke(Method.java:543)
	at com.carrotsearch.randomizedtesting.RandomizedRunner.invoke(RandomizedRunner.java:1713)
	at com.carrotsearch.randomizedtesting.RandomizedRunner$8.evaluate(RandomizedRunner.java:907)
	at com.carrotsearch.randomizedtesting.RandomizedRunner$9.evaluate(RandomizedRunner.java:943)
	at com.carrotsearch.randomizedtesting.RandomizedRunner$10.evaluate(RandomizedRunner.java:957)
	at org.apache.solr.BaseDistributedSearchTestCase$ShardsRepeatRule$ShardsFixedStatement.callStatement(BaseDistributedSearchTestCase.java:985)
	at org.apache.solr.BaseDistributedSearchTestCase$ShardsRepeatRule$ShardsStatement.evaluate(BaseDistributedSearchTestCase.java:960)
	at com.carrotsearch.randomizedtesting.rules.SystemPropertiesRestoreRule$1.evaluate(SystemPropertiesRestoreRule.java:57)
	at org.apache.lucene.util.TestRuleSetupTeardownChained$1.evaluate(TestRuleSetupTeardownChained.java:49)
	at org.apache.lucene.util.AbstractBeforeAfterRule$1.evaluate(AbstractBeforeAfterRule.java:45)
	at org.apache.lucene.util.TestRuleThreadAndTestName$1.evaluate(TestRuleThreadAndTestName.java:48)
	at org.apache.lucene.util.TestRuleIgnoreAfterMaxFailures$1.evaluate(TestRuleIgnoreAfterMaxFailures.java:64)
	at org.apache.lucene.util.TestRuleMarkFailure$1.evaluate(TestRuleMarkFailure.java:47)
	at com.carrotsearch.randomizedtesting.rules.StatementAdapter.evaluate(StatementAdapter.java:36)
	at com.carrotsearch.randomizedtesting.ThreadLeakControl$StatementRunner.run(ThreadLeakControl.java:368)
	at com.carrotsearch.randomizedtesting.ThreadLeakControl.forkTimeoutingTask(ThreadLeakControl.java:817)
	at com.carrotsearch.randomizedtesting.ThreadLeakControl$3.evaluate(ThreadLeakControl.java:468)
	at com.carrotsearch.randomizedtesting.RandomizedRunner.runSingleTest(RandomizedRunner.java:916)
	at com.carrotsearch.randomizedtesting.RandomizedRunner$5.evaluate(RandomizedRunner.java:802)
	at com.carrotsearch.randomizedtesting.RandomizedRunner$6.evaluate(RandomizedRunner.java:852)
	at com.carrotsearch.randomizedtesting.RandomizedRunner$7.evaluate(RandomizedRunner.java:863)
	at com.carrotsearch.randomizedtesting.rules.StatementAdapter.evaluate(StatementAdapter.java:36)
	at com.carrotsearch.randomizedtesting.rules.SystemPropertiesRestoreRule$1.evaluate(SystemPropertiesRestoreRule.java:57)
	at org.apache.lucene.util.AbstractBeforeAfterRule$1.evaluate(AbstractBeforeAfterRule.java:45)
	at com.carrotsearch.randomizedtesting.rules.StatementAdapter.evaluate(StatementAdapter.java:36)
	at org.apache.lucene.util.TestRuleStoreClassName$1.evaluate(TestRuleStoreClassName.java:41)
	at com.carrotsearch.randomizedtesting.rules.NoShadowingOrOverridesOnMethodsRule$1.evaluate(NoShadowingOrOverridesOnMethodsRule.java:40)
	at com.carrotsearch.randomizedtesting.rules.NoShadowingOrOverridesOnMethodsRule$1.evaluate(NoShadowingOrOverridesOnMethodsRule.java:40)
	at com.carrotsearch.randomizedtesting.rules.StatementAdapter.evaluate(StatementAdapter.java:36)
	at com.carrotsearch.randomizedtesting.rules.StatementAdapter.evaluate(StatementAdapter.java:36)
	at org.apache.lucene.util.TestRuleAssertionsRequired$1.evaluate(TestRuleAssertionsRequired.java:53)
	at org.apache.lucene.util.TestRuleMarkFailure$1.evaluate(TestRuleMarkFailure.java:47)
	at org.apache.lucene.util.TestRuleIgnoreAfterMaxFailures$1.evaluate(TestRuleIgnoreAfterMaxFailures.java:64)
	at org.apache.lucene.util.TestRuleIgnoreTestSuites$1.evaluate(TestRuleIgnoreTestSuites.java:54)
	at com.carrotsearch.randomizedtesting.rules.StatementAdapter.evaluate(StatementAdapter.java:36)
	at com.carrotsearch.randomizedtesting.ThreadLeakControl$StatementRunner.run(ThreadLeakControl.java:368)
	at java.base/java.lang.Thread.run(Thread.java:844)


FAILED:  org.apache.solr.update.SolrIndexMetricsTest.testIndexMetrics

Error Message:


Stack Trace:
java.lang.AssertionError
	at __randomizedtesting.SeedInfo.seed([D034F5D8C42E161F:1CE4C86404A0ED24]:0)
	at org.junit.Assert.fail(Assert.java:92)
	at org.junit.Assert.assertTrue(Assert.java:43)
	at org.junit.Assert.assertTrue(Assert.java:54)
	at org.apache.solr.update.SolrIndexMetricsTest.testIndexMetrics(SolrIndexMetricsTest.java:66)
	at java.base/jdk.internal.reflect.NativeMethodAccessorImpl.invoke0(Native Method)
	at java.base/jdk.internal.reflect.NativeMethodAccessorImpl.invoke(NativeMethodAccessorImpl.java:62)
	at java.base/jdk.internal.reflect.DelegatingMethodAccessorImpl.invoke(DelegatingMethodAccessorImpl.java:43)
	at java.base/java.lang.reflect.Method.invoke(Method.java:543)
	at com.carrotsearch.randomizedtesting.RandomizedRunner.invoke(RandomizedRunner.java:1713)
	at com.carrotsearch.randomizedtesting.RandomizedRunner$8.evaluate(RandomizedRunner.java:907)
	at com.carrotsearch.randomizedtesting.RandomizedRunner$9.evaluate(RandomizedRunner.java:943)
	at com.carrotsearch.randomizedtesting.RandomizedRunner$10.evaluate(RandomizedRunner.java:957)
	at com.carrotsearch.randomizedtesting.rules.SystemPropertiesRestoreRule$1.evaluate(SystemPropertiesRestoreRule.java:57)
	at org.apache.lucene.util.TestRuleSetupTeardownChained$1.evaluate(TestRuleSetupTeardownChained.java:49)
	at org.apache.lucene.util.AbstractBeforeAfterRule$1.evaluate(AbstractBeforeAfterRule.java:45)
	at org.apache.lucene.util.TestRuleThreadAndTestName$1.evaluate(TestRuleThreadAndTestName.java:48)
	at org.apache.lucene.util.TestRuleIgnoreAfterMaxFailures$1.evaluate(TestRuleIgnoreAfterMaxFailures.java:64)
	at org.apache.lucene.util.TestRuleMarkFailure$1.evaluate(TestRuleMarkFailure.java:47)
	at com.carrotsearch.randomizedtesting.rules.StatementAdapter.evaluate(StatementAdapter.java:36)
	at com.carrotsearch.randomizedtesting.ThreadLeakControl$StatementRunner.run(ThreadLeakControl.java:368)
	at com.carrotsearch.randomizedtesting.ThreadLeakControl.forkTimeoutingTask(ThreadLeakControl.java:817)
	at com.carrotsearch.randomizedtesting.ThreadLeakControl$3.evaluate(ThreadLeakControl.java:468)
	at com.carrotsearch.randomizedtesting.RandomizedRunner.runSingleTest(RandomizedRunner.java:916)
	at com.carrotsearch.randomizedtesting.RandomizedRunner$5.evaluate(RandomizedRunner.java:802)
	at com.carrotsearch.randomizedtesting.RandomizedRunner$6.evaluate(RandomizedRunner.java:852)
	at com.carrotsearch.randomizedtesting.RandomizedRunner$7.evaluate(RandomizedRunner.java:863)
	at com.carrotsearch.randomizedtesting.rules.StatementAdapter.evaluate(StatementAdapter.java:36)
	at com.carrotsearch.randomizedtesting.rules.SystemPropertiesRestoreRule$1.evaluate(SystemPropertiesRestoreRule.java:57)
	at org.apache.lucene.util.AbstractBeforeAfterRule$1.evaluate(AbstractBeforeAfterRule.java:45)
	at com.carrotsearch.randomizedtesting.rules.StatementAdapter.evaluate(StatementAdapter.java:36)
	at org.apache.lucene.util.TestRuleStoreClassName$1.evaluate(TestRuleStoreClassName.java:41)
	at com.carrotsearch.randomizedtesting.rules.NoShadowingOrOverridesOnMethodsRule$1.evaluate(NoShadowingOrOverridesOnMethodsRule.java:40)
	at com.carrotsearch.randomizedtesting.rules.NoShadowingOrOverridesOnMethodsRule$1.evaluate(NoShadowingOrOverridesOnMethodsRule.java:40)
	at com.carrotsearch.randomizedtesting.rules.StatementAdapter.evaluate(StatementAdapter.java:36)
	at com.carrotsearch.randomizedtesting.rules.StatementAdapter.evaluate(StatementAdapter.java:36)
	at org.apache.lucene.util.TestRuleAssertionsRequired$1.evaluate(TestRuleAssertionsRequired.java:53)
	at org.apache.lucene.util.TestRuleMarkFailure$1.evaluate(TestRuleMarkFailure.java:47)
	at org.apache.lucene.util.TestRuleIgnoreAfterMaxFailures$1.evaluate(TestRuleIgnoreAfterMaxFailures.java:64)
	at org.apache.lucene.util.TestRuleIgnoreTestSuites$1.evaluate(TestRuleIgnoreTestSuites.java:54)
	at com.carrotsearch.randomizedtesting.rules.StatementAdapter.evaluate(StatementAdapter.java:36)
	at com.carrotsearch.randomizedtesting.ThreadLeakControl$StatementRunner.run(ThreadLeakControl.java:368)
	at java.base/java.lang.Thread.run(Thread.java:844)




Build Log:
[...truncated 10889 lines...]
   [junit4] Suite: org.apache.solr.update.SolrIndexMetricsTest
   [junit4]   2> Creating dataDir: /home/jenkins/workspace/Lucene-Solr-master-Linux/solr/build/solr-core/test/J1/temp/solr.update.SolrIndexMetricsTest_D034F5D8C42E161F-001/init-core-data-001
   [junit4]   2> 128423 INFO  (SUITE-SolrIndexMetricsTest-seed#[D034F5D8C42E161F]-worker) [    ] o.a.s.SolrTestCaseJ4 Using PointFields
   [junit4]   2> 128424 INFO  (SUITE-SolrIndexMetricsTest-seed#[D034F5D8C42E161F]-worker) [    ] o.a.s.SolrTestCaseJ4 Randomized ssl (true) and clientAuth (false) via: @org.apache.solr.util.RandomizeSSL(reason="", ssl=0.0/0.0, value=0.0/0.0, clientAuth=0.0/0.0)
   [junit4]   2> 128426 INFO  (SUITE-SolrIndexMetricsTest-seed#[D034F5D8C42E161F]-worker) [    ] o.a.s.SolrTestCaseJ4 ####initCore
   [junit4]   2> 128426 INFO  (SUITE-SolrIndexMetricsTest-seed#[D034F5D8C42E161F]-worker) [    ] o.a.s.c.SolrResourceLoader [null] Added 2 libs to classloader, from paths: [/home/jenkins/workspace/Lucene-Solr-master-Linux/solr/core/src/test-files/solr/collection1/lib, /home/jenkins/workspace/Lucene-Solr-master-Linux/solr/core/src/test-files/solr/collection1/lib/classes]
   [junit4]   2> 128470 WARN  (SUITE-SolrIndexMetricsTest-seed#[D034F5D8C42E161F]-worker) [    ] o.a.s.c.Config Beginning with Solr 5.5, <mergePolicy> is deprecated, use <mergePolicyFactory> instead.
   [junit4]   2> 128470 WARN  (SUITE-SolrIndexMetricsTest-seed#[D034F5D8C42E161F]-worker) [    ] o.a.s.c.Config Beginning with Solr 5.5, <mergeFactor> is deprecated, configure it on the relevant <mergePolicyFactory> instead.
   [junit4]   2> 128470 INFO  (SUITE-SolrIndexMetricsTest-seed#[D034F5D8C42E161F]-worker) [    ] o.a.s.c.SolrConfig Using Lucene MatchVersion: 7.0.0
   [junit4]   2> 128477 INFO  (SUITE-SolrIndexMetricsTest-seed#[D034F5D8C42E161F]-worker) [    ] o.a.s.s.IndexSchema [null] Schema name=test
   [junit4]   2> 128537 WARN  (SUITE-SolrIndexMetricsTest-seed#[D034F5D8C42E161F]-worker) [    ] o.a.s.s.IndexSchema [null] default search field in schema is text. WARNING: Deprecated, please use 'df' on request instead.
   [junit4]   2> 128539 INFO  (SUITE-SolrIndexMetricsTest-seed#[D034F5D8C42E161F]-worker) [    ] o.a.s.s.IndexSchema Loaded schema test/1.0 with uniqueid field id
   [junit4]   2> 128560 WARN  (SUITE-SolrIndexMetricsTest-seed#[D034F5D8C42E161F]-worker) [    ] o.a.s.m.r.SolrJmxReporter No serviceUrl or agentId was configured, using first MBeanServer.
   [junit4]   2> 128563 INFO  (SUITE-SolrIndexMetricsTest-seed#[D034F5D8C42E161F]-worker) [    ] o.a.s.m.r.SolrJmxReporter JMX monitoring enabled at server: com.sun.jmx.mbeanserver.JmxMBeanServer@3d2aa98
   [junit4]   2> 128564 WARN  (SUITE-SolrIndexMetricsTest-seed#[D034F5D8C42E161F]-worker) [    ] o.a.s.m.r.SolrJmxReporter No serviceUrl or agentId was configured, using first MBeanServer.
   [junit4]   2> 128570 INFO  (SUITE-SolrIndexMetricsTest-seed#[D034F5D8C42E161F]-worker) [    ] o.a.s.m.r.SolrJmxReporter JMX monitoring enabled at server: com.sun.jmx.mbeanserver.JmxMBeanServer@3d2aa98
   [junit4]   2> 128570 WARN  (SUITE-SolrIndexMetricsTest-seed#[D034F5D8C42E161F]-worker) [    ] o.a.s.m.r.SolrJmxReporter No serviceUrl or agentId was configured, using first MBeanServer.
   [junit4]   2> 128570 INFO  (SUITE-SolrIndexMetricsTest-seed#[D034F5D8C42E161F]-worker) [    ] o.a.s.m.r.SolrJmxReporter JMX monitoring enabled at server: com.sun.jmx.mbeanserver.JmxMBeanServer@3d2aa98
   [junit4]   2> 128572 INFO  (coreLoadExecutor-417-thread-1) [    ] o.a.s.c.SolrResourceLoader [null] Added 2 libs to classloader, from paths: [/home/jenkins/workspace/Lucene-Solr-master-Linux/solr/core/src/test-files/solr/collection1/lib, /home/jenkins/workspace/Lucene-Solr-master-Linux/solr/core/src/test-files/solr/collection1/lib/classes]
   [junit4]   2> 128662 WARN  (coreLoadExecutor-417-thread-1) [    ] o.a.s.c.Config Beginning with Solr 5.5, <mergePolicy> is deprecated, use <mergePolicyFactory> instead.
   [junit4]   2> 128662 WARN  (coreLoadExecutor-417-thread-1) [    ] o.a.s.c.Config Beginning with Solr 5.5, <mergeFactor> is deprecated, configure it on the relevant <mergePolicyFactory> instead.
   [junit4]   2> 128663 INFO  (coreLoadExecutor-417-thread-1) [    ] o.a.s.c.SolrConfig Using Lucene MatchVersion: 7.0.0
   [junit4]   2> 128674 INFO  (coreLoadExecutor-417-thread-1) [    ] o.a.s.s.IndexSchema [collection1] Schema name=test
   [junit4]   2> 128768 WARN  (coreLoadExecutor-417-thread-1) [    ] o.a.s.s.IndexSchema [collection1] default search field in schema is text. WARNING: Deprecated, please use 'df' on request instead.
   [junit4]   2> 128770 INFO  (coreLoadExecutor-417-thread-1) [    ] o.a.s.s.IndexSchema Loaded schema test/1.0 with uniqueid field id
   [junit4]   2> 128784 INFO  (coreLoadExecutor-417-thread-1) [    ] o.a.s.c.CoreContainer Creating SolrCore 'collection1' using configuration from instancedir /home/jenkins/workspace/Lucene-Solr-master-Linux/solr/core/src/test-files/solr/collection1
   [junit4]   2> 128784 WARN  (coreLoadExecutor-417-thread-1) [    ] o.a.s.m.r.SolrJmxReporter No serviceUrl or agentId was configured, using first MBeanServer.
   [junit4]   2> 128785 INFO  (coreLoadExecutor-417-thread-1) [    ] o.a.s.m.r.SolrJmxReporter JMX monitoring enabled at server: com.sun.jmx.mbeanserver.JmxMBeanServer@3d2aa98
   [junit4]   2> 128785 INFO  (coreLoadExecutor-417-thread-1) [    ] o.a.s.c.SolrCore [[collection1] ] Opening new SolrCore at [/home/jenkins/workspace/Lucene-Solr-master-Linux/solr/core/src/test-files/solr/collection1], dataDir=[/home/jenkins/workspace/Lucene-Solr-master-Linux/solr/build/solr-core/test/J1/temp/solr.update.SolrIndexMetricsTest_D034F5D8C42E161F-001/init-core-data-001/]
   [junit4]   2> 128800 INFO  (coreLoadExecutor-417-thread-1) [    ] o.a.s.u.CommitTracker Hard AutoCommit: disabled
   [junit4]   2> 128800 INFO  (coreLoadExecutor-417-thread-1) [    ] o.a.s.u.CommitTracker Soft AutoCommit: disabled
   [junit4]   2> 128802 INFO  (coreLoadExecutor-417-thread-1) [    ] o.a.s.s.SolrIndexSearcher Opening [Searcher@3ba53b05[collection1] main]
   [junit4]   2> 128803 WARN  (coreLoadExecutor-417-thread-1) [    ] o.a.s.r.ManagedResourceStorage Cannot write to config directory /home/jenkins/workspace/Lucene-Solr-master-Linux/solr/core/src/test-files/solr/collection1/conf; switching to use InMemory storage instead.
   [junit4]   2> 128803 INFO  (coreLoadExecutor-417-thread-1) [    ] o.a.s.h.ReplicationHandler Commits will be reserved for  10000
   [junit4]   2> 128803 INFO  (searcherExecutor-418-thread-1) [    ] o.a.s.c.SolrCore [collection1] Registered new searcher Searcher@3ba53b05[collection1] main{ExitableDirectoryReader(UninvertingDirectoryReader())}
   [junit4]   2> 128804 INFO  (SUITE-SolrIndexMetricsTest-seed#[D034F5D8C42E161F]-worker) [    ] o.a.s.SolrTestCaseJ4 ####initCore end
   [junit4]   2> 128805 INFO  (TEST-SolrIndexMetricsTest.testIndexMetrics-seed#[D034F5D8C42E161F]) [    ] o.a.s.SolrTestCaseJ4 ###Starting testIndexMetrics
   [junit4]   2> 130383 INFO  (TEST-SolrIndexMetricsTest.testIndexMetrics-seed#[D034F5D8C42E161F]) [    ] o.a.s.u.DirectUpdateHandler2 start commit{,optimize=false,openSearcher=true,waitSearcher=true,expungeDeletes=false,softCommit=false,prepareCommit=false}
   [junit4]   2> 130383 INFO  (TEST-SolrIndexMetricsTest.testIndexMetrics-seed#[D034F5D8C42E161F]) [    ] o.a.s.u.SolrIndexWriter Calling setCommitData with IW:org.apache.solr.update.SolrIndexWriter@2fcfd22
   [junit4]   2> 130712 INFO  (TEST-SolrIndexMetricsTest.testIndexMetrics-seed#[D034F5D8C42E161F]) [    ] o.a.s.s.SolrIndexSearcher Opening [Searcher@3add7ebe[collection1] main]
   [junit4]   2> 130712 INFO  (TEST-SolrIndexMetricsTest.testIndexMetrics-seed#[D034F5D8C42E161F]) [    ] o.a.s.u.DirectUpdateHandler2 end_commit_flush
   [junit4]   2> 130712 INFO  (searcherExecutor-418-thread-1) [    ] o.a.s.c.SolrCore [collection1] Registered new searcher Searcher@3add7ebe[collection1] main{ExitableDirectoryReader(UninvertingDirectoryReader(Uninverting(_4(7.0.0):C300) Uninverting(_3(7.0.0):C100) Uninverting(_5(7.0.0):C100) Uninverting(_6(7.0.0):C100) Uninverting(_7(7.0.0):C100) Uninverting(_9(7.0.0):C100) Uninverting(_a(7.0.0):C100) Uninverting(_b(7.0.0):C100)))}
   [junit4]   2> 130714 INFO  (TEST-SolrIndexMetricsTest.testIndexMetrics-seed#[D034F5D8C42E161F]) [    ] o.a.s.c.SolrResourceLoader [null] Added 2 libs to classloader, from paths: [/home/jenkins/workspace/Lucene-Solr-master-Linux/solr/core/src/test-files/solr/collection1/lib, /home/jenkins/workspace/Lucene-Solr-master-Linux/solr/core/src/test-files/solr/collection1/lib/classes]
   [junit4]   2> 130791 WARN  (TEST-SolrIndexMetricsTest.testIndexMetrics-seed#[D034F5D8C42E161F]) [    ] o.a.s.c.Config Beginning with Solr 5.5, <mergePolicy> is deprecated, use <mergePolicyFactory> instead.
   [junit4]   2> 130791 WARN  (TEST-SolrIndexMetricsTest.testIndexMetrics-seed#[D034F5D8C42E161F]) [    ] o.a.s.c.Config Beginning with Solr 5.5, <mergeFactor> is deprecated, configure it on the relevant <mergePolicyFactory> instead.
   [junit4]   2> 130791 INFO  (TEST-SolrIndexMetricsTest.testIndexMetrics-seed#[D034F5D8C42E161F]) [    ] o.a.s.c.SolrConfig Using Lucene MatchVersion: 7.0.0
   [junit4]   2> 130802 INFO  (TEST-SolrIndexMetricsTest.testIndexMetrics-seed#[D034F5D8C42E161F]) [    ] o.a.s.s.IndexSchema [collection1] Schema name=test
   [junit4]   2> 130904 WARN  (TEST-SolrIndexMetricsTest.testIndexMetrics-seed#[D034F5D8C42E161F]) [    ] o.a.s.s.IndexSchema [collection1] default search field in schema is text. WARNING: Deprecated, please use 'df' on request instead.
   [junit4]   2> 130907 INFO  (TEST-SolrIndexMetricsTest.testIndexMetrics-seed#[D034F5D8C42E161F]) [    ] o.a.s.s.IndexSchema Loaded schema test/1.0 with uniqueid field id
   [junit4]   2> 130933 INFO  (TEST-SolrIndexMetricsTest.testIndexMetrics-seed#[D034F5D8C42E161F]) [    ] o.a.s.c.CoreContainer Reloading SolrCore 'collection1' using configuration from instancedir /home/jenkins/workspace/Lucene-Solr-master-Linux/solr/core/src/test-files/solr/collection1
   [junit4]   2> 130934 WARN  (TEST-SolrIndexMetricsTest.testIndexMetrics-seed#[D034F5D8C42E161F]) [    ] o.a.s.m.r.SolrJmxReporter No serviceUrl or agentId was configured, using first MBeanServer.
   [junit4]   2> 130947 INFO  (TEST-SolrIndexMetricsTest.testIndexMetrics-seed#[D034F5D8C42E161F]) [    ] o.a.s.m.r.SolrJmxReporter JMX monitoring enabled at server: com.sun.jmx.mbeanserver.JmxMBeanServer@3d2aa98
   [junit4]   2> 130947 INFO  (TEST-SolrIndexMetricsTest.testIndexMetrics-seed#[D034F5D8C42E161F]) [    ] o.a.s.m.SolrMetricManager Replacing existing reporter 'default' in registry 'solr.core.collection1': [org.apache.solr.metrics.reporters.SolrJmxReporter@58eccc19: domain = solr.core.collection1, service url = null, agent id = null]
   [junit4]   2> 130951 INFO  (TEST-SolrIndexMetricsTest.testIndexMetrics-seed#[D034F5D8C42E161F]) [    ] o.a.s.c.SolrCore [[collection1] ] Opening new SolrCore at [/home/jenkins/workspace/Lucene-Solr-master-Linux/solr/core/src/test-files/solr/collection1], dataDir=[/home/jenkins/workspace/Lucene-Solr-master-Linux/solr/build/solr-core/test/J1/temp/solr.update.SolrIndexMetricsTest_D034F5D8C42E161F-001/init-core-data-001/]
   [junit4]   2> 130964 INFO  (TEST-SolrIndexMetricsTest.testIndexMetrics-seed#[D034F5D8C42E161F]) [    ] o.a.s.u.CommitTracker Hard AutoCommit: disabled
   [junit4]   2> 130964 INFO  (TEST-SolrIndexMetricsTest.testIndexMetrics-seed#[D034F5D8C42E161F]) [    ] o.a.s.u.CommitTracker Soft AutoCommit: disabled
   [junit4]   2> 130970 INFO  (TEST-SolrIndexMetricsTest.testIndexMetrics-seed#[D034F5D8C42E161F]) [    ] o.a.s.s.SolrIndexSearcher Opening [Searcher@12fb71c2[collection1] main]
   [junit4]   2> 130971 WARN  (TEST-SolrIndexMetricsTest.testIndexMetrics-seed#[D034F5D8C42E161F]) [    ] o.a.s.r.ManagedResourceStorage Cannot write to config directory /home/jenkins/workspace/Lucene-Solr-master-Linux/solr/core/src/test-files/solr/collection1/conf; switching to use InMemory storage instead.
   [junit4]   2> 130971 INFO  (TEST-SolrIndexMetricsTest.testIndexMetrics-seed#[D034F5D8C42E161F]) [    ] o.a.s.h.ReplicationHandler Commits will be reserved for  10000
   [junit4]   2> 130971 INFO  (searcherExecutor-422-thread-1) [    ] o.a.s.c.SolrCore [collection1] Registered new searcher Searcher@12fb71c2[collection1] main{ExitableDirectoryReader(UninvertingDirectoryReader(Uninverting(_4(7.0.0):C300) Uninverting(_8(7.0.0):C300) Uninverting(_7(7.0.0):C100) Uninverting(_9(7.0.0):C100) Uninverting(_a(7.0.0):C100) Uninverting(_b(7.0.0):C100)))}
   [junit4]   2> 132125 INFO  (TEST-SolrIndexMetricsTest.testIndexMetrics-seed#[D034F5D8C42E161F]) [    ] o.a.s.u.DefaultSolrCoreState New IndexWriter is ready to be used.
   [junit4]   2> 132640 INFO  (TEST-SolrIndexMetricsTest.testIndexMetrics-seed#[D034F5D8C42E161F]) [    ] o.a.s.s.SolrIndexSearcher Opening [Searcher@57a51e21[collection1] main]
   [junit4]   2> 132641 INFO  (TEST-SolrIndexMetricsTest.testIndexMetrics-seed#[D034F5D8C42E161F]) [    ] o.a.s.c.SolrCore [collection1]  CLOSING SolrCore org.apache.solr.core.SolrCore@195bc82c
   [junit4]   2> 132641 INFO  (searcherExecutor-422-thread-1) [    ] o.a.s.c.SolrCore [collection1] Registered new searcher Searcher@57a51e21[collection1] main{ExitableDirectoryReader(UninvertingDirectoryReader(Uninverting(_d(7.0.0):C700) Uninverting(_c(7.0.0):C300)))}
   [junit4]   2> 132641 INFO  (TEST-SolrIndexMetricsTest.testIndexMetrics-seed#[D034F5D8C42E161F]) [    ] o.a.s.m.SolrMetricManager Closing metric reporters for: solr.core.collection1
   [junit4]   2> 132643 INFO  (TEST-SolrIndexMetricsTest.testIndexMetrics-seed#[D034F5D8C42E161F]) [    ] o.a.s.SolrTestCaseJ4 ###Ending testIndexMetrics
   [junit4]   2> NOTE: reproduce with: ant test  -Dtestcase=SolrIndexMetricsTest -Dtests.method=testIndexMetrics -Dtests.seed=D034F5D8C42E161F -Dtests.multiplier=3 -Dtests.slow=true -Dtests.locale=fr-RE -Dtests.timezone=Etc/GMT-2 -Dtests.asserts=true -Dtests.file.encoding=UTF-8
   [junit4] FAILURE 3.84s J1 | SolrIndexMetricsTest.testIndexMetrics <<<
   [junit4]    > Throwable #1: java.lang.AssertionError
   [junit4]    > 	at __randomizedtesting.SeedInfo.seed([D034F5D8C42E161F:1CE4C86404A0ED24]:0)
   [junit4]    > 	at org.apache.solr.update.SolrIndexMetricsTest.testIndexMetrics(SolrIndexMetricsTest.java:66)
   [junit4]    > 	at java.base/jdk.internal.reflect.NativeMethodAccessorImpl.invoke0(Native Method)
   [junit4]    > 	at java.base/jdk.internal.reflect.NativeMethodAccessorImpl.invoke(NativeMethodAccessorImpl.java:62)
   [junit4]    > 	at java.base/jdk.internal.reflect.DelegatingMethodAccessorImpl.invoke(DelegatingMethodAccessorImpl.java:43)
   [junit4]    > 	at java.base/java.lang.reflect.Method.invoke(Method.java:543)
   [junit4]    > 	at java.base/java.lang.Thread.run(Thread.java:844)
   [junit4]   2> 132644 INFO  (SUITE-SolrIndexMetricsTest-seed#[D034F5D8C42E161F]-worker) [    ] o.a.s.SolrTestCaseJ4 ###deleteCore
   [junit4]   2> 132644 INFO  (SUITE-SolrIndexMetricsTest-seed#[D034F5D8C42E161F]-worker) [    ] o.a.s.c.CoreContainer Shutting down CoreContainer instance=561975719
   [junit4]   2> 132644 INFO  (coreCloseExecutor-426-thread-1) [    ] o.a.s.c.SolrCore [collection1]  CLOSING SolrCore org.apache.solr.core.SolrCore@70ef3a74
   [junit4]   2> 132645 INFO  (coreCloseExecutor-426-thread-1) [    ] o.a.s.m.SolrMetricManager Closing metric reporters for: solr.core.collection1
   [junit4]   2> 132645 INFO  (SUITE-SolrIndexMetricsTest-seed#[D034F5D8C42E161F]-worker) [    ] o.a.s.m.SolrMetricManager Closing metric reporters for: solr.node
   [junit4]   2> NOTE: leaving temporary files on disk at: /home/jenkins/workspace/Lucene-Solr-master-Linux/solr/build/solr-core/test/J1/temp/solr.update.SolrIndexMetricsTest_D034F5D8C42E161F-001
   [junit4]   2> NOTE: test params are: codec=SimpleText, sim=RandomSimilarity(queryNorm=true): {}, locale=fr-RE, timezone=Etc/GMT-2
   [junit4]   2> NOTE: Linux 4.4.0-53-generic amd64/Oracle Corporation 9-ea (64-bit)/cpus=12,threads=1,free=376499248,total=526385152
   [junit4]   2> NOTE: All tests run in this JVM: [CoreSorterTest, IndexSchemaRuntimeFieldTest, TestSerializedLuceneMatchVersion, TestGraphMLResponseWriter, DistributedFacetExistsSmallTest, TestUninvertingReader, TestLegacyFieldCache, CollectionsAPIAsyncDistributedZkTest, IgnoreCommitOptimizeUpdateProcessorFactoryTest, TestConfigSets, BasicFunctionalityTest, SpellCheckCollatorTest, TestUnifiedSolrHighlighter, TestFieldCacheSortRandom, DistribJoinFromCollectionTest, TestSSLRandomization, TestMinMaxOnMultiValuedField, SolrIndexMetricsTest]
   [junit4] Completed [43/684 (1!)] on J1 in 4.25s, 1 test, 1 failure <<< FAILURES!

[...truncated 536 lines...]
   [junit4] Suite: org.apache.solr.cloud.PeerSyncReplicationTest
   [junit4]   2> Creating dataDir: /home/jenkins/workspace/Lucene-Solr-master-Linux/solr/build/solr-core/test/J1/temp/solr.cloud.PeerSyncReplicationTest_D034F5D8C42E161F-001/init-core-data-001
   [junit4]   2> 566126 INFO  (SUITE-PeerSyncReplicationTest-seed#[D034F5D8C42E161F]-worker) [    ] o.a.s.SolrTestCaseJ4 Using TrieFields
   [junit4]   2> 566128 INFO  (SUITE-PeerSyncReplicationTest-seed#[D034F5D8C42E161F]-worker) [    ] o.a.s.SolrTestCaseJ4 Randomized ssl (true) and clientAuth (false) via: @org.apache.solr.util.RandomizeSSL(reason="", ssl=0.0/0.0, value=0.0/0.0, clientAuth=0.0/0.0)
   [junit4]   2> 566129 INFO  (SUITE-PeerSyncReplicationTest-seed#[D034F5D8C42E161F]-worker) [    ] o.a.s.BaseDistributedSearchTestCase Setting hostContext system property: /s/
   [junit4]   2> 566131 INFO  (TEST-PeerSyncReplicationTest.test-seed#[D034F5D8C42E161F]) [    ] o.a.s.c.ZkTestServer STARTING ZK TEST SERVER
   [junit4]   2> 566132 INFO  (Thread-1014) [    ] o.a.s.c.ZkTestServer client port:0.0.0.0/0.0.0.0:0
   [junit4]   2> 566132 INFO  (Thread-1014) [    ] o.a.s.c.ZkTestServer Starting server
   [junit4]   2> 566232 INFO  (TEST-PeerSyncReplicationTest.test-seed#[D034F5D8C42E161F]) [    ] o.a.s.c.ZkTestServer start zk server on port:43176
   [junit4]   2> 566238 INFO  (TEST-PeerSyncReplicationTest.test-seed#[D034F5D8C42E161F]) [    ] o.a.s.c.AbstractZkTestCase put /home/jenkins/workspace/Lucene-Solr-master-Linux/solr/core/src/test-files/solr/collection1/conf/solrconfig-tlog.xml to /configs/conf1/solrconfig.xml
   [junit4]   2> 566240 INFO  (TEST-PeerSyncReplicationTest.test-seed#[D034F5D8C42E161F]) [    ] o.a.s.c.AbstractZkTestCase put /home/jenkins/workspace/Lucene-Solr-master-Linux/solr/core/src/test-files/solr/collection1/conf/schema.xml to /configs/conf1/schema.xml
   [junit4]   2> 566242 INFO  (TEST-PeerSyncReplicationTest.test-seed#[D034F5D8C42E161F]) [    ] o.a.s.c.AbstractZkTestCase put /home/jenkins/workspace/Lucene-Solr-master-Linux/solr/core/src/test-files/solr/collection1/conf/solrconfig.snippet.randomindexconfig.xml to /configs/conf1/solrconfig.snippet.randomindexconfig.xml
   [junit4]   2> 566253 INFO  (TEST-PeerSyncReplicationTest.test-seed#[D034F5D8C42E161F]) [    ] o.a.s.c.AbstractZkTestCase put /home/jenkins/workspace/Lucene-Solr-master-Linux/solr/core/src/test-files/solr/collection1/conf/stopwords.txt to /configs/conf1/stopwords.txt
   [junit4]   2> 566263 INFO  (TEST-PeerSyncReplicationTest.test-seed#[D034F5D8C42E161F]) [    ] o.a.s.c.AbstractZkTestCase put /home/jenkins/workspace/Lucene-Solr-master-Linux/solr/core/src/test-files/solr/collection1/conf/protwords.txt to /configs/conf1/protwords.txt
   [junit4]   2> 566265 INFO  (TEST-PeerSyncReplicationTest.test-seed#[D034F5D8C42E161F]) [    ] o.a.s.c.AbstractZkTestCase put /home/jenkins/workspace/Lucene-Solr-master-Linux/solr/core/src/test-files/solr/collection1/conf/currency.xml to /configs/conf1/currency.xml
   [junit4]   2> 566268 INFO  (TEST-PeerSyncReplicationTest.test-seed#[D034F5D8C42E161F]) [    ] o.a.s.c.AbstractZkTestCase put /home/jenkins/workspace/Lucene-Solr-master-Linux/solr/core/src/test-files/solr/collection1/conf/enumsConfig.xml to /configs/conf1/enumsConfig.xml
   [junit4]   2> 566270 INFO  (TEST-PeerSyncReplicationTest.test-seed#[D034F5D8C42E161F]) [    ] o.a.s.c.AbstractZkTestCase put /home/jenkins/workspace/Lucene-Solr-master-Linux/solr/core/src/test-files/solr/collection1/conf/open-exchange-rates.json to /configs/conf1/open-exchange-rates.json
   [junit4]   2> 566271 INFO  (TEST-PeerSyncReplicationTest.test-seed#[D034F5D8C42E161F]) [    ] o.a.s.c.AbstractZkTestCase put /home/jenkins/workspace/Lucene-Solr-master-Linux/solr/core/src/test-files/solr/collection1/conf/mapping-ISOLatin1Accent.txt to /configs/conf1/mapping-ISOLatin1Accent.txt
   [junit4]   2> 566273 INFO  (TEST-PeerSyncReplicationTest.test-seed#[D034F5D8C42E161F]) [    ] o.a.s.c.AbstractZkTestCase put /home/jenkins/workspace/Lucene-Solr-master-Linux/solr/core/src/test-files/solr/collection1/conf/old_synonyms.txt to /configs/conf1/old_synonyms.txt
   [junit4]   2> 566282 INFO  (TEST-PeerSyncReplicationTest.test-seed#[D034F5D8C42E161F]) [    ] o.a.s.c.AbstractZkTestCase put /home/jenkins/workspace/Lucene-Solr-master-Linux/solr/core/src/test-files/solr/collection1/conf/synonyms.txt to /configs/conf1/synonyms.txt
   [junit4]   2> 566910 INFO  (TEST-PeerSyncReplicationTest.test-seed#[D034F5D8C42E161F]) [    ] o.a.s.SolrTestCaseJ4 Writing core.properties file to /home/jenkins/workspace/Lucene-Solr-master-Linux/solr/build/solr-core/test/J1/temp/solr.cloud.PeerSyncReplicationTest_D034F5D8C42E161F-001/control-001/cores/collection1
   [junit4]   2> 566913 INFO  (TEST-PeerSyncReplicationTest.test-seed#[D034F5D8C42E161F]) [    ] o.e.j.s.Server jetty-9.3.14.v20161028
   [junit4]   2> 566914 INFO  (TEST-PeerSyncReplicationTest.test-seed#[D034F5D8C42E161F]) [    ] o.e.j.s.h.ContextHandler Started o.e.j.s.ServletContextHandler@68cb6cd0{/s,null,AVAILABLE}
   [junit4]   2> 566916 INFO  (TEST-PeerSyncReplicationTest.test-seed#[D034F5D8C42E161F]) [    ] o.e.j.s.AbstractConnector Started ServerConnector@37752ff9{SSL,[ssl, http/1.1]}{127.0.0.1:37199}
   [junit4]   2> 566916 INFO  (TEST-PeerSyncReplicationTest.test-seed#[D034F5D8C42E161F]) [    ] o.e.j.s.Server Started @569138ms
   [junit4]   2> 566916 INFO  (TEST-PeerSyncReplicationTest.test-seed#[D034F5D8C42E161F]) [    ] o.a.s.c.s.e.JettySolrRunner Jetty properties: {hostContext=/s, solr.data.dir=/home/jenkins/workspace/Lucene-Solr-master-Linux/solr/build/solr-core/test/J1/temp/solr.cloud.PeerSyncReplicationTest_D034F5D8C42E161F-001/tempDir-001/control/data, hostPort=37199, coreRootDirectory=/home/jenkins/workspace/Lucene-Solr-master-Linux/solr/build/solr-core/test/J1/temp/solr.cloud.PeerSyncReplicationTest_D034F5D8C42E161F-001/control-001/cores}
   [junit4]   2> 566917 ERROR (TEST-PeerSyncReplicationTest.test-seed#[D034F5D8C42E161F]) [    ] o.a.s.s.StartupLoggingUtils Missing Java Option solr.log.dir. Logging may be missing or incomplete.
   [junit4]   2> 566917 INFO  (TEST-PeerSyncReplicationTest.test-seed#[D034F5D8C42E161F]) [    ] o.a.s.s.SolrDispatchFilter  ___      _       Welcome to Apache Solr™ version 7.0.0
   [junit4]   2> 566917 INFO  (TEST-PeerSyncReplicationTest.test-seed#[D034F5D8C42E161F]) [    ] o.a.s.s.SolrDispatchFilter / __| ___| |_ _   Starting in cloud mode on port null
   [junit4]   2> 566917 INFO  (TEST-PeerSyncReplicationTest.test-seed#[D034F5D8C42E161F]) [    ] o.a.s.s.SolrDispatchFilter \__ \/ _ \ | '_|  Install dir: null
   [junit4]   2> 566917 INFO  (TEST-PeerSyncReplicationTest.test-seed#[D034F5D8C42E161F]) [    ] o.a.s.s.SolrDispatchFilter |___/\___/_|_|    Start time: 2017-01-27T23:08:33.191648Z
   [junit4]   2> 566925 INFO  (TEST-PeerSyncReplicationTest.test-seed#[D034F5D8C42E161F]) [    ] o.a.s.s.SolrDispatchFilter Loading solr.xml from SolrHome (not found in ZooKeeper)
   [junit4]   2> 566925 INFO  (TEST-PeerSyncReplicationTest.test-seed#[D034F5D8C42E161F]) [    ] o.a.s.c.SolrXmlConfig Loading container configuration from /home/jenkins/workspace/Lucene-Solr-master-Linux/solr/build/solr-core/test/J1/temp/solr.cloud.PeerSyncReplicationTest_D034F5D8C42E161F-001/control-001/solr.xml
   [junit4]   2> 566932 INFO  (TEST-PeerSyncReplicationTest.test-seed#[D034F5D8C42E161F]) [    ] o.a.s.c.ZkContainer Zookeeper client=127.0.0.1:43176/solr
   [junit4]   2> 566948 INFO  (TEST-PeerSyncReplicationTest.test-seed#[D034F5D8C42E161F]) [    ] o.a.s.c.OverseerElectionContext I am going to be the leader 127.0.0.1:37199_s
   [junit4]   2> 566949 INFO  (TEST-PeerSyncReplicationTest.test-seed#[D034F5D8C42E161F]) [    ] o.a.s.c.Overseer Overseer (id=97357562669301765-127.0.0.1:37199_s-n_0000000000) starting
   [junit4]   2> 566952 INFO  (TEST-PeerSyncReplicationTest.test-seed#[D034F5D8C42E161F]) [    ] o.a.s.c.ZkController Register node as live in ZooKeeper:/live_nodes/127.0.0.1:37199_s
   [junit4]   2> 566952 INFO  (OverseerStateUpdate-97357562669301765-127.0.0.1:37199_s-n_0000000000) [    ] o.a.s.c.c.ZkStateReader Updated live nodes from ZooKeeper... (0) -> (1)
   [junit4]   2> 567301 INFO  (TEST-PeerSyncReplicationTest.test-seed#[D034F5D8C42E161F]) [    ] o.a.s.c.CorePropertiesLocator Found 1 core definitions underneath /home/jenkins/workspace/Lucene-Solr-master-Linux/solr/build/solr-core/test/J1/temp/solr.cloud.PeerSyncReplicationTest_D034F5D8C42E161F-001/control-001/cores
   [junit4]   2> 567302 INFO  (TEST-PeerSyncReplicationTest.test-seed#[D034F5D8C42E161F]) [    ] o.a.s.c.CorePropertiesLocator Cores are: [collection1]
   [junit4]   2> 567306 INFO  (OverseerStateUpdate-97357562669301765-127.0.0.1:37199_s-n_0000000000) [    ] o.a.s.c.o.ReplicaMutator Assigning new node to shard shard=shard1
   [junit4]   2> 568319 INFO  (coreLoadExecutor-2709-thread-1) [    ] o.a.s.c.SolrConfig Using Lucene MatchVersion: 7.0.0
   [junit4]   2> 568334 INFO  (coreLoadExecutor-2709-thread-1) [    ] o.a.s.s.IndexSchema [collection1] Schema name=test
   [junit4]   2> 568475 WARN  (coreLoadExecutor-2709-thread-1) [    ] o.a.s.s.IndexSchema [collection1] default search field in schema is text. WARNING: Deprecated, please use 'df' on request instead.
   [junit4]   2> 568477 INFO  (coreLoadExecutor-2709-thread-1) [    ] o.a.s.s.IndexSchema Loaded schema test/1.0 with uniqueid field id
   [junit4]   2> 568484 INFO  (coreLoadExecutor-2709-thread-1) [    ] o.a.s.c.CoreContainer Creating SolrCore 'collection1' using configuration from collection control_collection
   [junit4]   2> 568485 INFO  (coreLoadExecutor-2709-thread-1) [    ] o.a.s.c.SolrCore [[collection1] ] Opening new SolrCore at [/home/jenkins/workspace/Lucene-Solr-master-Linux/solr/build/solr-core/test/J1/temp/solr.cloud.PeerSyncReplicationTest_D034F5D8C42E161F-001/control-001/cores/collection1], dataDir=[/home/jenkins/workspace/Lucene-Solr-master-Linux/solr/build/solr-core/test/J1/temp/solr.cloud.PeerSyncReplicationTest_D034F5D8C42E161F-001/control-001/cores/collection1/data/]
   [junit4]   2> 568485 INFO  (coreLoadExecutor-2709-thread-1) [    ] o.a.s.c.JmxMonitoredMap JMX monitoring is enabled. Adding Solr mbeans to JMX Server: com.sun.jmx.mbeanserver.JmxMBeanServer@3d2aa98
   [junit4]   2> 568490 INFO  (coreLoadExecutor-2709-thread-1) [    ] o.a.s.u.RandomMergePolicy RandomMergePolicy wrapping class org.apache.lucene.index.LogByteSizeMergePolicy: [LogByteSizeMergePolicy: minMergeSize=1677721, mergeFactor=37, maxMergeSize=2147483648, maxMergeSizeForForcedMerge=9223372036854775807, calibrateSizeByDeletes=true, maxMergeDocs=2147483647, maxCFSSegmentSizeMB=8.796093022207999E12, noCFSRatio=1.0]
   [junit4]   2> 568553 WARN  (coreLoadExecutor-2709-thread-1) [    ] o.a.s.c.RequestHandlers INVALID paramSet a in requestHandler {type = requestHandler,name = /dump,class = DumpRequestHandler,attributes = {initParams=a, name=/dump, class=DumpRequestHandler},args = {defaults={a=A,b=B}}}
   [junit4]   2> 568565 INFO  (coreLoadExecutor-2709-thread-1) [    ] o.a.s.u.UpdateHandler Using UpdateLog implementation: org.apache.solr.update.UpdateLog
   [junit4]   2> 568565 INFO  (coreLoadExecutor-2709-thread-1) [    ] o.a.s.u.UpdateLog Initializing UpdateLog: dataDir= defaultSyncLevel=FLUSH numRecordsToKeep=1000 maxNumLogsToKeep=10 numVersionBuckets=65536
   [junit4]   2> 568568 INFO  (coreLoadExecutor-2709-thread-1) [    ] o.a.s.u.CommitTracker Hard AutoCommit: disabled
   [junit4]   2> 568568 INFO  (coreLoadExecutor-2709-thread-1) [    ] o.a.s.u.CommitTracker Soft AutoCommit: disabled
   [junit4]   2> 568570 INFO  (coreLoadExecutor-2709-thread-1) [    ] o.a.s.u.RandomMergePolicy RandomMergePolicy wrapping class org.apache.lucene.index.TieredMergePolicy: [TieredMergePolicy: maxMergeAtOnce=14, maxMergeAtOnceExplicit=18, maxMergedSegmentMB=43.69140625, floorSegmentMB=1.2529296875, forceMergeDeletesPctAllowed=1.1846590196726658, segmentsPerTier=13.0, maxCFSSegmentSizeMB=8.796093022207999E12, noCFSRatio=0.0
   [junit4]   2> 568572 INFO  (coreLoadExecutor-2709-thread-1) [    ] o.a.s.s.SolrIndexSearcher Opening [Searcher@798cd3d0[collection1] main]
   [junit4]   2> 568573 INFO  (coreLoadExecutor-2709-thread-1) [    ] o.a.s.r.ManagedResourceStorage Configured ZooKeeperStorageIO with znodeBase: /configs/conf1
   [junit4]   2> 568574 INFO  (coreLoadExecutor-2709-thread-1) [    ] o.a.s.r.ManagedResourceStorage Loaded null at path _rest_managed.json using ZooKeeperStorageIO:path=/configs/conf1
   [junit4]   2> 568574 INFO  (coreLoadExecutor-2709-thread-1) [    ] o.a.s.h.ReplicationHandler Commits will be reserved for  10000
   [junit4]   2> 568576 INFO  (searcherExecutor-2710-thread-1) [    ] o.a.s.c.SolrCore [collection1] Registered new searcher Searcher@798cd3d0[collection1] main{ExitableDirectoryReader(UninvertingDirectoryReader())}
   [junit4]   2> 568578 INFO  (coreLoadExecutor-2709-thread-1) [    ] o.a.s.u.UpdateLog Could not find max version in index or recent updates, using new clock 1557721005269450752
   [junit4]   2> 568586 INFO  (coreZkRegister-2702-thread-1) [    ] o.a.s.c.ShardLeaderElectionContext Enough replicas found to continue.
   [junit4]   2> 568586 INFO  (coreZkRegister-2702-thread-1) [    ] o.a.s.c.ShardLeaderElectionContext I may be the new leader - try and sync
   [junit4]   2> 568586 INFO  (coreZkRegister-2702-thread-1) [    ] o.a.s.c.SyncStrategy Sync replicas to https://127.0.0.1:37199/s/collection1/
   [junit4]   2> 568587 INFO  (coreZkRegister-2702-thread-1) [    ] o.a.s.c.SyncStrategy Sync Success - now sync replicas to me
   [junit4]   2> 568587 INFO  (coreZkRegister-2702-thread-1) [    ] o.a.s.c.SyncStrategy https://127.0.0.1:37199/s/collection1/ has no replicas
   [junit4]   2> 568591 INFO  (coreZkRegister-2702-thread-1) [    ] o.a.s.c.ShardLeaderElectionContext I am the new leader: https://127.0.0.1:37199/s/collection1/ shard1
   [junit4]   2> 568606 INFO  (TEST-PeerSyncReplicationTest.test-seed#[D034F5D8C42E161F]) [    ] o.a.s.c.c.ZkStateReader Updated live nodes from ZooKeeper... (0) -> (1)
   [junit4]   2> 568607 INFO  (TEST-PeerSyncReplicationTest.test-seed#[D034F5D8C42E161F]) [    ] o.a.s.c.s.i.ZkClientClusterStateProvider Cluster at 127.0.0.1:43176/solr ready
   [junit4]   2> 568607 INFO  (TEST-PeerSyncReplicationTest.test-seed#[D034F5D8C42E161F]) [    ] o.a.s.c.ChaosMonkey monkey: init - expire sessions:false cause connection loss:false
   [junit4]   2> 568607 INFO  (TEST-PeerSyncReplicationTest.test-seed#[D034F5D8C42E161F]) [    ] o.a.s.c.AbstractFullDistribZkTestBase Creating collection1 with stateFormat=2
   [junit4]   2> 568611 WARN  (NIOServerCxn.Factory:0.0.0.0/0.0.0.0:0) [    ] o.a.z.s.NIOServerCnxn caught end of stream exception
   [junit4]   2> EndOfStreamException: Unable to read additional data from client sessionid 0x159e22ffb1a0007, likely client has closed socket
   [junit4]   2> 	at org.apache.zookeeper.server.NIOServerCnxn.doIO(NIOServerCnxn.java:228)
   [junit4]   2> 	at org.apache.zookeeper.server.NIOServerCnxnFactory.run(NIOServerCnxnFactory.java:208)
   [junit4]   2> 	at java.base/java.lang.Thread.run(Thread.java:844)
   [junit4]   2> 568642 INFO  (coreZkRegister-2702-thread-1) [    ] o.a.s.c.ZkController I am the leader, no recovery necessary
   [junit4]   2> 569276 INFO  (TEST-PeerSyncReplicationTest.test-seed#[D034F5D8C42E161F]) [    ] o.a.s.SolrTestCaseJ4 Writing core.properties file to /home/jenkins/workspace/Lucene-Solr-master-Linux/solr/build/solr-core/test/J1/temp/solr.cloud.PeerSyncReplicationTest_D034F5D8C42E161F-001/shard-1-001/cores/collection1
   [junit4]   2> 569278 INFO  (TEST-PeerSyncReplicationTest.test-seed#[D034F5D8C42E161F]) [    ] o.a.s.c.AbstractFullDistribZkTestBase create jetty 1 in directory /home/jenkins/workspace/Lucene-Solr-master-Linux/solr/build/solr-core/test/J1/temp/solr.cloud.PeerSyncReplicationTest_D034F5D8C42E161F-001/shard-1-001
   [junit4]   2> 569279 INFO  (TEST-PeerSyncReplicationTest.test-seed#[D034F5D8C42E161F]) [    ] o.e.j.s.Server jetty-9.3.14.v20161028
   [junit4]   2> 569280 INFO  (TEST-PeerSyncReplicationTest.test-seed#[D034F5D8C42E161F]) [    ] o.e.j.s.h.ContextHandler Started o.e.j.s.ServletContextHandler@2118a464{/s,null,AVAILABLE}
   [junit4]   2> 569281 INFO  (TEST-PeerSyncReplicationTest.test-seed#[D034F5D8C42E161F]) [    ] o.e.j.s.AbstractConnector Started ServerConnector@6a2af01d{SSL,[ssl, http/1.1]}{127.0.0.1:46613}
   [junit4]   2> 569281 INFO  (TEST-PeerSyncReplicationTest.test-seed#[D034F5D8C42E161F]) [    ] o.e.j.s.Server Started @571502ms
   [junit4]   2> 569281 INFO  (TEST-PeerSyncReplicationTest.test-seed#[D034F5D8C42E161F]) [    ] o.a.s.c.s.e.JettySolrRunner Jetty properties: {hostContext=/s, solrconfig=solrconfig.xml, solr.data.dir=/home/jenkins/workspace/Lucene-Solr-master-Linux/solr/build/solr-core/test/J1/temp/solr.cloud.PeerSyncReplicationTest_D034F5D8C42E161F-001/tempDir-001/jetty1, hostPort=46613, coreRootDirectory=/home/jenkins/workspace/Lucene-Solr-master-Linux/solr/build/solr-core/test/J1/temp/solr.cloud.PeerSyncReplicationTest_D034F5D8C42E161F-001/shard-1-001/cores}
   [junit4]   2> 569281 ERROR (TEST-PeerSyncReplicationTest.test-seed#[D034F5D8C42E161F]) [    ] o.a.s.s.StartupLoggingUtils Missing Java Option solr.log.dir. Logging may be missing or incomplete.
   [junit4]   2> 569281 INFO  (TEST-PeerSyncReplicationTest.test-seed#[D034F5D8C42E161F]) [    ] o.a.s.s.SolrDispatchFilter  ___      _       Welcome to Apache Solr™ version 7.0.0
   [junit4]   2> 569281 INFO  (TEST-PeerSyncReplicationTest.test-seed#[D034F5D8C42E161F]) [    ] o.a.s.s.SolrDispatchFilter / __| ___| |_ _   Starting in cloud mode on port null
   [junit4]   2> 569281 INFO  (TEST-PeerSyncReplicationTest.test-seed#[D034F5D8C42E161F]) [    ] o.a.s.s.SolrDispatchFilter \__ \/ _ \ | '_|  Install dir: null
   [junit4]   2> 569281 INFO  (TEST-PeerSyncReplicationTest.test-seed#[D034F5D8C42E161F]) [    ] o.a.s.s.SolrDispatchFilter |___/\___/_|_|    Start time: 2017-01-27T23:08:35.555738Z
   [junit4]   2> 569284 INFO  (TEST-PeerSyncReplicationTest.test-seed#[D034F5D8C42E161F]) [    ] o.a.s.s.SolrDispatchFilter Loading solr.xml from SolrHome (not found in ZooKeeper)
   [junit4]   2> 569284 INFO  (TEST-PeerSyncReplicationTest.test-seed#[D034F5D8C42E161F]) [    ] o.a.s.c.SolrXmlConfig Loading container configuration from /home/jenkins/workspace/Lucene-Solr-master-Linux/solr/build/solr-core/test/J1/temp/solr.cloud.PeerSyncReplicationTest_D034F5D8C42E161F-001/shard-1-001/solr.xml
   [junit4]   2> 569291 INFO  (TEST-PeerSyncReplicationTest.test-seed#[D034F5D8C42E161F]) [    ] o.a.s.c.ZkContainer Zookeeper client=127.0.0.1:43176/solr
   [junit4]   2> 569298 INFO  (TEST-PeerSyncReplicationTest.test-seed#[D034F5D8C42E161F]) [    ] o.a.s.c.c.ZkStateReader Updated live nodes from ZooKeeper... (0) -> (1)
   [junit4]   2> 569301 INFO  (TEST-PeerSyncReplicationTest.test-seed#[D034F5D8C42E161F]) [    ] o.a.s.c.ZkController Register node as live in ZooKeeper:/live_nodes/127.0.0.1:46613_s
   [junit4]   2> 569302 INFO  (zkCallback-2621-thread-1) [    ] o.a.s.c.c.ZkStateReader Updated live nodes from ZooKeeper... (1) -> (2)
   [junit4]   2> 569302 INFO  (zkCallback-2625-thread-1) [    ] o.a.s.c.c.ZkStateReader Updated live nodes from ZooKeeper... (1) -> (2)
   [junit4]   2> 569330 INFO  (zkCallback-2631-thread-1) [    ] o.a.s.c.c.ZkStateReader Updated live nodes from ZooKeeper... (1) -> (2)
   [junit4]   2> 569375 INFO  (TEST-PeerSyncReplicationTest.test-seed#[D034F5D8C42E161F]) [    ] o.a.s.c.CorePropertiesLocator Found 1 core definitions underneath /home/jenkins/workspace/Lucene-Solr-master-Linux/solr/build/solr-core/test/J1/temp/solr.cloud.PeerSyncReplicationTest_D034F5D8C42E161F-001/shard-1-001/cores
   [junit4]   2> 569375 INFO  (TEST-PeerSyncReplicationTest.test-seed#[D034F5D8C42E161F]) [    ] o.a.s.c.CorePropertiesLocator Cores are: [collection1]
   [junit4]   2> 569377 INFO  (OverseerStateUpdate-97357562669301765-127.0.0.1:37199_s-n_0000000000) [    ] o.a.s.c.o.ReplicaMutator Assigning new node to shard shard=shard1
   [junit4]   2> 569478 INFO  (zkCallback-2631-thread-2) [    ] o.a.s.c.c.ZkStateReader A cluster state change: [WatchedEvent state:SyncConnected type:NodeDataChanged path:/collections/collection1/state.json] for collection [collection1] has occurred - updating... (live nodes size: [2])
   [junit4]   2> 570385 INFO  (coreLoadExecutor-2720-thread-1) [    ] o.a.s.c.SolrConfig Using Lucene MatchVersion: 7.0.0
   [junit4]   2> 570396 INFO  (coreLoadExecutor-2720-thread-1) [    ] o.a.s.s.IndexSchema [collection1] Schema name=test
   [junit4]   2> 570496 WARN  (coreLoadExecutor-2720-thread-1) [    ] o.a.s.s.IndexSchema [collection1] default search field in schema is text. WARNING: Deprecated, please use 'df' on request instead.
   [junit4]   2> 570498 INFO  (coreLoadExecutor-2720-thread-1) [    ] o.a.s.s.IndexSchema Loaded schema test/1.0 with uniqueid field id
   [junit4]   2> 570503 INFO  (coreLoadExecutor-2720-thread-1) [    ] o.a.s.c.CoreContainer Creating SolrCore 'collection1' using configuration from collection collection1
   [junit4]   2> 570504 INFO  (coreLoadExecutor-2720-thread-1) [    ] o.a.s.c.SolrCore [[collection1] ] Opening new SolrCore at [/home/jenkins/workspace/Lucene-Solr-master-Linux/solr/build/solr-core/test/J1/temp/solr.cloud.PeerSyncReplicationTest_D034F5D8C42E161F-001/shard-1-001/cores/collection1], dataDir=[/home/jenkins/workspace/Lucene-Solr-master-Linux/solr/build/solr-core/test/J1/temp/solr.cloud.PeerSyncReplicationTest_D034F5D8C42E161F-001/shard-1-001/cores/collection1/data/]
   [junit4]   2> 570504 INFO  (coreLoadExecutor-2720-thread-1) [    ] o.a.s.c.JmxMonitoredMap JMX monitoring is enabled. Adding Solr mbeans to JMX Server: com.sun.jmx.mbeanserver.JmxMBeanServer@3d2aa98
   [junit4]   2> 570509 INFO  (coreLoadExecutor-2720-thread-1) [    ] o.a.s.u.RandomMergePolicy RandomMergePolicy wrapping class org.apache.lucene.index.LogByteSizeMergePolicy: [LogByteSizeMergePolicy: minMergeSize=1677721, mergeFactor=37, maxMergeSize=2147483648, maxMergeSizeForForcedMerge=9223372036854775807, calibrateSizeByDeletes=true, maxMergeDocs=2147483647, maxCFSSegmentSizeMB=8.796093022207999E12, noCFSRatio=1.0]
   [junit4]   2> 570552 WARN  (coreLoadExecutor-2720-thread-1) [    ] o.a.s.c.RequestHandlers INVALID paramSet a in requestHandler {type = requestHandler,name = /dump,class = DumpRequestHandler,attributes = {initParams=a, name=/dump, class=DumpRequestHandler},args = {defaults={a=A,b=B}}}
   [junit4]   2> 570561 INFO  (coreLoadExecutor-2720-thread-1) [    ] o.a.s.u.UpdateHandler Using UpdateLog implementation: org.apache.solr.update.UpdateLog
   [junit4]   2> 570561 INFO  (coreLoadExecutor-2720-thread-1) [    ] o.a.s.u.UpdateLog Initializing UpdateLog: dataDir= defaultSyncLevel=FLUSH numRecordsToKeep=1000 maxNumLogsToKeep=10 numVersionBuckets=65536
   [junit4]   2> 570563 INFO  (coreLoadExecutor-2720-thread-1) [    ] o.a.s.u.CommitTracker Hard AutoCommit: disabled
   [junit4]   2> 570563 INFO  (coreLoadExecutor-2720-thread-1) [    ] o.a.s.u.CommitTracker Soft AutoCommit: disabled
   [junit4]   2> 570564 INFO  (coreLoadExecutor-2720-thread-1) [    ] o.a.s.u.RandomMergePolicy RandomMergePolicy wrapping class org.apache.lucene.index.TieredMergePolicy: [TieredMergePolicy: maxMergeAtOnce=14, maxMergeAtOnceExplicit=18, maxMergedSegmentMB=43.69140625, floorSegmentMB=1.2529296875, forceMergeDeletesPctAllowed=1.1846590196726658, segmentsPerTier=13.0, maxCFSSegmentSizeMB=8.796093022207999E12, noCFSRatio=0.0
   [junit4]   2> 570565 INFO  (coreLoadExecutor-2720-thread-1) [    ] o.a.s.s.SolrIndexSearcher Opening [Searcher@16386735[collection1] main]
   [junit4]   2> 570566 INFO  (coreLoadExecutor-2720-thread-1) [    ] o.a.s.r.ManagedResourceStorage Configured ZooKeeperStorageIO with znodeBase: /configs/conf1
   [junit4]   2> 570566 INFO  (coreLoadExecutor-2720-thread-1) [    ] o.a.s.r.ManagedResourceStorage Loaded null at path _rest_managed.json using ZooKeeperStorageIO:path=/configs/conf1
   [junit4]   2> 570566 INFO  (coreLoadExecutor-2720-thread-1) [    ] o.a.s.h.ReplicationHandler Commits will be reserved for  10000
   [junit4]   2> 570568 INFO  (searcherExecutor-2721-thread-1) [    ] o.a.s.c.SolrCore [collection1] Registered new searcher Searcher@16386735[collection1] main{ExitableDirectoryReader(UninvertingDirectoryReader())}
   [junit4]   2> 570569 INFO  (coreLoadExecutor-2720-thread-1) [    ] o.a.s.u.UpdateLog Could not find max version in index or recent updates, using new clock 1557721007357165568
   [junit4]   2> 570573 INFO  (coreZkRegister-2715-thread-1) [    ] o.a.s.c.ShardLeaderElectionContext Enough replicas found to continue.
   [junit4]   2> 570573 INFO  (coreZkRegister-2715-thread-1) [    ] o.a.s.c.ShardLeaderElectionContext I may be the new leader - try and sync
   [junit4]   2> 570573 INFO  (coreZkRegister-2715-thread-1) [    ] o.a.s.c.SyncStrategy Sync replicas to https://127.0.0.1:46613/s/collection1/
   [junit4]   2> 570574 INFO  (coreZkRegister-2715-thread-1) [    ] o.a.s.c.SyncStrategy Sync Success - now sync replicas to me
   [junit4]   2> 570574 INFO  (coreZkRegister-2715-thread-1) [    ] o.a.s.c.SyncStrategy https://127.0.0.1:46613/s/collection1/ has no replicas
   [junit4]   2> 570578 INFO  (coreZkRegister-2715-thread-1) [    ] o.a.s.c.ShardLeaderElectionContext I am the new leader: https://127.0.0.1:46613/s/collection1/ shard1
   [junit4]   2> 570680 INFO  (zkCallback-2631-thread-2) [    ] o.a.s.c.c.ZkStateReader A cluster state change: [WatchedEvent state:SyncConnected type:NodeDataChanged path:/collections/collection1/state.json] for collection [collection1] has occurred - updating... (live nodes size: [2])
   [junit4]   2> 570729 INFO  (coreZkRegister-2715-thread-1) [    ] o.a.s.c.ZkController I am the leader, no recovery necessary
   [junit4]   2> 570831 INFO  (zkCallback-2631-thread-2) [    ] o.a.s.c.c.ZkStateReader A cluster state change: [WatchedEvent state:SyncConnected type:NodeDataChanged path:/collections/collection1/state.json] for collection [collection1] has occurred - updating... (live nodes size: [2])
   [junit4]   2> 571164 INFO  (TEST-PeerSyncReplicationTest.test-seed#[D034F5D8C42E161F]) [    ] o.a.s.SolrTestCaseJ4 Writing core.properties file to /home/jenkins/workspace/Lucene-Solr-master-Linux/solr/build/solr-core/test/J1/temp/solr.cloud.PeerSyncReplicationTest_D034F5D8C42E161F-001/shard-2-001/cores/collection1
   [junit4]   2> 571165 INFO  (TEST-PeerSyncReplicationTest.test-seed#[D034F5D8C42E161F]) [    ] o.a.s.c.AbstractFullDistribZkTestBase create jetty 2 in directory /home/jenkins/workspace/Lucene-Solr-master-Linux/solr/build/solr-core/test/J1/temp/solr.cloud.PeerSyncReplicationTest_D034F5D8C42E161F-001/shard-2-001
   [junit4]   2> 571166 INFO  (TEST-PeerSyncReplicationTest.test-seed#[D034F5D8C42E161F]) [    ] o.e.j.s.Server jetty-9.3.14.v20161028
   [junit4]   2> 571169 INFO  (TEST-PeerSyncReplicationTest.test-seed#[D034F5D8C42E161F]) [    ] o.e.j.s.h.ContextHandler Started o.e.j.s.ServletContextHandler@5a7d21bc{/s,null,AVAILABLE}
   [junit4]   2> 571170 INFO  (TEST-PeerSyncReplicationTest.test-seed#[D034F5D8C42E161F]) [    ] o.e.j.s.AbstractConnector Started ServerConnector@58a2d5e{SSL,[ssl, http/1.1]}{127.0.0.1:34554}
   [junit4]   2> 571170 INFO  (TEST-PeerSyncReplicationTest.test-seed#[D034F5D8C42E161F]) [    ] o.e.j.s.Server Started @573392ms
   [junit4]   2> 571170 INFO  (TEST-PeerSyncReplicationTest.test-seed#[D034F5D8C42E161F]) [    ] o.a.s.c.s.e.JettySolrRunner Jetty properties: {hostContext=/s, solrconfig=solrconfig.xml, solr.data.dir=/home/jenkins/workspace/Lucene-Solr-master-Linux/solr/build/solr-core/test/J1/temp/solr.cloud.PeerSyncReplicationTest_D034F5D8C42E161F-001/tempDir-001/jetty2, hostPort=34554, coreRootDirectory=/home/jenkins/workspace/Lucene-Solr-master-Linux/solr/build/solr-core/test/J1/temp/solr.cloud.PeerSyncReplicationTest_D034F5D8C42E161F-001/shard-2-001/cores}
   [junit4]   2> 571170 ERROR (TEST-PeerSyncReplicationTest.test-seed#[D034F5D8C42E161F]) [    ] o.a.s.s.StartupLoggingUtils Missing Java Option solr.log.dir. Logging may be missing or incomplete.
   [junit4]   2> 571171 INFO  (TEST-PeerSyncReplicationTest.test-seed#[D034F5D8C42E161F]) [    ] o.a.s.s.SolrDispatchFilter  ___      _       Welcome to Apache Solr™ version 7.0.0
   [junit4]   2> 571171 INFO  (TEST-PeerSyncReplicationTest.test-seed#[D034F5D8C42E161F]) [    ] o.a.s.s.SolrDispatchFilter / __| ___| |_ _   Starting in cloud mode on port null
   [junit4]   2> 571171 INFO  (TEST-PeerSyncReplicationTest.test-seed#[D034F5D8C42E161F]) [    ] o.a.s.s.SolrDispatchFilter \__ \/ _ \ | '_|  Install dir: null
   [junit4]   2> 571171 INFO  (TEST-PeerSyncReplicationTest.test-seed#[D034F5D8C42E161F]) [    ] o.a.s.s.SolrDispatchFilter |___/\___/_|_|    Start time: 2017-01-27T23:08:37.445287Z
   [junit4]   2> 571173 INFO  (TEST-PeerSyncReplicationTest.test-seed#[D034F5D8C42E161F]) [    ] o.a.s.s.SolrDispatchFilter Loading solr.xml from SolrHome (not found in ZooKeeper)
   [junit4]   2> 571173 INFO  (TEST-PeerSyncReplicationTest.test-seed#[D034F5D8C42E161F]) [    ] o.a.s.c.SolrXmlConfig Loading container configuration from /home/jenkins/workspace/Lucene-Solr-master-Linux/solr/build/solr-core/test/J1/temp/solr.cloud.PeerSyncReplicationTest_D034F5D8C42E161F-001/shard-2-001/solr.xml
   [junit4]   2> 571180 INFO  (TEST-PeerSyncReplicationTest.test-seed#[D034F5D8C42E161F]) [    ] o.a.s.c.ZkContainer Zookeeper client=127.0.0.1:43176/solr
   [junit4]   2> 571184 INFO  (TEST-PeerSyncReplicationTest.test-seed#[D034F5D8C42E161F]) [    ] o.a.s.c.c.ZkStateReader Updated live nodes from ZooKeeper... (0) -> (2)
   [junit4]   2> 571186 INFO  (TEST-PeerSyncReplicationTest.test-seed#[D034F5D8C42E161F]) [    ] o.a.s.c.ZkController Register node as live in ZooKeeper:/live_nodes/127.0.0.1:34554_s
   [junit4]   2> 571187 INFO  (zkCallback-2625-thread-1) [    ] o.a.s.c.c.ZkStateReader Updated live nodes from ZooKeeper... (2) -> (3)
   [junit4]   2> 571187 INFO  (zkCallback-2621-thread-1) [    ] o.a.s.c.c.ZkStateReader Updated live nodes from ZooKeeper... (2) -> (3)
   [junit4]   2> 571188 INFO  (zkCallback-2637-thread-1) [    ] o.a.s.c.c.ZkStateReader Updated live nodes from ZooKeeper... (2) -> (3)
   [junit4]   2> 571187 INFO  (zkCallback-2631-thread-2) [    ] o.a.s.c.c.ZkStateReader Updated live nodes from ZooKeeper... (2) -> (3)
   [junit4]   2> 571206 INFO  (TEST-PeerSyncReplicationTest.test-seed#[D034F5D8C42E161F]) [    ] o.a.s.c.CorePropertiesLocator Found 1 core definitions underneath /home/jenkins/workspace/Lucene-Solr-master-Linux/solr/build/solr-core/test/J1/temp/solr.cloud.PeerSyncReplicationTest_D034F5D8C42E161F-001/shard-2-001/cores
   [junit4]   2> 571206 INFO  (TEST-PeerSyncReplicationTest.test-seed#[D034F5D8C42E161F]) [    ] o.a.s.c.CorePropertiesLocator Cores are: [collection1]
   [junit4]   2> 571208 INFO  (OverseerStateUpdate-97357562669301765-127.0.0.1:37199_s-n_0000000000) [    ] o.a.s.c.o.ReplicaMutator Assigning new node to shard shard=shard1
   [junit4]   2> 571309 INFO  (zkCallback-2631-thread-2) [    ] o.a.s.c.c.ZkStateReader A cluster state change: [WatchedEvent state:SyncConnected type:NodeDataChanged path:/collections/collection1/state.json] for collection [collection1] has occurred - updating... (live nodes size: [3])
   [junit4]   2> 571309 INFO  (zkCallback-2637-thread-1) [    ] o.a.s.c.c.ZkStateReader A cluster state change: [WatchedEvent state:SyncConnected type:NodeDataChanged path:/collections/collection1/state.json] for collection [collection1] has occurred - updating... (live nodes size: [3])
   [junit4]   2> 572220 INFO  (coreLoadExecutor-2731-thread-1) [    ] o.a.s.c.SolrConfig Using Lucene MatchVersion: 7.0.0
   [junit4]   2> 572252 INFO  (coreLoadExecutor-2731-thread-1) [    ] o.a.s.s.IndexSchema [collection1] Schema name=test
   [junit4]   2> 572363 WARN  (coreLoadExecutor-2731-thread-1) [    ] o.a.s.s.IndexSchema [collection1] default search field in schema is text. WARNING: Deprecated, please use 'df' on request instead.
   [junit4]   2> 572367 INFO  (coreLoadExecutor-2731-thread-1) [    ] o.a.s.s.IndexSchema Loaded schema test/1.0 with uniqueid field id
   [junit4]   2> 572375 INFO  (coreLoadExecutor-2731-thread-1) [    ] o.a.s.c.CoreContainer Creating SolrCore 'collection1' using configuration from collection collection1
   [junit4]   2> 572376 INFO  (coreLoadExecutor-2731-thread-1) [    ] o.a.s.c.SolrCore [[collection1] ] Opening new SolrCore at [/home/jenkins/workspace/Lucene-Solr-master-Linux/solr/build/solr-core/test/J1/temp/solr.cloud.PeerSyncReplicationTest_D034F5D8C42E161F-001/shard-2-001/cores/collection1], dataDir=[/home/jenkins/workspace/Lucene-Solr-master-Linux/solr/build/solr-core/test/J1/temp/solr.cloud.PeerSyncReplicationTest_D034F5D8C42E161F-001/shard-2-001/cores/collection1/data/]
   [junit4]   2> 572376 INFO  (coreLoadExecutor-2731-thread-1) [    ] o.a.s.c.JmxMonitoredMap JMX monitoring is enabled. Adding Solr mbeans to JMX Server: com.sun.jmx.mbeanserver.JmxMBeanServer@3d2aa98
   [junit4]   2> 572385 INFO  (coreLoadExecutor-2731-thread-1) [    ] o.a.s.u.RandomMergePolicy RandomMergePolicy wrapping class org.apache.lucene.index.LogByteSizeMergePolicy: [LogByteSizeMergePolicy: minMergeSize=1677721, mergeFactor=37, maxMergeSize=2147483648, maxMergeSizeForForcedMerge=9223372036854775807, calibrateSizeByDeletes=true, maxMergeDocs=2147483647, maxCFSSegmentSizeMB=8.796093022207999E12, noCFSRatio=1.0]
   [junit4]   2> 572424 WARN  (coreLoadExecutor-2731-thread-1) [    ] o.a.s.c.RequestHandlers INVALID paramSet a in requestHandler {type = requestHandler,name = /dump,class = DumpRequestHandler,attributes = {initParams=a, name=/dump, class=DumpRequestHandler},args = {defaults={a=A,b=B}}}
   [junit4]   2> 572438 INFO  (coreLoadExecutor-2731-thread-1) [    ] o.a.s.u.UpdateHandler Using UpdateLog implementation: org.apache.solr.update.UpdateLog
   [junit4]   2> 572438 INFO  (coreLoadExecutor-2731-thread-1) [    ] o.a.s.u.UpdateLog Initializing UpdateLog: dataDir= defaultSyncLevel=FLUSH numRecordsToKeep=1000 maxNumLogsToKeep=10 numVersionBuckets=65536
   [junit4]   2> 572440 INFO  (coreLoadExecutor-2731-thread-1) [    ] o.a.s.u.CommitTracker Hard AutoCommit: disabled
   [junit4]   2> 572440 INFO  (coreLoadExecutor-2731-thread-1) [    ] o.a.s.u.CommitTracker Soft AutoCommit: disabled
   [junit4]   2> 572443 INFO  (coreLoadExecutor-2731-thread-1) [    ] o.a.s.u.RandomMergePolicy RandomMergePolicy wrapping class org.apache.lucene.index.TieredMergePolicy: [TieredMergePolicy: maxMergeAtOnce=14, maxMergeAtOnceExplicit=18, maxMergedSegmentMB=43.69140625, floorSegmentMB=1.2529296875, forceMergeDeletesPctAllowed=1.1846590196726658, segmentsPerTier=13.0, maxCFSSegmentSizeMB=8.796093022207999E12, noCFSRatio=0.0
   [junit4]   2> 572445 INFO  (coreLoadExecutor-2731-thread-1) [    ] o.a.s.s.SolrIndexSearcher Opening [Searcher@4478a6d0[collection1] main]
   [junit4]   2> 572446 INFO  (coreLoadExecutor-2731-thread-1) [    ] o.a.s.r.ManagedResourceStorage Configured ZooKeeperStorageIO with znodeBase: /configs/conf1
   [junit4]   2> 572446 INFO  (coreLoadExecutor-2731-thread-1) [    ] o.a.s.r.ManagedResourceStorage Loaded null at path _rest_managed.json using ZooKeeperStorageIO:path=/configs/conf1
   [junit4]   2> 572446 INFO  (coreLoadExecutor-2731-thread-1) [    ] o.a.s.h.ReplicationHandler Commits will be reserved for  10000
   [junit4]   2> 572447 INFO  (searcherExecutor-2732-thread-1) [    ] o.a.s.c.SolrCore [collection1] Registered new searcher Searcher@4478a6d0[collection1] main{ExitableDirectoryReader(UninvertingDirectoryReader())}
   [junit4]   2> 572450 INFO  (coreLoadExecutor-2731-thread-1) [    ] o.a.s.u.UpdateLog Could not find max version in index or recent updates, using new clock 1557721009329537024
   [junit4]   2> 572453 INFO  (coreZkRegister-2726-thread-1) [    ] o.a.s.c.ZkController Core needs to recover:collection1
   [junit4]   2> 572454 INFO  (updateExecutor-2634-thread-1) [    ] o.a.s.u.DefaultSolrCoreState Running recovery
   [junit4]   2> 572454 INFO  (recoveryExecutor-2635-thread-1) [    ] o.a.s.c.RecoveryStrategy Starting recovery process. recoveringAfterStartup=true
   [junit4]   2> 572454 INFO  (recoveryExecutor-2635-thread-1) [    ] o.a.s.c.RecoveryStrategy ###### startupVersions=[[]]
   [junit4]   2> 572454 INFO  (recoveryExecutor-2635-thread-1) [    ] o.a.s.c.RecoveryStrategy Begin buffering updates. core=[collection1]
   [junit4]   2> 572454 INFO  (recoveryExecutor-2635-thread-1) [    ] o.a.s.u.UpdateLog Starting to buffer updates. FSUpdateLog{state=ACTIVE, tlog=null}
   [junit4]   2> 572454 INFO  (recoveryExecutor-2635-thread-1) [    ] o.a.s.c.RecoveryStrategy Publishing state of core [collection1] as recovering, leader is [https://127.0.0.1:46613/s/collection1/] and I am [https://127.0.0.1:34554/s/collection1/]
   [junit4]   2> 572456 INFO  (recoveryExecutor-2635-thread-1) [    ] o.a.s.c.RecoveryStrategy Sending prep recovery command to [https://127.0.0.1:46613/s]; [WaitForState: action=PREPRECOVERY&core=collection1&nodeName=127.0.0.1:34554_s&coreNodeName=core_node2&state=recovering&checkLive=true&onlyIfLeader=true&onlyIfLeaderActive=true]
   [junit4]   2> 572468 INFO  (qtp107714239-11355) [    ] o.a.s.h.a.PrepRecoveryOp Going to wait for coreNodeName: core_node2, state: recovering, checkLive: true, onlyIfLeader: true, onlyIfLeaderActive: true
   [junit4]   2> 572469 INFO  (qtp107714239-11355) [    ] o.a.s.h.a.PrepRecoveryOp Will wait a max of 183 seconds to see collection1 (shard1 of collection1) have state: recovering
   [junit4]   2> 572469 INFO  (qtp107714239-11355) [    ] o.a.s.h.a.PrepRecoveryOp In WaitForState(recovering): collection=collection1, shard=shard1, thisCore=collection1, leaderDoesNotNeedRecovery=false, isLeader? true, live=true, checkLive=true, currentState=down, localState=active, nodeName=127.0.0.1:34554_s, coreNodeName=core_node2, onlyIfActiveCheckResult=false, nodeProps: core_node2:{"core":"collection1","base_url":"https://127.0.0.1:34554/s","node_name":"127.0.0.1:34554_s","state":"down"}
   [junit4]   2> 572556 INFO  (zkCallback-2637-thread-1) [    ] o.a.s.c.c.ZkStateReader A cluster state change: [WatchedEvent state:SyncConnected type:NodeDataChanged path:/collections/collection1/state.json] for collection [collection1] has occurred - updating... (live nodes size: [3])
   [junit4]   2> 572556 INFO  (zkCallback-2631-thread-2) [    ] o.a.s.c.c.ZkStateReader A cluster state change: [WatchedEvent state:SyncConnected type:NodeDataChanged path:/collections/collection1/state.json] for collection [collection1] has occurred - updating... (live nodes size: [3])
   [junit4]   2> 573372 INFO  (TEST-PeerSyncReplicationTest.test-seed#[D034F5D8C42E161F]) [    ] o.a.s.SolrTestCaseJ4 Writing core.properties file to /home/jenkins/workspace/Lucene-Solr-master-Linux/solr/build/solr-core/test/J1/temp/solr.cloud.PeerSyncReplicationTest_D034F5D8C42E161F-001/shard-3-001/cores/collection1
   [junit4]   2> 573373 INFO  (TEST-PeerSyncReplicationTest.test-seed#[D034F5D8C42E161F]) [    ] o.a.s.c.AbstractFullDistribZkTestBase create jetty 3 in directory /home/jenkins/workspace/Lucene-Solr-master-Linux/solr/build/solr-core/test/J1/temp/solr.cloud.PeerSyncReplicationTest_D034F5D8C42E161F-001/shard-3-001
   [junit4]   2> 573374 INFO  (TEST-PeerSyncReplicationTest.test-seed#[D034F5D8C42E161F]) [    ] o.e.j.s.Server jetty-9.3.14.v20161028
   [junit4]   2> 573375 INFO  (TEST-PeerSyncReplicationTest.test-seed#[D034F5D8C42E161F]) [    ] o.e.j.s.h.ContextHandler Started o.e.j.s.ServletContextHandler@10fb9fe{/s,null,AVAILABLE}
   [junit4]   2> 573376 INFO  (TEST-PeerSyncReplicationTest.test-seed#[D034F5D8C42E161F]) [    ] o.e.j.s.AbstractConnector Started ServerConnector@7795eec9{SSL,[ssl, http/1.1]}{127.0.0.1:42387}
   [junit4]   2> 573376 INFO  (TEST-PeerSyncReplicationTest.test-seed#[D034F5D8C42E161F]) [    ] o.e.j.s.Server Started @575598ms
   [junit4]   2> 573376 INFO  (TEST-PeerSyncReplicationTest.test-seed#[D034F5D8C42E161F]) [    ] o.a.s.c.s.e.JettySolrRunner Jetty properties: {hostContext=/s, solrconfig=solrconfig.xml, solr.data.dir=/home/jenkins/workspace/Lucene-Solr-master-Linux/solr/build/solr-core/test/J1/temp/solr.cloud.PeerSyncReplicationTest_D034F5D8C42E161F-001/tempDir-001/jetty3, hostPort=42387, coreRootDirectory=/home/jenkins/workspace/Lucene-Solr-master-Linux/solr/build/solr-core/test/J1/temp/solr.cloud.PeerSyncReplicationTest_D034F5D8C42E161F-001/shard-3-001/cores}
   [junit4]   2> 573376 ERROR (TEST-PeerSyncReplicationTest.test-seed#[D034F5D8C42E161F]) [    ] o.a.s.s.StartupLoggingUtils Missing Java Option solr.log.dir. Logging may be missing or incomplete.
   [junit4]   2> 573377 INFO  (TEST-PeerSyncReplicationTest.test-seed#[D034F5D8C42E161F]) [    ] o.a.s.s.SolrDispatchFilter  ___      _       Welcome to Apache Solr™ version 7.0.0
   [junit4]   2> 573377 INFO  (TEST-PeerSyncReplicationTest.test-seed#[D034F5D8C42E161F]) [    ] o.a.s.s.SolrDispatchFilter / __| ___| |_ _   Starting in cloud mode on port null
   [junit4]   2> 573377 INFO  (TEST-PeerSyncReplicationTest.test-seed#[D034F5D8C42E161F]) [    ] o.a.s.s.SolrDispatchFilter \__ \/ _ \ | '_|  Install dir: null
   [junit4]   2> 573377 INFO  (TEST-PeerSyncReplicationTest.test-seed#[D034F5D8C42E161F]) [    ] o.a.s.s.SolrDispatchFilter |___/\___/_|_|    Start time: 2017-01-27T23:08:39.651203Z
   [junit4]   2> 573379 INFO  (TEST-PeerSyncReplicationTest.test-seed#[D034F5D8C42E161F]) [    ] o.a.s.s.SolrDispatchFilter Loading solr.xml from SolrHome (not found in ZooKeeper)
   [junit4]   2> 573379 INFO  (TEST-PeerSyncReplicationTest.test-seed#[D034F5D8C42E161F]) [    ] o.a.s.c.SolrXmlConfig Loading container configuration from /home/jenkins/workspace/Lucene-Solr-master-Linux/solr/build/solr-core/test/J1/temp/solr.cloud.PeerSyncReplicationTest_D034F5D8C42E161F-001/shard-3-001/solr.xml
   [junit4]   2> 573387 INFO  (TEST-PeerSyncReplicationTest.test-seed#[D034F5D8C42E161F]) [    ] o.a.s.c.ZkContainer Zookeeper client=127.0.0.1:43176/solr
   [junit4]   2> 573392 INFO  (TEST-PeerSyncReplicationTest.test-seed#[D034F5D8C42E161F]) [    ] o.a.s.c.c.ZkStateReader Updated live nodes from ZooKeeper... (0) -> (3)
   [junit4]   2> 573394 INFO  (TEST-PeerSyncReplicationTest.test-seed#[D034F5D8C42E161F]) [    ] o.a.s.c.ZkController Register node as live in ZooKeeper:/live_nodes/127.0.0.1:42387_s
   [junit4]   2> 573394 INFO  (zkCallback-2625-thread-1) [    ] o.a.s.c.c.ZkStateReader Updated live nodes from ZooKeeper... (3) -> (4)
   [junit4]   2> 573395 INFO  (zkCallback-2637-thread-1) [    ] o.a.s.c.c.ZkStateReader Updated live nodes from ZooKeeper... (3) -> (4)
   [junit4]   2> 573395 INFO  (zkCallback-2644-thread-1) [    ] o.a.s.c.c.ZkStateReader Updated live nodes from ZooKeeper... (3) -> (4)
   [junit4]   2> 573395 INFO  (zkCallback-2631-thread-2) [    ] o.a.s.c.c.ZkStateReader Updated live nodes from ZooKeeper... (3) -> (4)
   [junit4]   2> 573395 INFO  (zkCallback-2621-thread-2) [    ] o.a.s.c.c.ZkStateReader Updated live nodes from ZooKeeper... (3) -> (4)
   [junit4]   2> 573416 INFO  (TEST-PeerSyncReplicationTest.test-seed#[D034F5D8C42E161F]) [    ] o.a.s.c.CorePropertiesLocator Found 1 core definitions underneath /home/jenkins/workspace/Lucene-Solr-master-Linux/solr/build/solr-core/test/J1/temp/solr.cloud.PeerSyncReplicationTest_D034F5D8C42E161F-001/shard-3-001/cores
   [junit4]   2> 573416 INFO  (TEST-PeerSyncReplicationTest.test-seed#[D034F5D8C42E161F]) [    ] o.a.s.c.CorePropertiesLocator Cores are: [collection1]
   [junit4]   2> 573417 INFO  (OverseerStateUpdate-97357562669301765-127.0.0.1:37199_s-n_0000000000) [    ] o.a.s.c.o.ReplicaMutator Assigning new node to shard shard=shard1
   [junit4]   2> 573469 INFO  (qtp107714239-11355) [    ] o.a.s.h.a.PrepRecoveryOp In WaitForState(recovering): collection=collection1, shard=shard1, thisCore=collection1, leaderDoesNotNeedRecovery=false, isLeader? true, live=true, checkLive=true, currentState=recovering, localState=active, nodeName=127.0.0.1:34554_s, coreNodeName=core_node2, onlyIfActiveCheckResult=false, nodeProps: core_node2:{"core":"collection1","base_url":"https://127.0.0.1:34554/s","node_name":"127.0.0.1:34554_s","state":"recovering"}
   [junit4]   2> 573469 INFO  (qtp107714239-11355) [    ] o.a.s.h.a.PrepRecoveryOp Waited coreNodeName: core_node2, state: recovering, checkLive: true, onlyIfLeader: true for: 1 seconds.
   [junit4]   2> 573469 INFO  (qtp107714239-11355) [    ] o.a.s.s.HttpSolrCall [admin] webapp=null path=/admin/cores params={nodeName=127.0.0.1:34554_s&onlyIfLeaderActive=true&core=collection1&coreNodeName=core_node2&action=PREPRECOVERY&checkLive=true&state=recovering&onlyIfLeader=true&wt=javabin&version=2} status=0 QTime=1000
   [junit4]   2> 573519 INFO  (zkCallback-2631-thread-2) [    ] o.a.s.c.c.ZkStateReader A cluster state change: [WatchedEvent state:SyncConnected type:NodeDataChanged path:/collections/collection1/state.json] for collection [collection1] has occurred - updating... (live nodes size: [4])
   [junit4]   2> 573519 INFO  (zkCallback-2644-thread-1) [    ] o.a.s.c.c.ZkStateReader A cluster state change: [WatchedEvent state:SyncConnected type:NodeDataChanged path:/collections/collection1/state.json] for collection [collection1] has occurred - updating... (live nodes size: [4])
   [junit4]   2> 573519 INFO  (zkCallback-2637-thread-1) [    ] o.a.s.c.c.ZkStateReader A cluster state change: [WatchedEvent state:SyncConnected type:NodeDataChanged path:/collections/collection1/state.json] for collection [collection1] has occurred - updating... (live nodes size: [4])
   [junit4]   2> 574424 INFO  (coreLoadExecutor-2742-thread-1) [    ] o.a.s.c.SolrConfig Using Lucene MatchVersion: 7.0.0
   [junit4]   2> 574434 INFO  (coreLoadExecutor-2742-thread-1) [    ] o.a.s.s.IndexSchema [collection1] Schema name=test
   [junit4]   2> 574503 WARN  (coreLoadExecutor-2742-thread-1) [    ] o.a.s.s.IndexSchema [collection1] default search field in schema is text. WARNING: Deprecated, please use 'df' on request instead.
   [junit4]   2> 574504 INFO  (coreLoadExecutor-2742-thread-1) [    ] o.a.s.s.IndexSchema Loaded schema test/1.0 with uniqueid field id
   [junit4]   2> 574509 INFO  (coreLoadExecutor-2742-thread-1) [    ] o.a.s.c.CoreContainer Creating SolrCore 'collection1' using configuration from collection collection1
   [junit4]   2> 574510 INFO  (coreLoadExecutor-2742-thread-1) [    ] o.a.s.c.SolrCore [[collection1] ] Opening new SolrCore at [/home/jenkins/workspace/Lucene-Solr-master-Linux/solr/build/solr-core/test/J1/temp/solr.cloud.PeerSyncReplicationTest_D034F5D8C42E161F-001/shard-3-001/cores/collection1], dataDir=[/home/jenkins/workspace/Lucene-Solr-master-Linux/solr/build/solr-core/test/J1/temp/solr.cloud.PeerSyncReplicationTest_D034F5D8C42E161F-001/shard-3-001/cores/collection1/data/]
   [junit4]   2> 574510 INFO  (coreLoadExecutor-2742-thread-1) [    ] o.a.s.c.JmxMonitoredMap JMX monitoring is enabled. Adding Solr mbeans to JMX Server: com.sun.jmx.mbeanserver.JmxMBeanServer@3d2aa98
   [junit4]   2> 574515 INFO  (coreLoadExecutor-2742-thread-1) [    ] o.a.s.u.RandomMergePolicy RandomMergePolicy wrapping class org.apache.lucene.index.LogByteSizeMergePolicy: [LogByteSizeMergePolicy: minMergeSize=1677721, mergeFactor=37, maxMergeSize=2147483648, maxMergeSizeForForcedMerge=9223372036854775807, calibrateSizeByDeletes=true, maxMergeDocs=2147483647, maxCFSSegmentSizeMB=8.796093022207999E12, noCFSRatio=1.0]
   [junit4]   2> 574563 WARN  (coreLoadExecutor-2742-thread-1) [    ] o.a.s.c.RequestHandlers INVALID paramSet a in requestHandler {type = requestHandler,name = /dump,class = DumpRequestHandler,attributes = {initParams=a, name=/dump, class=DumpRequestHandler},args = {defaults={a=A,b=B}}}
   [junit4]   2> 574571 INFO  (coreLoadExecutor-2742-thread-1) [    ] o.a.s.u.UpdateHandler Using UpdateLog implementation: org.apache.solr.update.UpdateLog
   [junit4]   2> 574571 INFO  (coreLoadExecutor-2742-thread-1) [    ] o.a.s.u.UpdateLog Initializing UpdateLog: dataDir= defaultSyncLevel=FLUSH numRecordsToKeep=1000 maxNumLogsToKeep=10 numVersionBuckets=65536
   [junit4]   2> 574572 INFO  (coreLoadExecutor-2742-thread-1) [    ] o.a.s.u.CommitTracker Hard AutoCommit: disabled
   [junit4]   2> 574572 INFO  (coreLoadExecutor-2742-thread-1) [    ] o.a.s.u.CommitTracker Soft AutoCommit: disabled
   [junit4]   2> 574573 INFO  (coreLoadExecutor-2742-thread-1) [    ] o.a.s.u.RandomMergePolicy RandomMergePolicy wrapping class org.apache.lucene.index.TieredMergePolicy: [TieredMergePolicy: maxMergeAtOnce=14, maxMergeAtOnceExplicit=18, maxMergedSegmentMB=43.69140625, floorSegmentMB=1.2529296875, forceMergeDeletesPctAllowed=1.1846590196726658, segmentsPerTier=13.0, maxCFSSegmentSizeMB=8.796093022207999E12, noCFSRatio=0.0
   [junit4]   2> 574574 INFO  (coreLoadExecutor-2742-thread-1) [    ] o.a.s.s.SolrIndexSearcher Opening [Searcher@4734bde8[collection1] main]
   [junit4]   2> 574575 INFO  (coreLoadExecutor-2742-thread-1) [    ] o.a.s.r.ManagedResourceStorage Configured ZooKeeperStorageIO with znodeBase: /configs/conf1
   [junit4]   2> 574575 INFO  (coreLoadExecutor-2742-thread-1) [    ] o.a.s.r.ManagedResourceStorage Loaded null at path _rest_managed.json using ZooKeeperStorageIO:path=/configs/conf1
   [junit4]   2> 574575 INFO  (coreLoadExecutor-2742-thread-1) [    ] o.a.s.h.ReplicationHandler Commits will be reserved for  10000
   [junit4]   2> 574576 INFO  (searcherExecutor-2743-thread-1) [    ] o.a.s.c.SolrCore [collection1] Registered new searcher Searcher@4734bde8[collection1] main{ExitableDirectoryReader(UninvertingDirectoryReader())}
   [junit4]   2> 574577 INFO  (coreLoadExecutor-2742-thread-1) [    ] o.a.s.u.UpdateLog Could not find max version in index or recent updates, using new clock 1557721011559858176
   [junit4]   2> 574580 INFO  (coreZkRegister-2737-thread-1) [    ] o.a.s.c.ZkController Core needs to recover:collection1
   [junit4]   2> 574580 INFO  (updateExecutor-2641-thread-1) [    ] o.a.s.u.DefaultSolrCoreState Running recovery
   [junit4]   2> 574580 INFO  (recoveryExecutor-2642-thread-1) [    ] o.a.s.c.RecoveryStrategy Starting recovery process. recoveringAfterStartup=true
   [junit4]   2> 574581 INFO  (recoveryExecutor-2642-thread-1) [    ] o.a.s.c.RecoveryStrategy ###### startupVersions=[[]]
   [junit4]   2> 574581 INFO  (recoveryExecutor-2642-thread-1) [    ] o.a.s.c.RecoveryStrategy Begin buffering updates. core=[collection1]
   [junit4]   2> 574581 INFO  (recoveryExecutor-2642-thread-1) [    ] o.a.s.u.UpdateLog Starting to buffer updates. FSUpdateLog{state=ACTIVE, tlog=null}
   [junit4]   2> 574581 INFO  (recoveryExecutor-2642-thread-1) [    ] o.a.s.c.RecoveryStrategy Publishing state of core [collection1] as recovering, leader is [https://127.0.0.1:46613/s/collection1/] and I am [https://127.0.0.1:42387/s/collection1/]
   [junit4]   2> 574582 INFO  (recoveryExecutor-2642-thread-1) [    ] o.a.s.c.RecoveryStrategy Sending prep recovery command to [https://127.0.0.1:46613/s]; [WaitForState: action=PREPRECOVERY&core=collection1&nodeName=127.0.0.1:42387_s&coreNodeName=core_node3&state=recovering&checkLive=true&onlyIfLeader=true&onlyIfLeaderActive=true]
   [junit4]   2> 574585 INFO  (qtp107714239-11361) [    ] o.a.s.h.a.PrepRecoveryOp Going to wait for coreNodeName: core_node3, state: recovering, checkLive: true, onlyIfLeader: true, onlyIfLeaderActive: true
   [junit4]   2> 574585 INFO  (qtp107714239-11361) [    ] o.a.s.h.a.PrepRecoveryOp Will wait a max of 183 seconds to see collection1 (shard1 of collection1) have state: recovering
   [junit4]   2> 574585 INFO  (qtp107714239-11361) [    ] o.a.s.h.a.PrepRecoveryOp In WaitForState(recovering): collection=collection1, shard=shard1, thisCore=collection1, leaderDoesNotNeedRecovery=false, isLeader? true, live=true, checkLive=true, currentState=down, localState=active, nodeName=127.0.0.1:42387_s, coreNodeName=core_node3, onlyIfActiveCheckResult=false, nodeProps: core_node3:{"core":"collection1","base_url":"https://127.0.0.1:42387/s","node_name":"127.0.0.1:42387_s","state":"down"}
   [junit4]   2> 574683 INFO  (zkCallback-2644-thread-1) [    ] o.a.s.c.c.ZkStateReader A cluster state change: [WatchedEvent state:SyncConnected type:NodeDataChanged path:/collections/collection1/state.json] for collection [collection1] has occurred - updating... (live nodes size: [4])
   [junit4]   2> 574683 INFO  (zkCallback-2637-thread-1) [    ] o.a.s.c.c.ZkStateReader A cluster state change: [WatchedEvent state:SyncConnected type:NodeDataChanged path:/collections/collection1/state.json] for collection [collection1] has occurred - updating... (live nodes size: [4])
   [junit4]   2> 574683 INFO  (zkCallback-2631-thread-2) [    ] o.a.s.c.c.ZkStateReader A cluster state change: [WatchedEvent state:SyncConnected type:NodeDataChanged path:/collections/collection1/state.json] for collection [collection1] has occurred - updating... (live nodes size: [4])
   [junit4]   2> 575043 INFO  (TEST-PeerSyncReplicationTest.test-seed#[D034F5D8C42E161F]) [    ] o.a.s.SolrTestCaseJ4 ###Starting test
   [junit4]   2> 575043 INFO  (TEST-PeerSyncReplicationTest.test-seed#[D034F5D8C42E161F]) [    ] o.a.s.c.AbstractFullDistribZkTestBase Wait for recoveries to finish - wait 30 for each attempt
   [junit4]   2> 575043 INFO  (TEST-PeerSyncReplicationTest.test-seed#[D034F5D8C42E161F]) [    ] o.a.s.c.AbstractDistribZkTestBase Wait for recoveries to finish - collection: collection1 failOnTimeout:true timeout (sec):30
   [junit4]   2> 575585 INFO  (qtp107714239-11361) [    ] o.a.s.h.a.PrepRecoveryOp In WaitForState(recovering): collection=collection1, shard=shard1, thisCore=collection1, leaderDoesNotNeedRecovery=false, isLeader? true, live=true, checkLive=true, currentState=recovering, localState=active, nodeName=127.0.0.1:42387_s, coreNodeName=core_node3, onlyIfActiveCheckResult=false, nodeProps: core_node3:{"core":"collection1","base_url":"https://127.0.0.1:42387/s","node_name":"127.0.0.1:42387_s","state":"recovering"}
   [junit4]   2> 575586 INFO  (qtp107714239-11361) [    ] o.a.s.h.a.PrepRecoveryOp Waited coreNodeName: core_node3, state: recovering, checkLive: true, onlyIfLeader: true for: 1 seconds.
   [junit4]   2> 575586 INFO  (qtp107714239-11361) [    ] o.a.s.s.HttpSolrCall [admin] webapp=null path=/admin/cores params={nodeName=127.0.0.1:42387_s&onlyIfLeaderActive=true&core=collection1&coreNodeName=core_node3&action=PREPRECOVERY&checkLive=true&state=recovering&onlyIfLeader=true&wt=javabin&version=2} status=0 QTime=1000
   [junit4]   2> 580470 INFO  (recoveryExecutor-2635-thread-1) [    ] o.a.s.c.RecoveryStrategy Attempting to PeerSync from [https://127.0.0.1:46613/s/collection1/] - recoveringAfterStartup=[true]
   [junit4]   2> 580470 INFO  (recoveryExecutor-2635-thread-1) [    ] o.a.s.u.PeerSync PeerSync: core=collection1 url=https://127.0.0.1:34554/s START replicas=[https://127.0.0.1:46613/s/collection1/] nUpdates=1000
   [junit4]   2> 580475 INFO  (qtp107714239-11356) [    ] o.a.s.u.IndexFingerprint IndexFingerprint millis:1.0 result:{maxVersionSpecified=9223372036854775807, maxVersionEncountered=0, maxInHash=0, versionsHash=0, numVersions=0, numDocs=0, maxDoc=0}
   [junit4]   2> 580475 INFO  (qtp107714239-11356) [    ] o.a.s.c.S.Request [collection1]  webapp=/s path=/get params={distrib=false&qt=/get&getFingerprint=9223372036854775807&wt=javabin&version=2} status=0 QTime=2
   [junit4]   2> 580478 INFO  (recoveryExecutor-2635-thread-1) [    ] o.a.s.u.IndexFingerprint IndexFingerprint millis:0.0 result:{maxVersionSpecified=9223372036854775807, maxVersionEncountered=0, maxInHash=0, versionsHash=0, numVersions=0, numDocs=0, maxDoc=0}
   [junit4]   2> 580478 INFO  (recoveryExecutor-2635-thread-1) [    ] o.a.s.u.PeerSync We are already in sync. No need to do a PeerSync 
   [junit4]   2> 580478 INFO  (recoveryExecutor-2635-thread-1) [    ] o.a.s.u.DirectUpdateHandler2 start commit{,optimize=false,openSearcher=true,waitSearcher=true,expungeDeletes=false,softCommit=false,prepareCommit=false}
   [junit4]   2> 580478 INFO  (recoveryExecutor-2635-thread-1) [    ] o.a.s.u.DirectUpdateHandler2 No uncommitted changes. Skipping IW.commit.
   [junit4]   2> 580478 INFO  (recoveryExecutor-2635-thread-1) [    ] o.a.s.u.DirectUpdateHandler2 end_commit_flush
   [junit4]   2> 580478 INFO  (recoveryExecutor-2635-thread-1) [    ] o.a.s.c.RecoveryStrategy PeerSync stage of recovery was successful.
   [junit4]   2> 580478 INFO  (recoveryExecutor-2635-thread-1) [    ] o.a.s.c.RecoveryStrategy Replaying updates buffered during PeerSync.
   [junit4]   2> 580478 INFO  (recoveryExecutor-2635-thread-1) [    ] o.a.s.c.RecoveryStrategy No replay needed.
   [junit4]   2> 580478 INFO  (recoveryExecutor-2635-thread-1) [    ] o.a.s.c.RecoveryStrategy Registering as Active after recovery.
   [junit4]   2> 580481 INFO  (zkCallback-2644-thread-1) [    ] o.a.s.c.c.ZkStateReader A cluster state change: [WatchedEvent state:SyncConnected type:NodeDataChanged path:/collections/collection1/state.json] for collection [collection1] has occurred - updating... (live nodes size: [4])
   [junit4]   2> 580481 INFO  (zkCallback-2631-thread-2) [    ] o.a.s.c.c.ZkStateReader A cluster state change: [WatchedEvent state:SyncConnected type:NodeDataChanged path:/collections/collection1/state.json] for collection [collection1] has occurred - updating... (live nodes size: [4])
   [junit4]   2> 580481 INFO  (zkCallback-2637-thread-1) [    ] o.a.s.c.c.ZkStateReader A cluster state change: [WatchedEvent state:SyncConnected type:NodeDataChanged path:/collections/collection1/state.json] for collection [collection1] has occurred - updating... (live nodes size: [4])
   [junit4]   2> 582586 INFO  (recoveryExecutor-2642-thread-1) [    ] o.a.s.c.RecoveryStrategy Attempting to PeerSync from [https://127.0.0.1:46613/s/collection1/] - recoveringAfterStartup=[true]
   [junit4]   2> 582586 INFO  (recoveryExecutor-2642-thread-1) [    ] o.a.s.u.PeerSync PeerSync: core=collection1 url=https://127.0.0.1:42387/s START replicas=[https://127.0.0.1:46613/s/collection1/] nUpdates=1000
   [junit4]   2> 582590 INFO  (qtp107714239-11357) [    ] o.a.s.u.IndexFingerprint IndexFingerprint millis:0.0 result:{maxVersionSpecified=9223372036854775807, maxVersionEncountered=0, maxInHash=0, versionsHash=0, numVersions=0, numDocs=0, maxDoc=0}
   [junit4]   2> 582590 INFO  (qtp107714239-11357) [    ] o.a.s.c.S.Request [collection1]  webapp=/s path=/get params={distrib=false&qt=/get&getFingerprint=9223372036854775807&wt=javabin&version=2} status=0 QTime=1
   [junit4]   2> 582591 INFO  (recoveryExecutor-2642-thread-1) [    ] o.a.s.u.IndexFingerprint IndexFingerprint millis:1.0 result:{maxVersionSpecified=9223372036854775807, maxVersionEncountered=0, maxInHash=0, versionsHash=0, numVersions=0, numDocs=0, maxDoc=0}
   [junit4]   2> 582591 INFO  (recoveryExecutor-2642-thread-1) [    ] o.a.s.u.PeerSync We are already in sync. No need to do a PeerSync 
   [junit4]   2> 582591 INFO  (recoveryExecutor-2642-thread-1) [    ] o.a.s.u.DirectUpdateHandler2 start commit{,optimize=false,openSearcher=true,waitSearcher=true,expungeDeletes=false,softCommit=false,prepareCommit=false}
   [junit4]   2> 582591 INFO  (recoveryExecutor-2642-thread-1) [    ] o.a.s.u.DirectUpdateHandler2 No uncommitted changes. Skipping IW.commit.
   [junit4]   2> 582592 INFO  (recoveryExecutor-2642-thread-1) [    ] o.a.s.u.DirectUpdateHandler2 end_commit_flush
   [junit4]   2> 582592 INFO  (recoveryExecutor-2642-thread-1) [    ] o.a.s.c.RecoveryStrategy PeerSync stage of recovery was successful.
   [junit4]   2> 582592 INFO  (recoveryExecutor-2642-thread-1) [    ] o.a.s.c.RecoveryStrategy Replaying updates buffered during PeerSync.
   [junit4]   2> 582592 INFO  (recoveryExecutor-2642-thread-1) [    ] o.a.s.c.RecoveryStrategy No replay needed.
   [junit4]   2> 582592 INFO  (recoveryExecutor-2642-thread-1) [    ] o.a.s.c.RecoveryStrategy Registering as Active after recovery.
   [junit4]   2> 582593 INFO  (zkCallback-2637-thread-1) [    ] o.a.s.c.c.ZkStateReader A cluster state change: [WatchedEvent state:SyncConnected type:NodeDataChanged path:/collections/collection1/state.json] for collection [collection1] has occurred - updating... (live nodes size: [4])
   [junit4]   2> 582593 INFO  (zkCallback-2631-thread-2) [    ] o.a.s.c.c.ZkStateReader A cluster state change: [WatchedEvent state:SyncConnected type:NodeDataChanged path:/collections/collection1/state.json] for collection [collection1] has occurred - updating... (live nodes size: [4])
   [junit4]   2> 582593 INFO  (zkCallback-2644-thread-1) [    ] o.a.s.c.c.ZkStateReader A cluster state change: [WatchedEvent state:SyncConnected type:NodeDataChanged path:/collections/collection1/state.json] for collection [collection1] has occurred - updating... (live nodes size: [4])
   [junit4]   2> 583046 INFO  (TEST-PeerSyncReplicationTest.test-seed#[D034F5D8C42E161F]) [    ] o.a.s.c.AbstractDistribZkTestBase Recoveries finished - collection: collection1
   [junit4]   2> 583059 INFO  (qtp241010296-11323) [    ] o.a.s.u.DirectUpdateHandler2 start commit{,optimize=false,openSearcher=true,waitSearcher=true,expungeDeletes=false,softCommit=false,prepareCommit=false}
   [junit4]   2> 583059 INFO  (qtp241010296-11323) [    ] o.a.s.u.DirectUpdateHandler2 No uncommitted changes. Skipping IW.commit.
   [junit4]   2> 583060 INFO  (qtp241010296-11323) [    ] o.a.s.u.DirectUpdateHandler2 end_commit_flush
   [junit4]   2> 583060 INFO  (qtp241010296-11323) [    ] o.a.s.u.p.LogUpdateProcessorFactory [collection1]  webapp=/s path=/update params={waitSearcher=true&commit=true&softCommit=false&wt=javabin&version=2}{commit=} 0 1
   [junit4]   2> 583068 INFO  (qtp107714239-11360) [    ] o.a.s.u.DirectUpdateHandler2 start commit{,optimize=false,openSearcher=true,waitSearcher=true,expungeDeletes=false,softCommit=false,prepareCommit=false}
   [junit4]   2> 583068 INFO  (qtp107714239-11360) [    ] o.a.s.u.DirectUpdateHandler2 No uncommitted changes. Skipping IW.commit.
   [junit4]   2> 583069 INFO  (qtp107714239-11360) [    ] o.a.s.u.DirectUpdateHandler2 end_commit_flush
   [junit4]   2> 583069 INFO  (qtp107714239-11360) [    ] o.a.s.u.p.LogUpdateProcessorFactory [collection1]  webapp=/s path=/update params={update.distrib=FROMLEADER&waitSearcher=true&openSearcher=true&commit=true&softCommit=false&distrib.from=https://127.0.0.1:46613/s/collection1/&commit_end_point=true&wt=javabin&version=2&expungeDeletes=false}{commit=} 0 0
   [junit4]   2> 583084 INFO  (qtp1421782696-11427) [    ] o.a.s.u.DirectUpdateHandler2 start commit{,optimize=false,openSearcher=true,waitSearcher=true,expungeDeletes=false,softCommit=false,prepareCommit=false}
   [junit4]   2> 583084 INFO  (qtp1421782696-11427) [    ] o.a.s.u.DirectUpdateHandler2 No uncommitted changes. Skipping IW.commit.
   [junit4]   2> 583084 INFO  (qtp1472367517-11384) [    ] o.a.s.u.DirectUpdateHandler2 start commit{,optimize=false,openSearcher=true,waitSearcher=true,expungeDeletes=false,softCommit=false,prepareCommit=false}
   [junit4]   2> 583084 INFO  (qtp1472367517-11384) [    ] o.a.s.u.DirectUpdateHandler2 No uncommitted changes. Skipping IW.commit.
   [junit4]   2> 583084 INFO  (qtp1421782696-11427) [    ] o.a.s.u.DirectUpdateHandler2 end_commit_flush
   [junit4]   2> 583084 INFO  (qtp1421782696-11427) [    ] o.a.s.u.p.LogUpdateProcessorFactory [collection1]  webapp=/s path=/update params={update.distrib=FROMLEADER&waitSearcher=true&openSearcher=true&commit=true&softCommit=false&distrib.from=https://127.0.0.1:46613/s/collection1/&commit_end_point=true&wt=javabin&version=2&expungeDeletes=false}{commit=} 0 0
   [junit4]   2> 583085 INFO  (qtp1472367517-11384) [    ] o.a.s.u.DirectUpdateHandler2 end_commit_flush
   [junit4]   2> 583085 INFO  (qtp1472367517-11384) [    ] o.a.s.u.p.LogUpdateProcessorFactory [collection1]  webapp=/s path=/update params={update.distrib=FROMLEADER&waitSearcher=true&openSearcher=true&commit=true&softCommit=false&distrib.from=https://127.0.0.1:46613/s/collection1/&commit_end_point=true&wt=javabin&version=2&expungeDeletes=false}{commit=} 0 1
   [junit4]   2> 583085 INFO  (qtp107714239-11357) 

[...truncated too long message...]

[2.0] seconds before trying to recover again (attempt=1)
   [junit4]   2> 771634 WARN  (zkCallback-2631-thread-3) [    ] o.a.s.c.c.ZkStateReader ZooKeeper watch triggered, but Solr cannot talk to ZK: [KeeperErrorCode = Session expired for /live_nodes]
   [junit4]   2> 771634 INFO  (TEST-PeerSyncReplicationTest.test-seed#[D034F5D8C42E161F]) [    ] o.a.s.m.SolrMetricManager Closing metric reporters for: solr.node
   [junit4]   2> 771635 INFO  (TEST-PeerSyncReplicationTest.test-seed#[D034F5D8C42E161F]) [    ] o.e.j.s.AbstractConnector Stopped ServerConnector@6a2af01d{SSL,[ssl, http/1.1]}{127.0.0.1:0}
   [junit4]   2> 771635 INFO  (TEST-PeerSyncReplicationTest.test-seed#[D034F5D8C42E161F]) [    ] o.e.j.s.h.ContextHandler Stopped o.e.j.s.ServletContextHandler@2118a464{/s,null,UNAVAILABLE}
   [junit4]   2> 771636 INFO  (TEST-PeerSyncReplicationTest.test-seed#[D034F5D8C42E161F]) [    ] o.a.s.c.ChaosMonkey monkey: stop shard! 34554
   [junit4]   2> 771636 INFO  (TEST-PeerSyncReplicationTest.test-seed#[D034F5D8C42E161F]) [    ] o.a.s.c.CoreContainer Shutting down CoreContainer instance=1845716006
   [junit4]   2> 771638 WARN  (TEST-PeerSyncReplicationTest.test-seed#[D034F5D8C42E161F]) [    ] o.a.s.c.RecoveryStrategy Stopping recovery for core=[collection1] coreNodeName=[core_node2]
   [junit4]   2> 771639 WARN  (updateExecutor-2648-thread-2) [    ] o.a.s.u.DefaultSolrCoreState Skipping recovery because Solr is shutdown
   [junit4]   2> 771741 INFO  (zkCallback-2651-thread-3) [    ] o.a.s.c.c.ZkStateReader A cluster state change: [WatchedEvent state:SyncConnected type:NodeDataChanged path:/collections/collection1/state.json] for collection [collection1] has occurred - updating... (live nodes size: [1])
   [junit4]   2> 775135 INFO  (zkCallback-2651-thread-4) [    ] o.a.s.c.c.ZkStateReader A cluster state change: [WatchedEvent state:SyncConnected type:NodeDataChanged path:/collections/collection1/state.json] for collection [collection1] has occurred - updating... (live nodes size: [1])
   [junit4]   2> 775496 INFO  (recoveryExecutor-2649-thread-1) [    ] o.a.s.c.RecoveryStrategy RecoveryStrategy has been closed
   [junit4]   2> 775496 INFO  (recoveryExecutor-2649-thread-1) [    ] o.a.s.c.RecoveryStrategy Finished recovery process, successful=[false]
   [junit4]   2> 775496 INFO  (recoveryExecutor-2649-thread-1) [    ] o.a.s.c.SolrCore [collection1]  CLOSING SolrCore org.apache.solr.core.SolrCore@7377745d
   [junit4]   2> 775497 WARN  (recoveryExecutor-2649-thread-1) [    ] o.a.s.c.RecoveryStrategy Stopping recovery for core=[collection1] coreNodeName=[core_node2]
   [junit4]   2> 775547 INFO  (recoveryExecutor-2649-thread-1) [    ] o.a.s.m.SolrMetricManager Closing metric reporters for: solr.core.collection1
   [junit4]   2> 775547 INFO  (TEST-PeerSyncReplicationTest.test-seed#[D034F5D8C42E161F]) [    ] o.a.s.c.Overseer Overseer (id=97357562669301779-127.0.0.1:34554_s-n_0000000004) closing
   [junit4]   2> 775547 INFO  (OverseerStateUpdate-97357562669301779-127.0.0.1:34554_s-n_0000000004) [    ] o.a.s.c.Overseer Overseer Loop exiting : 127.0.0.1:34554_s
   [junit4]   2> 775548 WARN  (zkCallback-2651-thread-4) [    ] o.a.s.c.c.ZkStateReader ZooKeeper watch triggered, but Solr cannot talk to ZK: [KeeperErrorCode = Session expired for /live_nodes]
   [junit4]   2> 775548 INFO  (TEST-PeerSyncReplicationTest.test-seed#[D034F5D8C42E161F]) [    ] o.a.s.m.SolrMetricManager Closing metric reporters for: solr.node
   [junit4]   2> 775548 INFO  (TEST-PeerSyncReplicationTest.test-seed#[D034F5D8C42E161F]) [    ] o.e.j.s.AbstractConnector Stopped ServerConnector@30fee4f9{SSL,[ssl, http/1.1]}{127.0.0.1:34554}
   [junit4]   2> 775548 INFO  (TEST-PeerSyncReplicationTest.test-seed#[D034F5D8C42E161F]) [    ] o.e.j.s.h.ContextHandler Stopped o.e.j.s.ServletContextHandler@197acea7{/s,null,UNAVAILABLE}
   [junit4]   2> 775548 INFO  (TEST-PeerSyncReplicationTest.test-seed#[D034F5D8C42E161F]) [    ] o.a.s.c.ChaosMonkey monkey: stop shard! 42387
   [junit4]   2> 775549 INFO  (TEST-PeerSyncReplicationTest.test-seed#[D034F5D8C42E161F]) [    ] o.a.s.c.ZkTestServer connecting to 127.0.0.1:43176 43176
   [junit4]   2> 775689 INFO  (Thread-1014) [    ] o.a.s.c.ZkTestServer connecting to 127.0.0.1:43176 43176
   [junit4]   2> 775690 WARN  (Thread-1014) [    ] o.a.s.c.ZkTestServer Watch limit violations: 
   [junit4]   2> Maximum concurrent create/delete watches above limit:
   [junit4]   2> 
   [junit4]   2> 	6	/solr/aliases.json
   [junit4]   2> 	5	/solr/security.json
   [junit4]   2> 	5	/solr/configs/conf1
   [junit4]   2> 
   [junit4]   2> Maximum concurrent data watches above limit:
   [junit4]   2> 
   [junit4]   2> 	6	/solr/clusterstate.json
   [junit4]   2> 	6	/solr/clusterprops.json
   [junit4]   2> 	4	/solr/collections/collection1/state.json
   [junit4]   2> 	2	/solr/collections/collection1/leader_elect/shard1/election/97357562669301770-core_node1-n_0000000000
   [junit4]   2> 	2	/solr/overseer_elect/election/97357562669301770-127.0.0.1:46613_s-n_0000000001
   [junit4]   2> 
   [junit4]   2> Maximum concurrent children watches above limit:
   [junit4]   2> 
   [junit4]   2> 	207	/solr/overseer/collection-queue-work
   [junit4]   2> 	26	/solr/overseer/queue
   [junit4]   2> 	18	/solr/overseer/queue-work
   [junit4]   2> 	6	/solr/collections
   [junit4]   2> 	5	/solr/live_nodes
   [junit4]   2> 
   [junit4]   2> NOTE: reproduce with: ant test  -Dtestcase=PeerSyncReplicationTest -Dtests.method=test -Dtests.seed=D034F5D8C42E161F -Dtests.multiplier=3 -Dtests.slow=true -Dtests.locale=ff-MR -Dtests.timezone=Antarctica/Palmer -Dtests.asserts=true -Dtests.file.encoding=UTF-8
   [junit4] FAILURE  210s J1 | PeerSyncReplicationTest.test <<<
   [junit4]    > Throwable #1: java.lang.AssertionError: timeout waiting to see all nodes active
   [junit4]    > 	at __randomizedtesting.SeedInfo.seed([D034F5D8C42E161F:5860CA026AD27BE7]:0)
   [junit4]    > 	at org.apache.solr.cloud.PeerSyncReplicationTest.waitTillNodesActive(PeerSyncReplicationTest.java:326)
   [junit4]    > 	at org.apache.solr.cloud.PeerSyncReplicationTest.bringUpDeadNodeAndEnsureNoReplication(PeerSyncReplicationTest.java:277)
   [junit4]    > 	at org.apache.solr.cloud.PeerSyncReplicationTest.forceNodeFailureAndDoPeerSync(PeerSyncReplicationTest.java:259)
   [junit4]    > 	at org.apache.solr.cloud.PeerSyncReplicationTest.test(PeerSyncReplicationTest.java:138)
   [junit4]    > 	at java.base/jdk.internal.reflect.NativeMethodAccessorImpl.invoke0(Native Method)
   [junit4]    > 	at java.base/jdk.internal.reflect.NativeMethodAccessorImpl.invoke(NativeMethodAccessorImpl.java:62)
   [junit4]    > 	at java.base/jdk.internal.reflect.DelegatingMethodAccessorImpl.invoke(DelegatingMethodAccessorImpl.java:43)
   [junit4]    > 	at java.base/java.lang.reflect.Method.invoke(Method.java:543)
   [junit4]    > 	at org.apache.solr.BaseDistributedSearchTestCase$ShardsRepeatRule$ShardsFixedStatement.callStatement(BaseDistributedSearchTestCase.java:985)
   [junit4]    > 	at org.apache.solr.BaseDistributedSearchTestCase$ShardsRepeatRule$ShardsStatement.evaluate(BaseDistributedSearchTestCase.java:960)
   [junit4]    > 	at java.base/java.lang.Thread.run(Thread.java:844)
   [junit4]   2> 775691 INFO  (SUITE-PeerSyncReplicationTest-seed#[D034F5D8C42E161F]-worker) [    ] o.a.s.SolrTestCaseJ4 ###deleteCore
   [junit4]   2> NOTE: leaving temporary files on disk at: /home/jenkins/workspace/Lucene-Solr-master-Linux/solr/build/solr-core/test/J1/temp/solr.cloud.PeerSyncReplicationTest_D034F5D8C42E161F-001
   [junit4]   2> Jan 27, 2017 11:12:01 PM com.carrotsearch.randomizedtesting.ThreadLeakControl checkThreadLeaks
   [junit4]   2> WARNING: Will linger awaiting termination of 1 leaked thread(s).
   [junit4]   2> NOTE: test params are: codec=FastCompressingStoredFields(storedFieldsFormat=CompressingStoredFieldsFormat(compressionMode=FAST, chunkSize=11760, maxDocsPerChunk=441, blockSize=8), termVectorsFormat=CompressingTermVectorsFormat(compressionMode=FAST, chunkSize=11760, blockSize=8)), sim=RandomSimilarity(queryNorm=false): {}, locale=ff-MR, timezone=Antarctica/Palmer
   [junit4]   2> NOTE: Linux 4.4.0-53-generic amd64/Oracle Corporation 9-ea (64-bit)/cpus=12,threads=1,free=344748472,total=533725184
   [junit4]   2> NOTE: All tests run in this JVM: [CoreSorterTest, IndexSchemaRuntimeFieldTest, TestSerializedLuceneMatchVersion, TestGraphMLResponseWriter, DistributedFacetExistsSmallTest, TestUninvertingReader, TestLegacyFieldCache, CollectionsAPIAsyncDistributedZkTest, IgnoreCommitOptimizeUpdateProcessorFactoryTest, TestConfigSets, BasicFunctionalityTest, SpellCheckCollatorTest, TestUnifiedSolrHighlighter, TestFieldCacheSortRandom, DistribJoinFromCollectionTest, TestSSLRandomization, TestMinMaxOnMultiValuedField, SolrIndexMetricsTest, TestCryptoKeys, TimeZoneUtilsTest, TestFreeTextSuggestions, MetricsHandlerTest, TestHdfsUpdateLog, LeaderElectionContextKeyTest, TestCopyFieldCollectionResource, SOLR749Test, OpenExchangeRatesOrgProviderTest, RollingRestartTest, TestSystemIdResolver, FileUtilsTest, ReplaceNodeTest, BaseCdcrDistributedZkTest, TestSearchPerf, CollectionsAPIDistributedZkTest, TestFiltering, TestBM25SimilarityFactory, TestInitParams, TestNonDefinedSimilarityFactory, TestFieldCacheReopen, TestDownShardTolerantSearch, BadComponentTest, BlockJoinFacetSimpleTest, TestXIncludeConfig, TestPKIAuthenticationPlugin, TestSolrCoreParser, HdfsBasicDistributedZk2Test, TestDistributedGrouping, TestStressLiveNodes, TestRestoreCore, QueryParsingTest, CSVRequestHandlerTest, TestSurroundQueryParser, DOMUtilTest, ConvertedLegacyTest, TestExactStatsCache, DocValuesNotIndexedTest, SortSpecParsingTest, SoftAutoCommitTest, DirectSolrSpellCheckerTest, TestCoreContainer, LeaderInitiatedRecoveryOnCommitTest, TestReplicaProperties, TestCustomDocTransformer, CustomCollectionTest, TestDelegationWithHadoopAuth, PeerSyncReplicationTest]
   [junit4] Completed [203/684 (2!)] on J1 in 209.84s, 1 test, 1 failure <<< FAILURES!

[...truncated 53080 lines...]


Mime
View raw message