lucene-dev mailing list archives

Site index · List index
Message view « Date » · « Thread »
Top « Date » · « Thread »
From Policeman Jenkins Server <jenk...@thetaphi.de>
Subject [JENKINS] Lucene-Solr-master-Linux (64bit/jdk1.8.0_112) - Build # 18717 - Unstable!
Date Sat, 07 Jan 2017 08:40:03 GMT
Build: https://jenkins.thetaphi.de/job/Lucene-Solr-master-Linux/18717/
Java: 64bit/jdk1.8.0_112 -XX:-UseCompressedOops -XX:+UseConcMarkSweepGC

2 tests failed.
FAILED:  junit.framework.TestSuite.org.apache.lucene.codecs.lucene70.TestLucene70DocValuesFormat

Error Message:
Suite timeout exceeded (>= 7200000 msec).

Stack Trace:
java.lang.Exception: Suite timeout exceeded (>= 7200000 msec).
	at __randomizedtesting.SeedInfo.seed([EC1BB8EBF423DABB]:0)


FAILED:  org.apache.lucene.codecs.lucene70.TestLucene70DocValuesFormat.testSparseShortNumericsVsStoredFields

Error Message:
Test abandoned because suite timeout was reached.

Stack Trace:
java.lang.Exception: Test abandoned because suite timeout was reached.
	at __randomizedtesting.SeedInfo.seed([EC1BB8EBF423DABB]:0)




Build Log:
[...truncated 1658 lines...]
   [junit4] JVM J2: stdout was not empty, see: /home/jenkins/workspace/Lucene-Solr-master-Linux/lucene/build/core/test/temp/junit4-J2-20170107_053119_492.sysout
   [junit4] >>> JVM J2 emitted unexpected output (verbatim) ----
   [junit4] Default case invoked for: 
   [junit4]    opcode  = 0, "Node"
   [junit4] Default case invoked for: 
   [junit4]    opcode  = 0, "Node"
   [junit4] Default case invoked for: 
   [junit4]    opcode  = 200, "Phi"
   [junit4] <<< JVM J2: EOF ----

[...truncated 116 lines...]
   [junit4] Suite: org.apache.lucene.codecs.lucene70.TestLucene70DocValuesFormat
   [junit4] IGNOR/A 0.00s J1 | TestLucene70DocValuesFormat.testSortedSetVariableLengthManyVsStoredFields
   [junit4]    > Assumption #1: 'nightly' test group is disabled (@Nightly())
   [junit4] IGNOR/A 0.00s J1 | TestLucene70DocValuesFormat.testSortedVariableLengthManyVsStoredFields
   [junit4]    > Assumption #1: 'nightly' test group is disabled (@Nightly())
   [junit4] IGNOR/A 0.00s J1 | TestLucene70DocValuesFormat.testTermsEnumRandomMany
   [junit4]    > Assumption #1: 'nightly' test group is disabled (@Nightly())
   [junit4]   2> Jan 07, 2017 10:36:03 AM com.carrotsearch.randomizedtesting.ThreadLeakControl$2
evaluate
   [junit4]   2> WARNING: Suite execution timed out: org.apache.lucene.codecs.lucene70.TestLucene70DocValuesFormat
   [junit4]   2>    1) Thread[id=1, name=main, state=WAITING, group=main]
   [junit4]   2>         at java.lang.Object.wait(Native Method)
   [junit4]   2>         at java.lang.Thread.join(Thread.java:1249)
   [junit4]   2>         at java.lang.Thread.join(Thread.java:1323)
   [junit4]   2>         at com.carrotsearch.randomizedtesting.RandomizedRunner.runSuite(RandomizedRunner.java:608)
   [junit4]   2>         at com.carrotsearch.randomizedtesting.RandomizedRunner.run(RandomizedRunner.java:457)
   [junit4]   2>         at com.carrotsearch.ant.tasks.junit4.slave.SlaveMain.execute(SlaveMain.java:243)
   [junit4]   2>         at com.carrotsearch.ant.tasks.junit4.slave.SlaveMain.main(SlaveMain.java:354)
   [junit4]   2>         at com.carrotsearch.ant.tasks.junit4.slave.SlaveMainSafe.main(SlaveMainSafe.java:10)
   [junit4]   2>    2) Thread[id=11, name=JUnit4-serializer-daemon, state=TIMED_WAITING,
group=main]
   [junit4]   2>         at java.lang.Thread.sleep(Native Method)
   [junit4]   2>         at com.carrotsearch.ant.tasks.junit4.events.Serializer$1.run(Serializer.java:50)
   [junit4]   2>    3) Thread[id=1882, name=SUITE-TestLucene70DocValuesFormat-seed#[EC1BB8EBF423DABB],
state=RUNNABLE, group=TGRP-TestLucene70DocValuesFormat]
   [junit4]   2>         at java.lang.Thread.getStackTrace(Thread.java:1556)
   [junit4]   2>         at com.carrotsearch.randomizedtesting.ThreadLeakControl$4.run(ThreadLeakControl.java:690)
   [junit4]   2>         at com.carrotsearch.randomizedtesting.ThreadLeakControl$4.run(ThreadLeakControl.java:687)
   [junit4]   2>         at java.security.AccessController.doPrivileged(Native Method)
   [junit4]   2>         at com.carrotsearch.randomizedtesting.ThreadLeakControl.getStackTrace(ThreadLeakControl.java:687)
   [junit4]   2>         at com.carrotsearch.randomizedtesting.ThreadLeakControl.getThreadsWithTraces(ThreadLeakControl.java:703)
   [junit4]   2>         at com.carrotsearch.randomizedtesting.ThreadLeakControl.formatThreadStacksFull(ThreadLeakControl.java:683)
   [junit4]   2>         at com.carrotsearch.randomizedtesting.ThreadLeakControl.access$1000(ThreadLeakControl.java:64)
   [junit4]   2>         at com.carrotsearch.randomizedtesting.ThreadLeakControl$2.evaluate(ThreadLeakControl.java:415)
   [junit4]   2>         at com.carrotsearch.randomizedtesting.RandomizedRunner.runSuite(RandomizedRunner.java:678)
   [junit4]   2>         at com.carrotsearch.randomizedtesting.RandomizedRunner.access$200(RandomizedRunner.java:140)
   [junit4]   2>         at com.carrotsearch.randomizedtesting.RandomizedRunner$2.run(RandomizedRunner.java:598)
   [junit4]   2>    4) Thread[id=1883, name=TEST-TestLucene70DocValuesFormat.testSparseShortNumericsVsStoredFields-seed#[EC1BB8EBF423DABB],
state=TIMED_WAITING, group=TGRP-TestLucene70DocValuesFormat]
   [junit4]   2>         at java.lang.Object.wait(Native Method)
   [junit4]   2>         at org.apache.lucene.index.IndexWriter.doWait(IndexWriter.java:4551)
   [junit4]   2>         at org.apache.lucene.index.IndexWriter.forceMerge(IndexWriter.java:1931)
   [junit4]   2>         at org.apache.lucene.index.IndexWriter.forceMerge(IndexWriter.java:1865)
   [junit4]   2>         at org.apache.lucene.index.RandomIndexWriter.forceMerge(RandomIndexWriter.java:429)
   [junit4]   2>         at org.apache.lucene.index.BaseDocValuesFormatTestCase.doTestNumericsVsStoredFields(BaseDocValuesFormatTestCase.java:1230)
   [junit4]   2>         at org.apache.lucene.index.BaseDocValuesFormatTestCase.testSparseShortNumericsVsStoredFields(BaseDocValuesFormatTestCase.java:1365)
   [junit4]   2>         at sun.reflect.NativeMethodAccessorImpl.invoke0(Native Method)
   [junit4]   2>         at sun.reflect.NativeMethodAccessorImpl.invoke(NativeMethodAccessorImpl.java:62)
   [junit4]   2>         at sun.reflect.DelegatingMethodAccessorImpl.invoke(DelegatingMethodAccessorImpl.java:43)
   [junit4]   2>         at java.lang.reflect.Method.invoke(Method.java:498)
   [junit4]   2>         at com.carrotsearch.randomizedtesting.RandomizedRunner.invoke(RandomizedRunner.java:1713)
   [junit4]   2>         at com.carrotsearch.randomizedtesting.RandomizedRunner$8.evaluate(RandomizedRunner.java:907)
   [junit4]   2>         at com.carrotsearch.randomizedtesting.RandomizedRunner$9.evaluate(RandomizedRunner.java:943)
   [junit4]   2>         at com.carrotsearch.randomizedtesting.RandomizedRunner$10.evaluate(RandomizedRunner.java:957)
   [junit4]   2>         at org.apache.lucene.util.TestRuleSetupTeardownChained$1.evaluate(TestRuleSetupTeardownChained.java:49)
   [junit4]   2>         at org.apache.lucene.util.AbstractBeforeAfterRule$1.evaluate(AbstractBeforeAfterRule.java:45)
   [junit4]   2>         at org.apache.lucene.util.TestRuleThreadAndTestName$1.evaluate(TestRuleThreadAndTestName.java:48)
   [junit4]   2>         at org.apache.lucene.util.TestRuleIgnoreAfterMaxFailures$1.evaluate(TestRuleIgnoreAfterMaxFailures.java:64)
   [junit4]   2>         at org.apache.lucene.util.TestRuleMarkFailure$1.evaluate(TestRuleMarkFailure.java:47)
   [junit4]   2>         at com.carrotsearch.randomizedtesting.rules.StatementAdapter.evaluate(StatementAdapter.java:36)
   [junit4]   2>         at com.carrotsearch.randomizedtesting.ThreadLeakControl$StatementRunner.run(ThreadLeakControl.java:367)
   [junit4]   2>         at com.carrotsearch.randomizedtesting.ThreadLeakControl.forkTimeoutingTask(ThreadLeakControl.java:811)
   [junit4]   2>         at com.carrotsearch.randomizedtesting.ThreadLeakControl$3.evaluate(ThreadLeakControl.java:462)
   [junit4]   2>         at com.carrotsearch.randomizedtesting.RandomizedRunner.runSingleTest(RandomizedRunner.java:916)
   [junit4]   2>         at com.carrotsearch.randomizedtesting.RandomizedRunner$5.evaluate(RandomizedRunner.java:802)
   [junit4]   2>         at com.carrotsearch.randomizedtesting.RandomizedRunner$6.evaluate(RandomizedRunner.java:852)
   [junit4]   2>         at com.carrotsearch.randomizedtesting.RandomizedRunner$7.evaluate(RandomizedRunner.java:863)
   [junit4]   2>         at org.apache.lucene.util.AbstractBeforeAfterRule$1.evaluate(AbstractBeforeAfterRule.java:45)
   [junit4]   2>         at com.carrotsearch.randomizedtesting.rules.StatementAdapter.evaluate(StatementAdapter.java:36)
   [junit4]   2>         at org.apache.lucene.util.TestRuleStoreClassName$1.evaluate(TestRuleStoreClassName.java:41)
   [junit4]   2>         at com.carrotsearch.randomizedtesting.rules.NoShadowingOrOverridesOnMethodsRule$1.evaluate(NoShadowingOrOverridesOnMethodsRule.java:40)
   [junit4]   2>         at com.carrotsearch.randomizedtesting.rules.NoShadowingOrOverridesOnMethodsRule$1.evaluate(NoShadowingOrOverridesOnMethodsRule.java:40)
   [junit4]   2>         at com.carrotsearch.randomizedtesting.rules.StatementAdapter.evaluate(StatementAdapter.java:36)
   [junit4]   2>         at com.carrotsearch.randomizedtesting.rules.StatementAdapter.evaluate(StatementAdapter.java:36)
   [junit4]   2>         at com.carrotsearch.randomizedtesting.rules.StatementAdapter.evaluate(StatementAdapter.java:36)
   [junit4]   2>         at org.apache.lucene.util.TestRuleAssertionsRequired$1.evaluate(TestRuleAssertionsRequired.java:53)
   [junit4]   2>         at org.apache.lucene.util.TestRuleMarkFailure$1.evaluate(TestRuleMarkFailure.java:47)
   [junit4]   2>         at org.apache.lucene.util.TestRuleIgnoreAfterMaxFailures$1.evaluate(TestRuleIgnoreAfterMaxFailures.java:64)
   [junit4]   2>         at org.apache.lucene.util.TestRuleIgnoreTestSuites$1.evaluate(TestRuleIgnoreTestSuites.java:54)
   [junit4]   2>         at com.carrotsearch.randomizedtesting.rules.StatementAdapter.evaluate(StatementAdapter.java:36)
   [junit4]   2>         at com.carrotsearch.randomizedtesting.ThreadLeakControl$StatementRunner.run(ThreadLeakControl.java:367)
   [junit4]   2>         at java.lang.Thread.run(Thread.java:745)
   [junit4]   2> NOTE: reproduce with: ant test  -Dtestcase=TestLucene70DocValuesFormat
-Dtests.method=testSparseShortNumericsVsStoredFields -Dtests.seed=EC1BB8EBF423DABB -Dtests.multiplier=3
-Dtests.slow=true -Dtests.locale=de -Dtests.timezone=Europe/Simferopol -Dtests.asserts=true
-Dtests.file.encoding=US-ASCII
   [junit4] ERROR   6986s J1 | TestLucene70DocValuesFormat.testSparseShortNumericsVsStoredFields
<<<
   [junit4]    > Throwable #1: java.lang.Exception: Test abandoned because suite timeout
was reached.
   [junit4]    > 	at __randomizedtesting.SeedInfo.seed([EC1BB8EBF423DABB]:0)
   [junit4]   2> Jan 07, 2017 10:36:03 AM com.carrotsearch.randomizedtesting.ThreadLeakControl
checkThreadLeaks
   [junit4]   2> WARNING: Will linger awaiting termination of 1 leaked thread(s).
   [junit4]   2> Jan 07, 2017 10:36:23 AM com.carrotsearch.randomizedtesting.ThreadLeakControl
checkThreadLeaks
   [junit4]   2> SEVERE: 1 thread leaked from SUITE scope at org.apache.lucene.codecs.lucene70.TestLucene70DocValuesFormat:

   [junit4]   2>    1) Thread[id=1883, name=TEST-TestLucene70DocValuesFormat.testSparseShortNumericsVsStoredFields-seed#[EC1BB8EBF423DABB],
state=TIMED_WAITING, group=TGRP-TestLucene70DocValuesFormat]
   [junit4]   2>         at java.lang.Object.wait(Native Method)
   [junit4]   2>         at org.apache.lucene.index.IndexWriter.doWait(IndexWriter.java:4551)
   [junit4]   2>         at org.apache.lucene.index.IndexWriter.forceMerge(IndexWriter.java:1931)
   [junit4]   2>         at org.apache.lucene.index.IndexWriter.forceMerge(IndexWriter.java:1865)
   [junit4]   2>         at org.apache.lucene.index.RandomIndexWriter.forceMerge(RandomIndexWriter.java:429)
   [junit4]   2>         at org.apache.lucene.index.BaseDocValuesFormatTestCase.doTestNumericsVsStoredFields(BaseDocValuesFormatTestCase.java:1230)
   [junit4]   2>         at org.apache.lucene.index.BaseDocValuesFormatTestCase.testSparseShortNumericsVsStoredFields(BaseDocValuesFormatTestCase.java:1365)
   [junit4]   2>         at sun.reflect.NativeMethodAccessorImpl.invoke0(Native Method)
   [junit4]   2>         at sun.reflect.NativeMethodAccessorImpl.invoke(NativeMethodAccessorImpl.java:62)
   [junit4]   2>         at sun.reflect.DelegatingMethodAccessorImpl.invoke(DelegatingMethodAccessorImpl.java:43)
   [junit4]   2>         at java.lang.reflect.Method.invoke(Method.java:498)
   [junit4]   2>         at com.carrotsearch.randomizedtesting.RandomizedRunner.invoke(RandomizedRunner.java:1713)
   [junit4]   2>         at com.carrotsearch.randomizedtesting.RandomizedRunner$8.evaluate(RandomizedRunner.java:907)
   [junit4]   2>         at com.carrotsearch.randomizedtesting.RandomizedRunner$9.evaluate(RandomizedRunner.java:943)
   [junit4]   2>         at com.carrotsearch.randomizedtesting.RandomizedRunner$10.evaluate(RandomizedRunner.java:957)
   [junit4]   2>         at org.apache.lucene.util.TestRuleSetupTeardownChained$1.evaluate(TestRuleSetupTeardownChained.java:49)
   [junit4]   2>         at org.apache.lucene.util.AbstractBeforeAfterRule$1.evaluate(AbstractBeforeAfterRule.java:45)
   [junit4]   2>         at org.apache.lucene.util.TestRuleThreadAndTestName$1.evaluate(TestRuleThreadAndTestName.java:48)
   [junit4]   2>         at org.apache.lucene.util.TestRuleIgnoreAfterMaxFailures$1.evaluate(TestRuleIgnoreAfterMaxFailures.java:64)
   [junit4]   2>         at org.apache.lucene.util.TestRuleMarkFailure$1.evaluate(TestRuleMarkFailure.java:47)
   [junit4]   2>         at com.carrotsearch.randomizedtesting.rules.StatementAdapter.evaluate(StatementAdapter.java:36)
   [junit4]   2>         at com.carrotsearch.randomizedtesting.ThreadLeakControl$StatementRunner.run(ThreadLeakControl.java:367)
   [junit4]   2>         at com.carrotsearch.randomizedtesting.ThreadLeakControl.forkTimeoutingTask(ThreadLeakControl.java:811)
   [junit4]   2>         at com.carrotsearch.randomizedtesting.ThreadLeakControl$3.evaluate(ThreadLeakControl.java:462)
   [junit4]   2>         at com.carrotsearch.randomizedtesting.RandomizedRunner.runSingleTest(RandomizedRunner.java:916)
   [junit4]   2>         at com.carrotsearch.randomizedtesting.RandomizedRunner$5.evaluate(RandomizedRunner.java:802)
   [junit4]   2>         at com.carrotsearch.randomizedtesting.RandomizedRunner$6.evaluate(RandomizedRunner.java:852)
   [junit4]   2>         at com.carrotsearch.randomizedtesting.RandomizedRunner$7.evaluate(RandomizedRunner.java:863)
   [junit4]   2>         at org.apache.lucene.util.AbstractBeforeAfterRule$1.evaluate(AbstractBeforeAfterRule.java:45)
   [junit4]   2>         at com.carrotsearch.randomizedtesting.rules.StatementAdapter.evaluate(StatementAdapter.java:36)
   [junit4]   2>         at org.apache.lucene.util.TestRuleStoreClassName$1.evaluate(TestRuleStoreClassName.java:41)
   [junit4]   2>         at com.carrotsearch.randomizedtesting.rules.NoShadowingOrOverridesOnMethodsRule$1.evaluate(NoShadowingOrOverridesOnMethodsRule.java:40)
   [junit4]   2>         at com.carrotsearch.randomizedtesting.rules.NoShadowingOrOverridesOnMethodsRule$1.evaluate(NoShadowingOrOverridesOnMethodsRule.java:40)
   [junit4]   2>         at com.carrotsearch.randomizedtesting.rules.StatementAdapter.evaluate(StatementAdapter.java:36)
   [junit4]   2>         at com.carrotsearch.randomizedtesting.rules.StatementAdapter.evaluate(StatementAdapter.java:36)
   [junit4]   2>         at com.carrotsearch.randomizedtesting.rules.StatementAdapter.evaluate(StatementAdapter.java:36)
   [junit4]   2>         at org.apache.lucene.util.TestRuleAssertionsRequired$1.evaluate(TestRuleAssertionsRequired.java:53)
   [junit4]   2>         at org.apache.lucene.util.TestRuleMarkFailure$1.evaluate(TestRuleMarkFailure.java:47)
   [junit4]   2>         at org.apache.lucene.util.TestRuleIgnoreAfterMaxFailures$1.evaluate(TestRuleIgnoreAfterMaxFailures.java:64)
   [junit4]   2>         at org.apache.lucene.util.TestRuleIgnoreTestSuites$1.evaluate(TestRuleIgnoreTestSuites.java:54)
   [junit4]   2>         at com.carrotsearch.randomizedtesting.rules.StatementAdapter.evaluate(StatementAdapter.java:36)
   [junit4]   2>         at com.carrotsearch.randomizedtesting.ThreadLeakControl$StatementRunner.run(ThreadLeakControl.java:367)
   [junit4]   2>         at java.lang.Thread.run(Thread.java:745)
   [junit4]   2> Jan 07, 2017 10:36:23 AM com.carrotsearch.randomizedtesting.ThreadLeakControl
tryToInterruptAll
   [junit4]   2> INFO: Starting to interrupt leaked threads:
   [junit4]   2>    1) Thread[id=1883, name=TEST-TestLucene70DocValuesFormat.testSparseShortNumericsVsStoredFields-seed#[EC1BB8EBF423DABB],
state=TIMED_WAITING, group=TGRP-TestLucene70DocValuesFormat]
   [junit4]   2> NOTE: leaving temporary files on disk at: /home/jenkins/workspace/Lucene-Solr-master-Linux/lucene/build/core/test/J1/temp/lucene.codecs.lucene70.TestLucene70DocValuesFormat_EC1BB8EBF423DABB-001
   [junit4]   2> Jan 07, 2017 7:36:23 AM com.carrotsearch.randomizedtesting.ThreadLeakControl
tryToInterruptAll
   [junit4]   2> INFO: All leaked threads terminated.
   [junit4]   2> NOTE: test params are: codec=Asserting(Lucene70): {}, docValues:{}, maxPointsInLeafNode=1522,
maxMBSortInHeap=7.148536554029358, sim=RandomSimilarity(queryNorm=false): {fieldname=IB LL-LZ(0.3),
docId=ClassicSimilarity, id=DFR GL2}, locale=de, timezone=Europe/Simferopol
   [junit4]   2> NOTE: Linux 4.4.0-53-generic amd64/Oracle Corporation 1.8.0_112 (64-bit)/cpus=12,threads=1,free=404112976,total=518979584
   [junit4]   2> NOTE: All tests run in this JVM: [TestAllFilesDetectTruncation, TestMultiFields,
TestIndexWriterUnicode, TestLogMergePolicy, TestDuelingCodecs, TestPayloads, TestPolygon,
TestSortedSetSelector, TestSpanExplanationsOfNonMatches, MultiCollectorTest, TestMultiTermsEnum,
TestForceMergeForever, TestIndexWriterDeleteByQuery, TestIndexableField, TestBasics, TestElevationComparator,
TestStressIndexing2, TestIndexSearcher, TestSimpleExplanationsWithFillerDocs, TestDirectoryReader,
TestTimSorter, TestLiveFieldValues, TestAddIndexes, TestLongPostings, TestFilterDirectoryReader,
TestFieldType, TestMmapDirectory, TestFuzzyQuery, TestRegExp, TestPagedBytes, TestTermdocPerf,
LimitedFiniteStringsIteratorTest, TestBlockPostingsFormat3, TestBM25Similarity, TestScoreCachingWrappingScorer,
TestSPIClassIterator, TestSameTokenSamePosition, TestQueryBuilder, TestOrdinalMap, TestDocument,
TestBytesRefArray, TestPayloadsOnVectors, Test2BSortedDocValuesFixedSorted, TestCharTermAttributeImpl,
TestMergePolicyWrapper, TestTermVectorsWriter, TestIndexWriterMaxDocs, TestTerms, TestBooleanQuery,
TestFieldCacheRewriteMethod, TestBooleanScorer, TestSingleInstanceLockFactory, TestMatchNoDocsQuery,
TestDemoParallelLeafReader, TestDateTools, TestFlex, TestFieldValueQuery, TestDoubleValuesSource,
TestMultiPhraseEnum, TestSegmentTermEnum, TestPointQueries, TestTieredMergePolicy, TestMSBRadixSorter,
TestLucene60FieldInfoFormat, TestRateLimiter, TestFieldsReader, TestIntBlockPool, TestMinimize,
TestIndexWriterThreadsToSegments, TestBytesRefAttImpl, TestFixedBitSet, TestMultiThreadTermVectors,
TestTimeLimitingCollector, TestPerFieldDocValuesFormat, TestSloppyPhraseQuery, TestIndexWriterDelete,
TestStressAdvance, TestSearchWithThreads, TestDocumentsWriterStallControl, TestBooleanMinShouldMatch,
TestPostingsOffsets, TestUTF32ToUTF8, TestCodecs, TestParallelLeafReader, TestStressNRT, TestDisjunctionMaxQuery,
TestNearSpansOrdered, TestTermRangeQuery, TestDocumentsWriterDeleteQueue, TestWildcard, TestFieldMaskingSpanQuery,
TestSimpleExplanationsOfNonMatches, TestTopDocsCollector, TestUnicodeUtil, TestPrefixCodedTerms,
TestTopFieldCollector, TestSumDocFreq, TestDocValuesScoring, TestSentinelIntSet, TestWildcardRandom,
TestDirectory, TestSpanMultiTermQueryWrapper, TestBooleanQueryVisitSubscorers, TestSizeBoundedForceMerge,
TestCompiledAutomaton, TestBinaryTerms, TestRecyclingIntBlockAllocator, TestIndexWriterConfig,
TestMultiTermQueryRewrites, TestDateSort, TestVirtualMethod, TestSimilarityProvider, TestFilterIterator,
Test2BPostings, TestAutomatonQueryUnicode, TestRamUsageEstimator, TestNamedSPILoader, TestByteBlockPool,
TestDemo, TestCharFilter, TestTwoPhaseCommitTool, TestIndexWriterOnJRECrash, TestCodecHoldsOpenFiles,
Test2BPostingsBytes, TestIOUtils, Test2BBinaryDocValues, TestCharArrayMap, TestCharacterUtils,
TestWordlistLoader, TestForUtil, TestLucene50StoredFieldsFormat, TestLucene50StoredFieldsFormatHighCompression,
TestLucene60PointsFormat, TestLucene70DocValuesFormat]
   [junit4]   2> NOTE: reproduce with: ant test  -Dtestcase=TestLucene70DocValuesFormat
-Dtests.seed=EC1BB8EBF423DABB -Dtests.multiplier=3 -Dtests.slow=true -Dtests.locale=de -Dtests.timezone=Europe/Simferopol
-Dtests.asserts=true -Dtests.file.encoding=US-ASCII
   [junit4] ERROR   0.00s J1 | TestLucene70DocValuesFormat (suite) <<<
   [junit4]    > Throwable #1: java.lang.Exception: Suite timeout exceeded (>= 7200000
msec).
   [junit4]    > 	at __randomizedtesting.SeedInfo.seed([EC1BB8EBF423DABB]:0)
   [junit4] Completed [442/442 (1!)] on J1 in 7220.07s, 108 tests, 2 errors, 3 skipped <<<
FAILURES!

[...truncated 73617 lines...]


Mime
View raw message