lucene-dev mailing list archives

Site index · List index
Message view « Date » · « Thread »
Top « Date » · « Thread »
From Policeman Jenkins Server <jenk...@thetaphi.de>
Subject [JENKINS] Lucene-Solr-6.x-Windows (64bit/jdk1.8.0_121) - Build # 705 - Unstable!
Date Thu, 26 Jan 2017 18:42:05 GMT
Build: https://jenkins.thetaphi.de/job/Lucene-Solr-6.x-Windows/705/
Java: 64bit/jdk1.8.0_121 -XX:+UseCompressedOops -XX:+UseParallelGC

1 tests failed.
FAILED:  junit.framework.TestSuite.org.apache.lucene.index.TestFieldsReader

Error Message:
Could not remove the following files (in the order of attempts):    C:\Users\jenkins\workspace\Lucene-Solr-6.x-Windows\lucene\build\core\test\J0\temp\lucene.index.TestFieldsReader_7D8AC5D98974588A-001\testfieldswriterexceptions-001:
java.nio.file.AccessDeniedException: C:\Users\jenkins\workspace\Lucene-Solr-6.x-Windows\lucene\build\core\test\J0\temp\lucene.index.TestFieldsReader_7D8AC5D98974588A-001\testfieldswriterexceptions-001
   C:\Users\jenkins\workspace\Lucene-Solr-6.x-Windows\lucene\build\core\test\J0\temp\lucene.index.TestFieldsReader_7D8AC5D98974588A-001:
java.nio.file.DirectoryNotEmptyException: C:\Users\jenkins\workspace\Lucene-Solr-6.x-Windows\lucene\build\core\test\J0\temp\lucene.index.TestFieldsReader_7D8AC5D98974588A-001


Stack Trace:
java.io.IOException: Could not remove the following files (in the order of attempts):
   C:\Users\jenkins\workspace\Lucene-Solr-6.x-Windows\lucene\build\core\test\J0\temp\lucene.index.TestFieldsReader_7D8AC5D98974588A-001\testfieldswriterexceptions-001:
java.nio.file.AccessDeniedException: C:\Users\jenkins\workspace\Lucene-Solr-6.x-Windows\lucene\build\core\test\J0\temp\lucene.index.TestFieldsReader_7D8AC5D98974588A-001\testfieldswriterexceptions-001
   C:\Users\jenkins\workspace\Lucene-Solr-6.x-Windows\lucene\build\core\test\J0\temp\lucene.index.TestFieldsReader_7D8AC5D98974588A-001:
java.nio.file.DirectoryNotEmptyException: C:\Users\jenkins\workspace\Lucene-Solr-6.x-Windows\lucene\build\core\test\J0\temp\lucene.index.TestFieldsReader_7D8AC5D98974588A-001

	at __randomizedtesting.SeedInfo.seed([7D8AC5D98974588A]:0)
	at org.apache.lucene.util.IOUtils.rm(IOUtils.java:323)
	at org.apache.lucene.util.TestRuleTemporaryFilesCleanup.afterAlways(TestRuleTemporaryFilesCleanup.java:216)
	at com.carrotsearch.randomizedtesting.rules.TestRuleAdapter$1.afterAlways(TestRuleAdapter.java:31)
	at com.carrotsearch.randomizedtesting.rules.StatementAdapter.evaluate(StatementAdapter.java:43)
	at com.carrotsearch.randomizedtesting.rules.StatementAdapter.evaluate(StatementAdapter.java:36)
	at org.apache.lucene.util.TestRuleAssertionsRequired$1.evaluate(TestRuleAssertionsRequired.java:53)
	at org.apache.lucene.util.TestRuleMarkFailure$1.evaluate(TestRuleMarkFailure.java:47)
	at org.apache.lucene.util.TestRuleIgnoreAfterMaxFailures$1.evaluate(TestRuleIgnoreAfterMaxFailures.java:64)
	at org.apache.lucene.util.TestRuleIgnoreTestSuites$1.evaluate(TestRuleIgnoreTestSuites.java:54)
	at com.carrotsearch.randomizedtesting.rules.StatementAdapter.evaluate(StatementAdapter.java:36)
	at com.carrotsearch.randomizedtesting.ThreadLeakControl$StatementRunner.run(ThreadLeakControl.java:368)
	at java.lang.Thread.run(Thread.java:745)




Build Log:
[...truncated 308 lines...]
   [junit4] Suite: org.apache.lucene.index.TestFieldsReader
   [junit4]   2> NOTE: test params are: codec=CheapBastard, sim=RandomSimilarity(queryNorm=true,coord=no):
{textField1Utf8=DFR I(n)1, unStoredField2=DFR I(F)1, omitTermFreqAndPositions=DFR G2, textField2=DFR
GLZ(0.3), textField1=DFR I(ne)L1, textField2Utf8=DFI(ChiSquared), unStoredField1=DFR I(n)L2,
lazyField=DFR I(F)3(800.0), largeLazyField=IB LL-L1}, locale=id-ID, timezone=America/Glace_Bay
   [junit4]   2> NOTE: Windows 10 10.0 amd64/Oracle Corporation 1.8.0_121 (64-bit)/cpus=3,threads=1,free=99775800,total=171966464
   [junit4]   2> NOTE: All tests run in this JVM: [TestGrowableByteArrayDataOutput, TestGraphTokenStreamFiniteStrings,
TestBM25Similarity, TestByteBlockPool, TestDocIdsWriter, TestNRTReaderWithThreads, TestNumericUtils,
TestCachingCollector, TestPayloads, TestBasics, TestPersistentSnapshotDeletionPolicy, TestSearch,
TestCharArrayMap, TestMultiset, TestMSBRadixSorter, TestFieldsReader]
   [junit4]   2> NOTE: reproduce with: ant test  -Dtestcase=TestFieldsReader -Dtests.seed=7D8AC5D98974588A
-Dtests.slow=true -Dtests.locale=id-ID -Dtests.timezone=America/Glace_Bay -Dtests.asserts=true
-Dtests.file.encoding=US-ASCII
   [junit4] ERROR   0.00s J0 | TestFieldsReader (suite) <<<
   [junit4]    > Throwable #1: java.io.IOException: Could not remove the following files
(in the order of attempts):
   [junit4]    >    C:\Users\jenkins\workspace\Lucene-Solr-6.x-Windows\lucene\build\core\test\J0\temp\lucene.index.TestFieldsReader_7D8AC5D98974588A-001\testfieldswriterexceptions-001:
java.nio.file.AccessDeniedException: C:\Users\jenkins\workspace\Lucene-Solr-6.x-Windows\lucene\build\core\test\J0\temp\lucene.index.TestFieldsReader_7D8AC5D98974588A-001\testfieldswriterexceptions-001
   [junit4]    >    C:\Users\jenkins\workspace\Lucene-Solr-6.x-Windows\lucene\build\core\test\J0\temp\lucene.index.TestFieldsReader_7D8AC5D98974588A-001:
java.nio.file.DirectoryNotEmptyException: C:\Users\jenkins\workspace\Lucene-Solr-6.x-Windows\lucene\build\core\test\J0\temp\lucene.index.TestFieldsReader_7D8AC5D98974588A-001
   [junit4]    > 	at __randomizedtesting.SeedInfo.seed([7D8AC5D98974588A]:0)
   [junit4]    > 	at org.apache.lucene.util.IOUtils.rm(IOUtils.java:323)
   [junit4]    > 	at java.lang.Thread.run(Thread.java:745)
   [junit4] Completed [33/451 (1!)] on J0 in 0.55s, 2 tests, 1 error <<< FAILURES!

[...truncated 75206 lines...]


Mime
View raw message