Build: https://builds.apache.org/job/Lucene-Solr-NightlyTests-6.x/226/ 10 tests failed. FAILED: org.apache.lucene.search.TestFuzzyQuery.testRandom Error Message: Test abandoned because suite timeout was reached. Stack Trace: java.lang.Exception: Test abandoned because suite timeout was reached. at __randomizedtesting.SeedInfo.seed([54B09E7352D7D3C]:0) FAILED: junit.framework.TestSuite.org.apache.lucene.search.TestFuzzyQuery Error Message: Suite timeout exceeded (>= 7200000 msec). Stack Trace: java.lang.Exception: Suite timeout exceeded (>= 7200000 msec). at __randomizedtesting.SeedInfo.seed([54B09E7352D7D3C]:0) FAILED: org.apache.solr.cloud.SharedFSAutoReplicaFailoverTest.test Error Message: Stack Trace: java.lang.AssertionError at __randomizedtesting.SeedInfo.seed([D4F93519FE4ADBAD:5CAD0AC350B6B655]:0) at org.junit.Assert.fail(Assert.java:92) at org.junit.Assert.assertTrue(Assert.java:43) at org.junit.Assert.assertTrue(Assert.java:54) at org.apache.solr.cloud.SharedFSAutoReplicaFailoverTest.testBasics(SharedFSAutoReplicaFailoverTest.java:199) at org.apache.solr.cloud.SharedFSAutoReplicaFailoverTest.test(SharedFSAutoReplicaFailoverTest.java:127) at sun.reflect.NativeMethodAccessorImpl.invoke0(Native Method) at sun.reflect.NativeMethodAccessorImpl.invoke(NativeMethodAccessorImpl.java:62) at sun.reflect.DelegatingMethodAccessorImpl.invoke(DelegatingMethodAccessorImpl.java:43) at java.lang.reflect.Method.invoke(Method.java:498) at com.carrotsearch.randomizedtesting.RandomizedRunner.invoke(RandomizedRunner.java:1713) at com.carrotsearch.randomizedtesting.RandomizedRunner$8.evaluate(RandomizedRunner.java:907) at com.carrotsearch.randomizedtesting.RandomizedRunner$9.evaluate(RandomizedRunner.java:943) at com.carrotsearch.randomizedtesting.RandomizedRunner$10.evaluate(RandomizedRunner.java:957) at org.apache.solr.BaseDistributedSearchTestCase$ShardsRepeatRule$ShardsFixedStatement.callStatement(BaseDistributedSearchTestCase.java:992) at org.apache.solr.BaseDistributedSearchTestCase$ShardsRepeatRule$ShardsStatement.evaluate(BaseDistributedSearchTestCase.java:967) at com.carrotsearch.randomizedtesting.rules.SystemPropertiesRestoreRule$1.evaluate(SystemPropertiesRestoreRule.java:57) at org.apache.lucene.util.TestRuleSetupTeardownChained$1.evaluate(TestRuleSetupTeardownChained.java:49) at org.apache.lucene.util.AbstractBeforeAfterRule$1.evaluate(AbstractBeforeAfterRule.java:45) at org.apache.lucene.util.TestRuleThreadAndTestName$1.evaluate(TestRuleThreadAndTestName.java:48) at org.apache.lucene.util.TestRuleIgnoreAfterMaxFailures$1.evaluate(TestRuleIgnoreAfterMaxFailures.java:64) at org.apache.lucene.util.TestRuleMarkFailure$1.evaluate(TestRuleMarkFailure.java:47) at com.carrotsearch.randomizedtesting.rules.StatementAdapter.evaluate(StatementAdapter.java:36) at com.carrotsearch.randomizedtesting.ThreadLeakControl$StatementRunner.run(ThreadLeakControl.java:367) at com.carrotsearch.randomizedtesting.ThreadLeakControl.forkTimeoutingTask(ThreadLeakControl.java:811) at com.carrotsearch.randomizedtesting.ThreadLeakControl$3.evaluate(ThreadLeakControl.java:462) at com.carrotsearch.randomizedtesting.RandomizedRunner.runSingleTest(RandomizedRunner.java:916) at com.carrotsearch.randomizedtesting.RandomizedRunner$5.evaluate(RandomizedRunner.java:802) at com.carrotsearch.randomizedtesting.RandomizedRunner$6.evaluate(RandomizedRunner.java:852) at com.carrotsearch.randomizedtesting.RandomizedRunner$7.evaluate(RandomizedRunner.java:863) at com.carrotsearch.randomizedtesting.rules.StatementAdapter.evaluate(StatementAdapter.java:36) at com.carrotsearch.randomizedtesting.rules.SystemPropertiesRestoreRule$1.evaluate(SystemPropertiesRestoreRule.java:57) at org.apache.lucene.util.AbstractBeforeAfterRule$1.evaluate(AbstractBeforeAfterRule.java:45) at com.carrotsearch.randomizedtesting.rules.StatementAdapter.evaluate(StatementAdapter.java:36) at org.apache.lucene.util.TestRuleStoreClassName$1.evaluate(TestRuleStoreClassName.java:41) at com.carrotsearch.randomizedtesting.rules.NoShadowingOrOverridesOnMethodsRule$1.evaluate(NoShadowingOrOverridesOnMethodsRule.java:40) at com.carrotsearch.randomizedtesting.rules.NoShadowingOrOverridesOnMethodsRule$1.evaluate(NoShadowingOrOverridesOnMethodsRule.java:40) at com.carrotsearch.randomizedtesting.rules.StatementAdapter.evaluate(StatementAdapter.java:36) at com.carrotsearch.randomizedtesting.rules.StatementAdapter.evaluate(StatementAdapter.java:36) at com.carrotsearch.randomizedtesting.rules.StatementAdapter.evaluate(StatementAdapter.java:36) at org.apache.lucene.util.TestRuleAssertionsRequired$1.evaluate(TestRuleAssertionsRequired.java:53) at org.apache.lucene.util.TestRuleMarkFailure$1.evaluate(TestRuleMarkFailure.java:47) at org.apache.lucene.util.TestRuleIgnoreAfterMaxFailures$1.evaluate(TestRuleIgnoreAfterMaxFailures.java:64) at org.apache.lucene.util.TestRuleIgnoreTestSuites$1.evaluate(TestRuleIgnoreTestSuites.java:54) at com.carrotsearch.randomizedtesting.rules.StatementAdapter.evaluate(StatementAdapter.java:36) at com.carrotsearch.randomizedtesting.ThreadLeakControl$StatementRunner.run(ThreadLeakControl.java:367) at java.lang.Thread.run(Thread.java:745) FAILED: org.apache.solr.cloud.hdfs.HdfsBasicDistributedZkTest.test Error Message: Error from server at http://127.0.0.1:34046/oneInstanceCollection23: Expected mime type application/octet-stream but got text/html. Error 500

HTTP ERROR: 500

Problem accessing /oneInstanceCollection23/update. Reason:

    {metadata={error-class=org.apache.solr.common.SolrException,root-error-class=java.lang.OutOfMemoryError},msg=SolrCore 'oneInstanceCollection23' is not available due to init failure: The max direct memory is likely too low.  Either increase it (by adding -XX:MaxDirectMemorySize=<size>g -XX:+UseLargePages to your containers startup args) or disable direct allocation using solr.hdfs.blockcache.direct.memory.allocation=false in solrconfig.xml. If you are putting the block cache on the heap, your java heap size might not be large enough. Failed allocating ~8.388608 MB.,trace=org.apache.solr.common.SolrException: SolrCore 'oneInstanceCollection23' is not available due to init failure: The max direct memory is likely too low.  Either increase it (by adding -XX:MaxDirectMemorySize=<size>g -XX:+UseLargePages to your containers startup args) or disable direct allocation using solr.hdfs.blockcache.direct.memory.allocation=false in solrconfig.xml. If you are putting the block cache on the heap, your java heap size might not be large enough. Failed allocating ~8.388608 MB.  at org.apache.solr.core.CoreContainer.getCore(CoreContainer.java:1097)  at org.apache.solr.servlet.HttpSolrCall.init(HttpSolrCall.java:252)  at org.apache.solr.servlet.HttpSolrCall.call(HttpSolrCall.java:418)  at org.apache.solr.servlet.SolrDispatchFilter.doFilter(SolrDispatchFilter.java:303)  at org.apache.solr.servlet.SolrDispatchFilter.doFilter(SolrDispatchFilter.java:254)  at org.eclipse.jetty.servlet.ServletHandler$CachedChain.doFilter(ServletHandler.java:1699)  at org.apache.solr.client.solrj.embedded.JettySolrRunner$DebugFilter.doFilter(JettySolrRunner.java:110)  at org.eclipse.jetty.servlet.ServletHandler$CachedChain.doFilter(ServletHandler.java:1699)  at org.eclipse.jetty.servlet.ServletHandler.doHandle(ServletHandler.java:582)  at org.eclipse.jetty.server.session.SessionHandler.doHandle(SessionHandler.java:224)  at org.eclipse.jetty.server.handler.ContextHandler.doHandle(ContextHandler.java:1180)  at org.eclipse.jetty.servlet.ServletHandler.doScope(ServletHandler.java:512)  at org.eclipse.jetty.server.session.SessionHandler.doScope(SessionHandler.java:185)  at org.eclipse.jetty.server.handler.ContextHandler.doScope(ContextHandler.java:1112)  at org.eclipse.jetty.server.handler.ScopedHandler.handle(ScopedHandler.java:141)  at org.eclipse.jetty.server.handler.gzip.GzipHandler.handle(GzipHandler.java:395)  at org.eclipse.jetty.server.handler.HandlerWrapper.handle(HandlerWrapper.java:134)  at org.eclipse.jetty.server.Server.handle(Server.java:534)  at org.eclipse.jetty.server.HttpChannel.handle(HttpChannel.java:320)  at org.eclipse.jetty.server.HttpConnection.onFillable(HttpConnection.java:251)  at org.eclipse.jetty.io.AbstractConnection$ReadCallback.succeeded(AbstractConnection.java:273)  at org.eclipse.jetty.io.FillInterest.fillable(FillInterest.java:95)  at org.eclipse.jetty.io.SelectChannelEndPoint$2.run(SelectChannelEndPoint.java:93)  at org.eclipse.jetty.util.thread.strategy.ExecuteProduceConsume.executeProduceConsume(ExecuteProduceConsume.java:303)  at org.eclipse.jetty.util.thread.strategy.ExecuteProduceConsume.produceConsume(ExecuteProduceConsume.java:148)  at org.eclipse.jetty.util.thread.strategy.ExecuteProduceConsume.run(ExecuteProduceConsume.java:136)  at org.eclipse.jetty.util.thread.QueuedThreadPool.runJob(QueuedThreadPool.java:671)  at org.eclipse.jetty.util.thread.QueuedThreadPool$2.run(QueuedThreadPool.java:589)  at java.lang.Thread.run(Thread.java:745) Caused by: org.apache.solr.common.SolrException: The max direct memory is likely too low.  Either increase it (by adding -XX:MaxDirectMemorySize=<size>g -XX:+UseLargePages to your containers startup args) or disable direct allocation using solr.hdfs.blockcache.direct.memory.allocation=false in solrconfig.xml. If you are putting the block cache on the heap, your java heap size might not be large enough. Failed allocating ~8.388608 MB.  at org.apache.solr.core.SolrCore.<init>(SolrCore.java:900)  at org.apache.solr.core.SolrCore.<init>(SolrCore.java:775)  at org.apache.solr.core.CoreContainer.create(CoreContainer.java:842)  at org.apache.solr.core.CoreContainer.create(CoreContainer.java:779)  at org.apache.solr.handler.admin.CoreAdminOperation.lambda$static$0(CoreAdminOperation.java:88)  at org.apache.solr.handler.admin.CoreAdminOperation.execute(CoreAdminOperation.java:377)  at org.apache.solr.handler.admin.CoreAdminHandler$CallInfo.call(CoreAdminHandler.java:365)  at org.apache.solr.handler.admin.CoreAdminHandler.handleRequestBody(CoreAdminHandler.java:156)  at org.apache.solr.handler.RequestHandlerBase.handleRequest(RequestHandlerBase.java:152)  at org.apache.solr.servlet.HttpSolrCall.handleAdminRequest(HttpSolrCall.java:664)  at org.apache.solr.servlet.HttpSolrCall.call(HttpSolrCall.java:445)  at org.apache.solr.servlet.SolrDispatchFilter.doFilter(SolrDispatchFilter.java:303)  at org.apache.solr.servlet.SolrDispatchFilter.doFilter(SolrDispatchFilter.java:254)  at org.eclipse.jetty.servlet.ServletHandler$CachedChain.doFilter(ServletHandler.java:1699)  at org.apache.solr.client.solrj.embedded.JettySolrRunner$DebugFilter.doFilter(JettySolrRunner.java:110)  at org.eclipse.jetty.servlet.ServletHandler$CachedChain.doFilter(ServletHandler.java:1699)  at org.eclipse.jetty.servlet.ServletHandler.doHandle(ServletHandler.java:582)  at org.eclipse.jetty.server.session.SessionHandler.doHandle(SessionHandler.java:224)  at org.eclipse.jetty.server.handler.ContextHandler.doHandle(ContextHandler.java:1180)  at org.eclipse.jetty.servlet.ServletHandler.doScope(ServletHandler.java:512)  at org.eclipse.jetty.server.session.SessionHandler.doScope(SessionHandler.java:185)  at org.eclipse.jetty.server.handler.ContextHandler.doScope(ContextHandler.java:1112)  at org.eclipse.jetty.server.handler.ScopedHandler.handle(ScopedHandler.java:141)  at org.eclipse.jetty.server.handler.gzip.GzipHandler.handle(GzipHandler.java:462)  ... 13 more Caused by: java.lang.RuntimeException: The max direct memory is likely too low.  Either increase it (by adding -XX:MaxDirectMemorySize=<size>g -XX:+UseLargePages to your containers startup args) or disable direct allocation using solr.hdfs.blockcache.direct.memory.allocation=false in solrconfig.xml. If you are putting the block cache on the heap, your java heap size might not be large enough. Failed allocating ~8.388608 MB.  at org.apache.solr.core.HdfsDirectoryFactory.createBlockCache(HdfsDirectoryFactory.java:304)  at org.apache.solr.core.HdfsDirectoryFactory.getBlockDirectoryCache(HdfsDirectoryFactory.java:280)  at org.apache.solr.core.HdfsDirectoryFactory.create(HdfsDirectoryFactory.java:220)  at org.apache.solr.core.CachingDirectoryFactory.get(CachingDirectoryFactory.java:346)  at org.apache.solr.update.SolrIndexWriter.create(SolrIndexWriter.java:66)  at org.apache.solr.core.SolrCore.initIndex(SolrCore.java:673)  at org.apache.solr.core.SolrCore.<init>(SolrCore.java:847)  ... 36 more Caused by: java.lang.OutOfMemoryError: Direct buffer memory  at java.nio.Bits.reserveMemory(Bits.java:693)  at java.nio.DirectByteBuffer.<init>(DirectByteBuffer.java:123)  at java.nio.ByteBuffer.allocateDirect(ByteBuffer.java:311)  at org.apache.solr.store.blockcache.BlockCache.<init>(BlockCache.java:68)  at org.apache.solr.core.HdfsDirectoryFactory.createBlockCache(HdfsDirectoryFactory.java:302)  ... 42 more ,code=500}


Powered by Jetty:// 9.3.14.v20161028
Stack Trace: org.apache.solr.client.solrj.impl.HttpSolrClient$RemoteSolrException: Error from server at http://127.0.0.1:34046/oneInstanceCollection23: Expected mime type application/octet-stream but got text/html. Error 500

HTTP ERROR: 500

Problem accessing /oneInstanceCollection23/update. Reason:

    {metadata={error-class=org.apache.solr.common.SolrException,root-error-class=java.lang.OutOfMemoryError},msg=SolrCore 'oneInstanceCollection23' is not available due to init failure: The max direct memory is likely too low.  Either increase it (by adding -XX:MaxDirectMemorySize=<size>g -XX:+UseLargePages to your containers startup args) or disable direct allocation using solr.hdfs.blockcache.direct.memory.allocation=false in solrconfig.xml. If you are putting the block cache on the heap, your java heap size might not be large enough. Failed allocating ~8.388608 MB.,trace=org.apache.solr.common.SolrException: SolrCore 'oneInstanceCollection23' is not available due to init failure: The max direct memory is likely too low.  Either increase it (by adding -XX:MaxDirectMemorySize=<size>g -XX:+UseLargePages to your containers startup args) or disable direct allocation using solr.hdfs.blockcache.direct.memory.allocation=false in solrconfig.xml. If you are putting the block cache on the heap, your java heap size might not be large enough. Failed allocating ~8.388608 MB.
	at org.apache.solr.core.CoreContainer.getCore(CoreContainer.java:1097)
	at org.apache.solr.servlet.HttpSolrCall.init(HttpSolrCall.java:252)
	at org.apache.solr.servlet.HttpSolrCall.call(HttpSolrCall.java:418)
	at org.apache.solr.servlet.SolrDispatchFilter.doFilter(SolrDispatchFilter.java:303)
	at org.apache.solr.servlet.SolrDispatchFilter.doFilter(SolrDispatchFilter.java:254)
	at org.eclipse.jetty.servlet.ServletHandler$CachedChain.doFilter(ServletHandler.java:1699)
	at org.apache.solr.client.solrj.embedded.JettySolrRunner$DebugFilter.doFilter(JettySolrRunner.java:110)
	at org.eclipse.jetty.servlet.ServletHandler$CachedChain.doFilter(ServletHandler.java:1699)
	at org.eclipse.jetty.servlet.ServletHandler.doHandle(ServletHandler.java:582)
	at org.eclipse.jetty.server.session.SessionHandler.doHandle(SessionHandler.java:224)
	at org.eclipse.jetty.server.handler.ContextHandler.doHandle(ContextHandler.java:1180)
	at org.eclipse.jetty.servlet.ServletHandler.doScope(ServletHandler.java:512)
	at org.eclipse.jetty.server.session.SessionHandler.doScope(SessionHandler.java:185)
	at org.eclipse.jetty.server.handler.ContextHandler.doScope(ContextHandler.java:1112)
	at org.eclipse.jetty.server.handler.ScopedHandler.handle(ScopedHandler.java:141)
	at org.eclipse.jetty.server.handler.gzip.GzipHandler.handle(GzipHandler.java:395)
	at org.eclipse.jetty.server.handler.HandlerWrapper.handle(HandlerWrapper.java:134)
	at org.eclipse.jetty.server.Server.handle(Server.java:534)
	at org.eclipse.jetty.server.HttpChannel.handle(HttpChannel.java:320)
	at org.eclipse.jetty.server.HttpConnection.onFillable(HttpConnection.java:251)
	at org.eclipse.jetty.io.AbstractConnection$ReadCallback.succeeded(AbstractConnection.java:273)
	at org.eclipse.jetty.io.FillInterest.fillable(FillInterest.java:95)
	at org.eclipse.jetty.io.SelectChannelEndPoint$2.run(SelectChannelEndPoint.java:93)
	at org.eclipse.jetty.util.thread.strategy.ExecuteProduceConsume.executeProduceConsume(ExecuteProduceConsume.java:303)
	at org.eclipse.jetty.util.thread.strategy.ExecuteProduceConsume.produceConsume(ExecuteProduceConsume.java:148)
	at org.eclipse.jetty.util.thread.strategy.ExecuteProduceConsume.run(ExecuteProduceConsume.java:136)
	at org.eclipse.jetty.util.thread.QueuedThreadPool.runJob(QueuedThreadPool.java:671)
	at org.eclipse.jetty.util.thread.QueuedThreadPool$2.run(QueuedThreadPool.java:589)
	at java.lang.Thread.run(Thread.java:745)
Caused by: org.apache.solr.common.SolrException: The max direct memory is likely too low.  Either increase it (by adding -XX:MaxDirectMemorySize=<size>g -XX:+UseLargePages to your containers startup args) or disable direct allocation using solr.hdfs.blockcache.direct.memory.allocation=false in solrconfig.xml. If you are putting the block cache on the heap, your java heap size might not be large enough. Failed allocating ~8.388608 MB.
	at org.apache.solr.core.SolrCore.<init>(SolrCore.java:900)
	at org.apache.solr.core.SolrCore.<init>(SolrCore.java:775)
	at org.apache.solr.core.CoreContainer.create(CoreContainer.java:842)
	at org.apache.solr.core.CoreContainer.create(CoreContainer.java:779)
	at org.apache.solr.handler.admin.CoreAdminOperation.lambda$static$0(CoreAdminOperation.java:88)
	at org.apache.solr.handler.admin.CoreAdminOperation.execute(CoreAdminOperation.java:377)
	at org.apache.solr.handler.admin.CoreAdminHandler$CallInfo.call(CoreAdminHandler.java:365)
	at org.apache.solr.handler.admin.CoreAdminHandler.handleRequestBody(CoreAdminHandler.java:156)
	at org.apache.solr.handler.RequestHandlerBase.handleRequest(RequestHandlerBase.java:152)
	at org.apache.solr.servlet.HttpSolrCall.handleAdminRequest(HttpSolrCall.java:664)
	at org.apache.solr.servlet.HttpSolrCall.call(HttpSolrCall.java:445)
	at org.apache.solr.servlet.SolrDispatchFilter.doFilter(SolrDispatchFilter.java:303)
	at org.apache.solr.servlet.SolrDispatchFilter.doFilter(SolrDispatchFilter.java:254)
	at org.eclipse.jetty.servlet.ServletHandler$CachedChain.doFilter(ServletHandler.java:1699)
	at org.apache.solr.client.solrj.embedded.JettySolrRunner$DebugFilter.doFilter(JettySolrRunner.java:110)
	at org.eclipse.jetty.servlet.ServletHandler$CachedChain.doFilter(ServletHandler.java:1699)
	at org.eclipse.jetty.servlet.ServletHandler.doHandle(ServletHandler.java:582)
	at org.eclipse.jetty.server.session.SessionHandler.doHandle(SessionHandler.java:224)
	at org.eclipse.jetty.server.handler.ContextHandler.doHandle(ContextHandler.java:1180)
	at org.eclipse.jetty.servlet.ServletHandler.doScope(ServletHandler.java:512)
	at org.eclipse.jetty.server.session.SessionHandler.doScope(SessionHandler.java:185)
	at org.eclipse.jetty.server.handler.ContextHandler.doScope(ContextHandler.java:1112)
	at org.eclipse.jetty.server.handler.ScopedHandler.handle(ScopedHandler.java:141)
	at org.eclipse.jetty.server.handler.gzip.GzipHandler.handle(GzipHandler.java:462)
	... 13 more
Caused by: java.lang.RuntimeException: The max direct memory is likely too low.  Either increase it (by adding -XX:MaxDirectMemorySize=<size>g -XX:+UseLargePages to your containers startup args) or disable direct allocation using solr.hdfs.blockcache.direct.memory.allocation=false in solrconfig.xml. If you are putting the block cache on the heap, your java heap size might not be large enough. Failed allocating ~8.388608 MB.
	at org.apache.solr.core.HdfsDirectoryFactory.createBlockCache(HdfsDirectoryFactory.java:304)
	at org.apache.solr.core.HdfsDirectoryFactory.getBlockDirectoryCache(HdfsDirectoryFactory.java:280)
	at org.apache.solr.core.HdfsDirectoryFactory.create(HdfsDirectoryFactory.java:220)
	at org.apache.solr.core.CachingDirectoryFactory.get(CachingDirectoryFactory.java:346)
	at org.apache.solr.update.SolrIndexWriter.create(SolrIndexWriter.java:66)
	at org.apache.solr.core.SolrCore.initIndex(SolrCore.java:673)
	at org.apache.solr.core.SolrCore.<init>(SolrCore.java:847)
	... 36 more
Caused by: java.lang.OutOfMemoryError: Direct buffer memory
	at java.nio.Bits.reserveMemory(Bits.java:693)
	at java.nio.DirectByteBuffer.<init>(DirectByteBuffer.java:123)
	at java.nio.ByteBuffer.allocateDirect(ByteBuffer.java:311)
	at org.apache.solr.store.blockcache.BlockCache.<init>(BlockCache.java:68)
	at org.apache.solr.core.HdfsDirectoryFactory.createBlockCache(HdfsDirectoryFactory.java:302)
	... 42 more
,code=500}


Powered by Jetty:// 9.3.14.v20161028
at __randomizedtesting.SeedInfo.seed([D4F93519FE4ADBAD:5CAD0AC350B6B655]:0) at org.apache.solr.client.solrj.impl.HttpSolrClient.executeMethod(HttpSolrClient.java:561) at org.apache.solr.client.solrj.impl.HttpSolrClient.request(HttpSolrClient.java:262) at org.apache.solr.client.solrj.impl.HttpSolrClient.request(HttpSolrClient.java:251) at org.apache.solr.client.solrj.SolrRequest.process(SolrRequest.java:149) at org.apache.solr.client.solrj.SolrClient.add(SolrClient.java:173) at org.apache.solr.client.solrj.SolrClient.add(SolrClient.java:138) at org.apache.solr.client.solrj.SolrClient.add(SolrClient.java:152) at org.apache.solr.cloud.BasicDistributedZkTest.testANewCollectionInOneInstanceWithManualShardAssignement(BasicDistributedZkTest.java:800) at org.apache.solr.cloud.BasicDistributedZkTest.test(BasicDistributedZkTest.java:361) at sun.reflect.NativeMethodAccessorImpl.invoke0(Native Method) at sun.reflect.NativeMethodAccessorImpl.invoke(NativeMethodAccessorImpl.java:62) at sun.reflect.DelegatingMethodAccessorImpl.invoke(DelegatingMethodAccessorImpl.java:43) at java.lang.reflect.Method.invoke(Method.java:498) at com.carrotsearch.randomizedtesting.RandomizedRunner.invoke(RandomizedRunner.java:1713) at com.carrotsearch.randomizedtesting.RandomizedRunner$8.evaluate(RandomizedRunner.java:907) at com.carrotsearch.randomizedtesting.RandomizedRunner$9.evaluate(RandomizedRunner.java:943) at com.carrotsearch.randomizedtesting.RandomizedRunner$10.evaluate(RandomizedRunner.java:957) at org.apache.solr.BaseDistributedSearchTestCase$ShardsRepeatRule$ShardsFixedStatement.callStatement(BaseDistributedSearchTestCase.java:992) at org.apache.solr.BaseDistributedSearchTestCase$ShardsRepeatRule$ShardsStatement.evaluate(BaseDistributedSearchTestCase.java:967) at com.carrotsearch.randomizedtesting.rules.SystemPropertiesRestoreRule$1.evaluate(SystemPropertiesRestoreRule.java:57) at org.apache.lucene.util.TestRuleSetupTeardownChained$1.evaluate(TestRuleSetupTeardownChained.java:49) at org.apache.lucene.util.AbstractBeforeAfterRule$1.evaluate(AbstractBeforeAfterRule.java:45) at org.apache.lucene.util.TestRuleThreadAndTestName$1.evaluate(TestRuleThreadAndTestName.java:48) at org.apache.lucene.util.TestRuleIgnoreAfterMaxFailures$1.evaluate(TestRuleIgnoreAfterMaxFailures.java:64) at org.apache.lucene.util.TestRuleMarkFailure$1.evaluate(TestRuleMarkFailure.java:47) at com.carrotsearch.randomizedtesting.rules.StatementAdapter.evaluate(StatementAdapter.java:36) at com.carrotsearch.randomizedtesting.ThreadLeakControl$StatementRunner.run(ThreadLeakControl.java:367) at com.carrotsearch.randomizedtesting.ThreadLeakControl.forkTimeoutingTask(ThreadLeakControl.java:811) at com.carrotsearch.randomizedtesting.ThreadLeakControl$3.evaluate(ThreadLeakControl.java:462) at com.carrotsearch.randomizedtesting.RandomizedRunner.runSingleTest(RandomizedRunner.java:916) at com.carrotsearch.randomizedtesting.RandomizedRunner$5.evaluate(RandomizedRunner.java:802) at com.carrotsearch.randomizedtesting.RandomizedRunner$6.evaluate(RandomizedRunner.java:852) at com.carrotsearch.randomizedtesting.RandomizedRunner$7.evaluate(RandomizedRunner.java:863) at com.carrotsearch.randomizedtesting.rules.StatementAdapter.evaluate(StatementAdapter.java:36) at com.carrotsearch.randomizedtesting.rules.SystemPropertiesRestoreRule$1.evaluate(SystemPropertiesRestoreRule.java:57) at org.apache.lucene.util.AbstractBeforeAfterRule$1.evaluate(AbstractBeforeAfterRule.java:45) at com.carrotsearch.randomizedtesting.rules.StatementAdapter.evaluate(StatementAdapter.java:36) at org.apache.lucene.util.TestRuleStoreClassName$1.evaluate(TestRuleStoreClassName.java:41) at com.carrotsearch.randomizedtesting.rules.NoShadowingOrOverridesOnMethodsRule$1.evaluate(NoShadowingOrOverridesOnMethodsRule.java:40) at com.carrotsearch.randomizedtesting.rules.NoShadowingOrOverridesOnMethodsRule$1.evaluate(NoShadowingOrOverridesOnMethodsRule.java:40) at com.carrotsearch.randomizedtesting.rules.StatementAdapter.evaluate(StatementAdapter.java:36) at com.carrotsearch.randomizedtesting.rules.StatementAdapter.evaluate(StatementAdapter.java:36) at com.carrotsearch.randomizedtesting.rules.StatementAdapter.evaluate(StatementAdapter.java:36) at org.apache.lucene.util.TestRuleAssertionsRequired$1.evaluate(TestRuleAssertionsRequired.java:53) at org.apache.lucene.util.TestRuleMarkFailure$1.evaluate(TestRuleMarkFailure.java:47) at org.apache.lucene.util.TestRuleIgnoreAfterMaxFailures$1.evaluate(TestRuleIgnoreAfterMaxFailures.java:64) at org.apache.lucene.util.TestRuleIgnoreTestSuites$1.evaluate(TestRuleIgnoreTestSuites.java:54) at com.carrotsearch.randomizedtesting.rules.StatementAdapter.evaluate(StatementAdapter.java:36) at com.carrotsearch.randomizedtesting.ThreadLeakControl$StatementRunner.run(ThreadLeakControl.java:367) at java.lang.Thread.run(Thread.java:745) FAILED: org.apache.solr.cloud.hdfs.HdfsChaosMonkeyNothingIsSafeTest.test Error Message: document count mismatch. control=834 sum(shards)=833 cloudClient=833 Stack Trace: java.lang.AssertionError: document count mismatch. control=834 sum(shards)=833 cloudClient=833 at __randomizedtesting.SeedInfo.seed([D4F93519FE4ADBAD:5CAD0AC350B6B655]:0) at org.junit.Assert.fail(Assert.java:93) at org.apache.solr.cloud.AbstractFullDistribZkTestBase.checkShardConsistency(AbstractFullDistribZkTestBase.java:1323) at org.apache.solr.cloud.ChaosMonkeyNothingIsSafeTest.test(ChaosMonkeyNothingIsSafeTest.java:228) at sun.reflect.NativeMethodAccessorImpl.invoke0(Native Method) at sun.reflect.NativeMethodAccessorImpl.invoke(NativeMethodAccessorImpl.java:62) at sun.reflect.DelegatingMethodAccessorImpl.invoke(DelegatingMethodAccessorImpl.java:43) at java.lang.reflect.Method.invoke(Method.java:498) at com.carrotsearch.randomizedtesting.RandomizedRunner.invoke(RandomizedRunner.java:1713) at com.carrotsearch.randomizedtesting.RandomizedRunner$8.evaluate(RandomizedRunner.java:907) at com.carrotsearch.randomizedtesting.RandomizedRunner$9.evaluate(RandomizedRunner.java:943) at com.carrotsearch.randomizedtesting.RandomizedRunner$10.evaluate(RandomizedRunner.java:957) at org.apache.solr.BaseDistributedSearchTestCase$ShardsRepeatRule$ShardsFixedStatement.callStatement(BaseDistributedSearchTestCase.java:992) at org.apache.solr.BaseDistributedSearchTestCase$ShardsRepeatRule$ShardsStatement.evaluate(BaseDistributedSearchTestCase.java:967) at com.carrotsearch.randomizedtesting.rules.SystemPropertiesRestoreRule$1.evaluate(SystemPropertiesRestoreRule.java:57) at org.apache.lucene.util.TestRuleSetupTeardownChained$1.evaluate(TestRuleSetupTeardownChained.java:49) at org.apache.lucene.util.AbstractBeforeAfterRule$1.evaluate(AbstractBeforeAfterRule.java:45) at org.apache.lucene.util.TestRuleThreadAndTestName$1.evaluate(TestRuleThreadAndTestName.java:48) at org.apache.lucene.util.TestRuleIgnoreAfterMaxFailures$1.evaluate(TestRuleIgnoreAfterMaxFailures.java:64) at org.apache.lucene.util.TestRuleMarkFailure$1.evaluate(TestRuleMarkFailure.java:47) at com.carrotsearch.randomizedtesting.rules.StatementAdapter.evaluate(StatementAdapter.java:36) at com.carrotsearch.randomizedtesting.ThreadLeakControl$StatementRunner.run(ThreadLeakControl.java:367) at com.carrotsearch.randomizedtesting.ThreadLeakControl.forkTimeoutingTask(ThreadLeakControl.java:811) at com.carrotsearch.randomizedtesting.ThreadLeakControl$3.evaluate(ThreadLeakControl.java:462) at com.carrotsearch.randomizedtesting.RandomizedRunner.runSingleTest(RandomizedRunner.java:916) at com.carrotsearch.randomizedtesting.RandomizedRunner$5.evaluate(RandomizedRunner.java:802) at com.carrotsearch.randomizedtesting.RandomizedRunner$6.evaluate(RandomizedRunner.java:852) at com.carrotsearch.randomizedtesting.RandomizedRunner$7.evaluate(RandomizedRunner.java:863) at com.carrotsearch.randomizedtesting.rules.StatementAdapter.evaluate(StatementAdapter.java:36) at com.carrotsearch.randomizedtesting.rules.SystemPropertiesRestoreRule$1.evaluate(SystemPropertiesRestoreRule.java:57) at org.apache.lucene.util.AbstractBeforeAfterRule$1.evaluate(AbstractBeforeAfterRule.java:45) at com.carrotsearch.randomizedtesting.rules.StatementAdapter.evaluate(StatementAdapter.java:36) at org.apache.lucene.util.TestRuleStoreClassName$1.evaluate(TestRuleStoreClassName.java:41) at com.carrotsearch.randomizedtesting.rules.NoShadowingOrOverridesOnMethodsRule$1.evaluate(NoShadowingOrOverridesOnMethodsRule.java:40) at com.carrotsearch.randomizedtesting.rules.NoShadowingOrOverridesOnMethodsRule$1.evaluate(NoShadowingOrOverridesOnMethodsRule.java:40) at com.carrotsearch.randomizedtesting.rules.StatementAdapter.evaluate(StatementAdapter.java:36) at com.carrotsearch.randomizedtesting.rules.StatementAdapter.evaluate(StatementAdapter.java:36) at com.carrotsearch.randomizedtesting.rules.StatementAdapter.evaluate(StatementAdapter.java:36) at org.apache.lucene.util.TestRuleAssertionsRequired$1.evaluate(TestRuleAssertionsRequired.java:53) at org.apache.lucene.util.TestRuleMarkFailure$1.evaluate(TestRuleMarkFailure.java:47) at org.apache.lucene.util.TestRuleIgnoreAfterMaxFailures$1.evaluate(TestRuleIgnoreAfterMaxFailures.java:64) at org.apache.lucene.util.TestRuleIgnoreTestSuites$1.evaluate(TestRuleIgnoreTestSuites.java:54) at com.carrotsearch.randomizedtesting.rules.StatementAdapter.evaluate(StatementAdapter.java:36) at com.carrotsearch.randomizedtesting.ThreadLeakControl$StatementRunner.run(ThreadLeakControl.java:367) at java.lang.Thread.run(Thread.java:745) FAILED: junit.framework.TestSuite.org.apache.solr.cloud.hdfs.HdfsChaosMonkeySafeLeaderTest Error Message: ObjectTracker found 1 object(s) that were not released!!! [HdfsTransactionLog] org.apache.solr.common.util.ObjectReleaseTracker$ObjectTrackerException at org.apache.solr.common.util.ObjectReleaseTracker.track(ObjectReleaseTracker.java:43) at org.apache.solr.update.HdfsTransactionLog.(HdfsTransactionLog.java:130) at org.apache.solr.update.HdfsTransactionLog.(HdfsTransactionLog.java:74) at org.apache.solr.update.HdfsUpdateLog.ensureLog(HdfsUpdateLog.java:313) at org.apache.solr.update.UpdateLog.delete(UpdateLog.java:466) at org.apache.solr.update.DirectUpdateHandler2.delete(DirectUpdateHandler2.java:381) at org.apache.solr.update.processor.RunUpdateProcessor.processDelete(RunUpdateProcessorFactory.java:75) at org.apache.solr.update.processor.UpdateRequestProcessor.processDelete(UpdateRequestProcessor.java:52) at org.apache.solr.update.processor.DistributedUpdateProcessor.doLocalDelete(DistributedUpdateProcessor.java:962) at org.apache.solr.update.processor.DistributedUpdateProcessor.versionDelete(DistributedUpdateProcessor.java:1613) at org.apache.solr.update.processor.DistributedUpdateProcessor.processDelete(DistributedUpdateProcessor.java:1172) at org.apache.solr.update.processor.LogUpdateProcessorFactory$LogUpdateProcessor.processDelete(LogUpdateProcessorFactory.java:124) at org.apache.solr.handler.loader.JavabinLoader.delete(JavabinLoader.java:151) at org.apache.solr.handler.loader.JavabinLoader.parseAndLoadDocs(JavabinLoader.java:112) at org.apache.solr.handler.loader.JavabinLoader.load(JavabinLoader.java:54) at org.apache.solr.handler.UpdateRequestHandler$1.load(UpdateRequestHandler.java:97) at org.apache.solr.handler.ContentStreamHandlerBase.handleRequestBody(ContentStreamHandlerBase.java:68) at org.apache.solr.handler.RequestHandlerBase.handleRequest(RequestHandlerBase.java:152) at org.apache.solr.core.SolrCore.execute(SolrCore.java:2210) at org.apache.solr.servlet.HttpSolrCall.execute(HttpSolrCall.java:658) at org.apache.solr.servlet.HttpSolrCall.call(HttpSolrCall.java:464) at org.apache.solr.servlet.SolrDispatchFilter.doFilter(SolrDispatchFilter.java:303) at org.apache.solr.servlet.SolrDispatchFilter.doFilter(SolrDispatchFilter.java:254) at org.eclipse.jetty.servlet.ServletHandler$CachedChain.doFilter(ServletHandler.java:1699) at org.apache.solr.client.solrj.embedded.JettySolrRunner$DebugFilter.doFilter(JettySolrRunner.java:110) at org.eclipse.jetty.servlet.ServletHandler$CachedChain.doFilter(ServletHandler.java:1699) at org.eclipse.jetty.servlet.ServletHandler.doHandle(ServletHandler.java:582) at org.eclipse.jetty.server.session.SessionHandler.doHandle(SessionHandler.java:224) at org.eclipse.jetty.server.handler.ContextHandler.doHandle(ContextHandler.java:1180) at org.eclipse.jetty.servlet.ServletHandler.doScope(ServletHandler.java:512) at org.eclipse.jetty.server.session.SessionHandler.doScope(SessionHandler.java:185) at org.eclipse.jetty.server.handler.ContextHandler.doScope(ContextHandler.java:1112) at org.eclipse.jetty.server.handler.ScopedHandler.handle(ScopedHandler.java:141) at org.eclipse.jetty.server.handler.gzip.GzipHandler.handle(GzipHandler.java:395) at org.eclipse.jetty.server.handler.HandlerWrapper.handle(HandlerWrapper.java:134) at org.eclipse.jetty.server.Server.handle(Server.java:534) at org.eclipse.jetty.server.HttpChannel.handle(HttpChannel.java:320) at org.eclipse.jetty.server.HttpConnection.onFillable(HttpConnection.java:251) at org.eclipse.jetty.io.AbstractConnection$ReadCallback.succeeded(AbstractConnection.java:273) at org.eclipse.jetty.io.FillInterest.fillable(FillInterest.java:95) at org.eclipse.jetty.io.SelectChannelEndPoint$2.run(SelectChannelEndPoint.java:93) at org.eclipse.jetty.util.thread.strategy.ExecuteProduceConsume.executeProduceConsume(ExecuteProduceConsume.java:303) at org.eclipse.jetty.util.thread.strategy.ExecuteProduceConsume.produceConsume(ExecuteProduceConsume.java:148) at org.eclipse.jetty.util.thread.strategy.ExecuteProduceConsume.run(ExecuteProduceConsume.java:136) at org.eclipse.jetty.util.thread.QueuedThreadPool.runJob(QueuedThreadPool.java:671) at org.eclipse.jetty.util.thread.QueuedThreadPool$2.run(QueuedThreadPool.java:589) at java.lang.Thread.run(Thread.java:745) Stack Trace: java.lang.AssertionError: ObjectTracker found 1 object(s) that were not released!!! [HdfsTransactionLog] org.apache.solr.common.util.ObjectReleaseTracker$ObjectTrackerException at org.apache.solr.common.util.ObjectReleaseTracker.track(ObjectReleaseTracker.java:43) at org.apache.solr.update.HdfsTransactionLog.(HdfsTransactionLog.java:130) at org.apache.solr.update.HdfsTransactionLog.(HdfsTransactionLog.java:74) at org.apache.solr.update.HdfsUpdateLog.ensureLog(HdfsUpdateLog.java:313) at org.apache.solr.update.UpdateLog.delete(UpdateLog.java:466) at org.apache.solr.update.DirectUpdateHandler2.delete(DirectUpdateHandler2.java:381) at org.apache.solr.update.processor.RunUpdateProcessor.processDelete(RunUpdateProcessorFactory.java:75) at org.apache.solr.update.processor.UpdateRequestProcessor.processDelete(UpdateRequestProcessor.java:52) at org.apache.solr.update.processor.DistributedUpdateProcessor.doLocalDelete(DistributedUpdateProcessor.java:962) at org.apache.solr.update.processor.DistributedUpdateProcessor.versionDelete(DistributedUpdateProcessor.java:1613) at org.apache.solr.update.processor.DistributedUpdateProcessor.processDelete(DistributedUpdateProcessor.java:1172) at org.apache.solr.update.processor.LogUpdateProcessorFactory$LogUpdateProcessor.processDelete(LogUpdateProcessorFactory.java:124) at org.apache.solr.handler.loader.JavabinLoader.delete(JavabinLoader.java:151) at org.apache.solr.handler.loader.JavabinLoader.parseAndLoadDocs(JavabinLoader.java:112) at org.apache.solr.handler.loader.JavabinLoader.load(JavabinLoader.java:54) at org.apache.solr.handler.UpdateRequestHandler$1.load(UpdateRequestHandler.java:97) at org.apache.solr.handler.ContentStreamHandlerBase.handleRequestBody(ContentStreamHandlerBase.java:68) at org.apache.solr.handler.RequestHandlerBase.handleRequest(RequestHandlerBase.java:152) at org.apache.solr.core.SolrCore.execute(SolrCore.java:2210) at org.apache.solr.servlet.HttpSolrCall.execute(HttpSolrCall.java:658) at org.apache.solr.servlet.HttpSolrCall.call(HttpSolrCall.java:464) at org.apache.solr.servlet.SolrDispatchFilter.doFilter(SolrDispatchFilter.java:303) at org.apache.solr.servlet.SolrDispatchFilter.doFilter(SolrDispatchFilter.java:254) at org.eclipse.jetty.servlet.ServletHandler$CachedChain.doFilter(ServletHandler.java:1699) at org.apache.solr.client.solrj.embedded.JettySolrRunner$DebugFilter.doFilter(JettySolrRunner.java:110) at org.eclipse.jetty.servlet.ServletHandler$CachedChain.doFilter(ServletHandler.java:1699) at org.eclipse.jetty.servlet.ServletHandler.doHandle(ServletHandler.java:582) at org.eclipse.jetty.server.session.SessionHandler.doHandle(SessionHandler.java:224) at org.eclipse.jetty.server.handler.ContextHandler.doHandle(ContextHandler.java:1180) at org.eclipse.jetty.servlet.ServletHandler.doScope(ServletHandler.java:512) at org.eclipse.jetty.server.session.SessionHandler.doScope(SessionHandler.java:185) at org.eclipse.jetty.server.handler.ContextHandler.doScope(ContextHandler.java:1112) at org.eclipse.jetty.server.handler.ScopedHandler.handle(ScopedHandler.java:141) at org.eclipse.jetty.server.handler.gzip.GzipHandler.handle(GzipHandler.java:395) at org.eclipse.jetty.server.handler.HandlerWrapper.handle(HandlerWrapper.java:134) at org.eclipse.jetty.server.Server.handle(Server.java:534) at org.eclipse.jetty.server.HttpChannel.handle(HttpChannel.java:320) at org.eclipse.jetty.server.HttpConnection.onFillable(HttpConnection.java:251) at org.eclipse.jetty.io.AbstractConnection$ReadCallback.succeeded(AbstractConnection.java:273) at org.eclipse.jetty.io.FillInterest.fillable(FillInterest.java:95) at org.eclipse.jetty.io.SelectChannelEndPoint$2.run(SelectChannelEndPoint.java:93) at org.eclipse.jetty.util.thread.strategy.ExecuteProduceConsume.executeProduceConsume(ExecuteProduceConsume.java:303) at org.eclipse.jetty.util.thread.strategy.ExecuteProduceConsume.produceConsume(ExecuteProduceConsume.java:148) at org.eclipse.jetty.util.thread.strategy.ExecuteProduceConsume.run(ExecuteProduceConsume.java:136) at org.eclipse.jetty.util.thread.QueuedThreadPool.runJob(QueuedThreadPool.java:671) at org.eclipse.jetty.util.thread.QueuedThreadPool$2.run(QueuedThreadPool.java:589) at java.lang.Thread.run(Thread.java:745) at __randomizedtesting.SeedInfo.seed([D4F93519FE4ADBAD]:0) at org.junit.Assert.fail(Assert.java:93) at org.junit.Assert.assertTrue(Assert.java:43) at org.junit.Assert.assertNull(Assert.java:551) at org.apache.solr.SolrTestCaseJ4.teardownTestCases(SolrTestCaseJ4.java:266) at sun.reflect.GeneratedMethodAccessor30.invoke(Unknown Source) at sun.reflect.DelegatingMethodAccessorImpl.invoke(DelegatingMethodAccessorImpl.java:43) at java.lang.reflect.Method.invoke(Method.java:498) at com.carrotsearch.randomizedtesting.RandomizedRunner.invoke(RandomizedRunner.java:1713) at com.carrotsearch.randomizedtesting.RandomizedRunner$7.evaluate(RandomizedRunner.java:870) at com.carrotsearch.randomizedtesting.rules.StatementAdapter.evaluate(StatementAdapter.java:36) at com.carrotsearch.randomizedtesting.rules.SystemPropertiesRestoreRule$1.evaluate(SystemPropertiesRestoreRule.java:57) at org.apache.lucene.util.AbstractBeforeAfterRule$1.evaluate(AbstractBeforeAfterRule.java:45) at com.carrotsearch.randomizedtesting.rules.StatementAdapter.evaluate(StatementAdapter.java:36) at org.apache.lucene.util.TestRuleStoreClassName$1.evaluate(TestRuleStoreClassName.java:41) at com.carrotsearch.randomizedtesting.rules.NoShadowingOrOverridesOnMethodsRule$1.evaluate(NoShadowingOrOverridesOnMethodsRule.java:40) at com.carrotsearch.randomizedtesting.rules.NoShadowingOrOverridesOnMethodsRule$1.evaluate(NoShadowingOrOverridesOnMethodsRule.java:40) at com.carrotsearch.randomizedtesting.rules.StatementAdapter.evaluate(StatementAdapter.java:36) at com.carrotsearch.randomizedtesting.rules.StatementAdapter.evaluate(StatementAdapter.java:36) at com.carrotsearch.randomizedtesting.rules.StatementAdapter.evaluate(StatementAdapter.java:36) at org.apache.lucene.util.TestRuleAssertionsRequired$1.evaluate(TestRuleAssertionsRequired.java:53) at org.apache.lucene.util.TestRuleMarkFailure$1.evaluate(TestRuleMarkFailure.java:47) at org.apache.lucene.util.TestRuleIgnoreAfterMaxFailures$1.evaluate(TestRuleIgnoreAfterMaxFailures.java:64) at org.apache.lucene.util.TestRuleIgnoreTestSuites$1.evaluate(TestRuleIgnoreTestSuites.java:54) at com.carrotsearch.randomizedtesting.rules.StatementAdapter.evaluate(StatementAdapter.java:36) at com.carrotsearch.randomizedtesting.ThreadLeakControl$StatementRunner.run(ThreadLeakControl.java:367) at java.lang.Thread.run(Thread.java:745) FAILED: org.apache.solr.cloud.hdfs.HdfsSyncSliceTest.test Error Message: Error from server at http://127.0.0.1:40252/collection1: Expected mime type application/octet-stream but got text/html. Error 500

HTTP ERROR: 500

Problem accessing /collection1/update. Reason:

    {metadata={error-class=org.apache.solr.common.SolrException,root-error-class=java.lang.OutOfMemoryError},msg=SolrCore 'collection1' is not available due to init failure: The max direct memory is likely too low.  Either increase it (by adding -XX:MaxDirectMemorySize=<size>g -XX:+UseLargePages to your containers startup args) or disable direct allocation using solr.hdfs.blockcache.direct.memory.allocation=false in solrconfig.xml. If you are putting the block cache on the heap, your java heap size might not be large enough. Failed allocating ~8.388608 MB.,trace=org.apache.solr.common.SolrException: SolrCore 'collection1' is not available due to init failure: The max direct memory is likely too low.  Either increase it (by adding -XX:MaxDirectMemorySize=<size>g -XX:+UseLargePages to your containers startup args) or disable direct allocation using solr.hdfs.blockcache.direct.memory.allocation=false in solrconfig.xml. If you are putting the block cache on the heap, your java heap size might not be large enough. Failed allocating ~8.388608 MB.  at org.apache.solr.core.CoreContainer.getCore(CoreContainer.java:1097)  at org.apache.solr.servlet.HttpSolrCall.init(HttpSolrCall.java:252)  at org.apache.solr.servlet.HttpSolrCall.call(HttpSolrCall.java:418)  at org.apache.solr.servlet.SolrDispatchFilter.doFilter(SolrDispatchFilter.java:303)  at org.apache.solr.servlet.SolrDispatchFilter.doFilter(SolrDispatchFilter.java:254)  at org.eclipse.jetty.servlet.ServletHandler$CachedChain.doFilter(ServletHandler.java:1699)  at org.apache.solr.client.solrj.embedded.JettySolrRunner$DebugFilter.doFilter(JettySolrRunner.java:110)  at org.eclipse.jetty.servlet.ServletHandler$CachedChain.doFilter(ServletHandler.java:1699)  at org.eclipse.jetty.servlet.ServletHandler.doHandle(ServletHandler.java:582)  at org.eclipse.jetty.server.session.SessionHandler.doHandle(SessionHandler.java:224)  at org.eclipse.jetty.server.handler.ContextHandler.doHandle(ContextHandler.java:1180)  at org.eclipse.jetty.servlet.ServletHandler.doScope(ServletHandler.java:512)  at org.eclipse.jetty.server.session.SessionHandler.doScope(SessionHandler.java:185)  at org.eclipse.jetty.server.handler.ContextHandler.doScope(ContextHandler.java:1112)  at org.eclipse.jetty.server.handler.ScopedHandler.handle(ScopedHandler.java:141)  at org.eclipse.jetty.server.handler.gzip.GzipHandler.handle(GzipHandler.java:395)  at org.eclipse.jetty.server.handler.HandlerWrapper.handle(HandlerWrapper.java:134)  at org.eclipse.jetty.server.Server.handle(Server.java:534)  at org.eclipse.jetty.server.HttpChannel.handle(HttpChannel.java:320)  at org.eclipse.jetty.server.HttpConnection.onFillable(HttpConnection.java:251)  at org.eclipse.jetty.io.AbstractConnection$ReadCallback.succeeded(AbstractConnection.java:273)  at org.eclipse.jetty.io.FillInterest.fillable(FillInterest.java:95)  at org.eclipse.jetty.io.SelectChannelEndPoint$2.run(SelectChannelEndPoint.java:93)  at org.eclipse.jetty.util.thread.strategy.ExecuteProduceConsume.executeProduceConsume(ExecuteProduceConsume.java:303)  at org.eclipse.jetty.util.thread.strategy.ExecuteProduceConsume.produceConsume(ExecuteProduceConsume.java:148)  at org.eclipse.jetty.util.thread.strategy.ExecuteProduceConsume.run(ExecuteProduceConsume.java:136)  at org.eclipse.jetty.util.thread.QueuedThreadPool.runJob(QueuedThreadPool.java:671)  at org.eclipse.jetty.util.thread.QueuedThreadPool$2.run(QueuedThreadPool.java:589)  at java.lang.Thread.run(Thread.java:745) Caused by: org.apache.solr.common.SolrException: The max direct memory is likely too low.  Either increase it (by adding -XX:MaxDirectMemorySize=<size>g -XX:+UseLargePages to your containers startup args) or disable direct allocation using solr.hdfs.blockcache.direct.memory.allocation=false in solrconfig.xml. If you are putting the block cache on the heap, your java heap size might not be large enough. Failed allocating ~8.388608 MB.  at org.apache.solr.core.SolrCore.<init>(SolrCore.java:900)  at org.apache.solr.core.SolrCore.<init>(SolrCore.java:775)  at org.apache.solr.core.CoreContainer.create(CoreContainer.java:842)  at org.apache.solr.core.CoreContainer.lambda$load$0(CoreContainer.java:498)  at java.util.concurrent.FutureTask.run(FutureTask.java:266)  at org.apache.solr.common.util.ExecutorUtil$MDCAwareThreadPoolExecutor.lambda$execute$0(ExecutorUtil.java:229)  at java.util.concurrent.ThreadPoolExecutor.runWorker(ThreadPoolExecutor.java:1142)  at java.util.concurrent.ThreadPoolExecutor$Worker.run(ThreadPoolExecutor.java:617)  ... 1 more Caused by: java.lang.RuntimeException: The max direct memory is likely too low.  Either increase it (by adding -XX:MaxDirectMemorySize=<size>g -XX:+UseLargePages to your containers startup args) or disable direct allocation using solr.hdfs.blockcache.direct.memory.allocation=false in solrconfig.xml. If you are putting the block cache on the heap, your java heap size might not be large enough. Failed allocating ~8.388608 MB.  at org.apache.solr.core.HdfsDirectoryFactory.createBlockCache(HdfsDirectoryFactory.java:304)  at org.apache.solr.core.HdfsDirectoryFactory.getBlockDirectoryCache(HdfsDirectoryFactory.java:280)  at org.apache.solr.core.HdfsDirectoryFactory.create(HdfsDirectoryFactory.java:220)  at org.apache.solr.core.CachingDirectoryFactory.get(CachingDirectoryFactory.java:346)  at org.apache.solr.core.SolrCore.initSnapshotMetaDataManager(SolrCore.java:434)  at org.apache.solr.core.SolrCore.<init>(SolrCore.java:841)  ... 8 more Caused by: java.lang.OutOfMemoryError: Direct buffer memory  at java.nio.Bits.reserveMemory(Bits.java:693)  at java.nio.DirectByteBuffer.<init>(DirectByteBuffer.java:123)  at java.nio.ByteBuffer.allocateDirect(ByteBuffer.java:311)  at org.apache.solr.store.blockcache.BlockCache.<init>(BlockCache.java:68)  at org.apache.solr.core.HdfsDirectoryFactory.createBlockCache(HdfsDirectoryFactory.java:302)  ... 13 more ,code=500}


Powered by Jetty:// 9.3.14.v20161028
Stack Trace: org.apache.solr.client.solrj.impl.HttpSolrClient$RemoteSolrException: Error from server at http://127.0.0.1:40252/collection1: Expected mime type application/octet-stream but got text/html. Error 500

HTTP ERROR: 500

Problem accessing /collection1/update. Reason:

    {metadata={error-class=org.apache.solr.common.SolrException,root-error-class=java.lang.OutOfMemoryError},msg=SolrCore 'collection1' is not available due to init failure: The max direct memory is likely too low.  Either increase it (by adding -XX:MaxDirectMemorySize=<size>g -XX:+UseLargePages to your containers startup args) or disable direct allocation using solr.hdfs.blockcache.direct.memory.allocation=false in solrconfig.xml. If you are putting the block cache on the heap, your java heap size might not be large enough. Failed allocating ~8.388608 MB.,trace=org.apache.solr.common.SolrException: SolrCore 'collection1' is not available due to init failure: The max direct memory is likely too low.  Either increase it (by adding -XX:MaxDirectMemorySize=<size>g -XX:+UseLargePages to your containers startup args) or disable direct allocation using solr.hdfs.blockcache.direct.memory.allocation=false in solrconfig.xml. If you are putting the block cache on the heap, your java heap size might not be large enough. Failed allocating ~8.388608 MB.
	at org.apache.solr.core.CoreContainer.getCore(CoreContainer.java:1097)
	at org.apache.solr.servlet.HttpSolrCall.init(HttpSolrCall.java:252)
	at org.apache.solr.servlet.HttpSolrCall.call(HttpSolrCall.java:418)
	at org.apache.solr.servlet.SolrDispatchFilter.doFilter(SolrDispatchFilter.java:303)
	at org.apache.solr.servlet.SolrDispatchFilter.doFilter(SolrDispatchFilter.java:254)
	at org.eclipse.jetty.servlet.ServletHandler$CachedChain.doFilter(ServletHandler.java:1699)
	at org.apache.solr.client.solrj.embedded.JettySolrRunner$DebugFilter.doFilter(JettySolrRunner.java:110)
	at org.eclipse.jetty.servlet.ServletHandler$CachedChain.doFilter(ServletHandler.java:1699)
	at org.eclipse.jetty.servlet.ServletHandler.doHandle(ServletHandler.java:582)
	at org.eclipse.jetty.server.session.SessionHandler.doHandle(SessionHandler.java:224)
	at org.eclipse.jetty.server.handler.ContextHandler.doHandle(ContextHandler.java:1180)
	at org.eclipse.jetty.servlet.ServletHandler.doScope(ServletHandler.java:512)
	at org.eclipse.jetty.server.session.SessionHandler.doScope(SessionHandler.java:185)
	at org.eclipse.jetty.server.handler.ContextHandler.doScope(ContextHandler.java:1112)
	at org.eclipse.jetty.server.handler.ScopedHandler.handle(ScopedHandler.java:141)
	at org.eclipse.jetty.server.handler.gzip.GzipHandler.handle(GzipHandler.java:395)
	at org.eclipse.jetty.server.handler.HandlerWrapper.handle(HandlerWrapper.java:134)
	at org.eclipse.jetty.server.Server.handle(Server.java:534)
	at org.eclipse.jetty.server.HttpChannel.handle(HttpChannel.java:320)
	at org.eclipse.jetty.server.HttpConnection.onFillable(HttpConnection.java:251)
	at org.eclipse.jetty.io.AbstractConnection$ReadCallback.succeeded(AbstractConnection.java:273)
	at org.eclipse.jetty.io.FillInterest.fillable(FillInterest.java:95)
	at org.eclipse.jetty.io.SelectChannelEndPoint$2.run(SelectChannelEndPoint.java:93)
	at org.eclipse.jetty.util.thread.strategy.ExecuteProduceConsume.executeProduceConsume(ExecuteProduceConsume.java:303)
	at org.eclipse.jetty.util.thread.strategy.ExecuteProduceConsume.produceConsume(ExecuteProduceConsume.java:148)
	at org.eclipse.jetty.util.thread.strategy.ExecuteProduceConsume.run(ExecuteProduceConsume.java:136)
	at org.eclipse.jetty.util.thread.QueuedThreadPool.runJob(QueuedThreadPool.java:671)
	at org.eclipse.jetty.util.thread.QueuedThreadPool$2.run(QueuedThreadPool.java:589)
	at java.lang.Thread.run(Thread.java:745)
Caused by: org.apache.solr.common.SolrException: The max direct memory is likely too low.  Either increase it (by adding -XX:MaxDirectMemorySize=<size>g -XX:+UseLargePages to your containers startup args) or disable direct allocation using solr.hdfs.blockcache.direct.memory.allocation=false in solrconfig.xml. If you are putting the block cache on the heap, your java heap size might not be large enough. Failed allocating ~8.388608 MB.
	at org.apache.solr.core.SolrCore.<init>(SolrCore.java:900)
	at org.apache.solr.core.SolrCore.<init>(SolrCore.java:775)
	at org.apache.solr.core.CoreContainer.create(CoreContainer.java:842)
	at org.apache.solr.core.CoreContainer.lambda$load$0(CoreContainer.java:498)
	at java.util.concurrent.FutureTask.run(FutureTask.java:266)
	at org.apache.solr.common.util.ExecutorUtil$MDCAwareThreadPoolExecutor.lambda$execute$0(ExecutorUtil.java:229)
	at java.util.concurrent.ThreadPoolExecutor.runWorker(ThreadPoolExecutor.java:1142)
	at java.util.concurrent.ThreadPoolExecutor$Worker.run(ThreadPoolExecutor.java:617)
	... 1 more
Caused by: java.lang.RuntimeException: The max direct memory is likely too low.  Either increase it (by adding -XX:MaxDirectMemorySize=<size>g -XX:+UseLargePages to your containers startup args) or disable direct allocation using solr.hdfs.blockcache.direct.memory.allocation=false in solrconfig.xml. If you are putting the block cache on the heap, your java heap size might not be large enough. Failed allocating ~8.388608 MB.
	at org.apache.solr.core.HdfsDirectoryFactory.createBlockCache(HdfsDirectoryFactory.java:304)
	at org.apache.solr.core.HdfsDirectoryFactory.getBlockDirectoryCache(HdfsDirectoryFactory.java:280)
	at org.apache.solr.core.HdfsDirectoryFactory.create(HdfsDirectoryFactory.java:220)
	at org.apache.solr.core.CachingDirectoryFactory.get(CachingDirectoryFactory.java:346)
	at org.apache.solr.core.SolrCore.initSnapshotMetaDataManager(SolrCore.java:434)
	at org.apache.solr.core.SolrCore.<init>(SolrCore.java:841)
	... 8 more
Caused by: java.lang.OutOfMemoryError: Direct buffer memory
	at java.nio.Bits.reserveMemory(Bits.java:693)
	at java.nio.DirectByteBuffer.<init>(DirectByteBuffer.java:123)
	at java.nio.ByteBuffer.allocateDirect(ByteBuffer.java:311)
	at org.apache.solr.store.blockcache.BlockCache.<init>(BlockCache.java:68)
	at org.apache.solr.core.HdfsDirectoryFactory.createBlockCache(HdfsDirectoryFactory.java:302)
	... 13 more
,code=500}


Powered by Jetty:// 9.3.14.v20161028
at __randomizedtesting.SeedInfo.seed([D4F93519FE4ADBAD:5CAD0AC350B6B655]:0) at org.apache.solr.client.solrj.impl.HttpSolrClient.executeMethod(HttpSolrClient.java:561) at org.apache.solr.client.solrj.impl.HttpSolrClient.request(HttpSolrClient.java:262) at org.apache.solr.client.solrj.impl.HttpSolrClient.request(HttpSolrClient.java:251) at org.apache.solr.client.solrj.SolrRequest.process(SolrRequest.java:149) at org.apache.solr.client.solrj.SolrClient.deleteByQuery(SolrClient.java:895) at org.apache.solr.client.solrj.SolrClient.deleteByQuery(SolrClient.java:858) at org.apache.solr.client.solrj.SolrClient.deleteByQuery(SolrClient.java:873) at org.apache.solr.cloud.AbstractFullDistribZkTestBase.del(AbstractFullDistribZkTestBase.java:835) at org.apache.solr.cloud.SyncSliceTest.test(SyncSliceTest.java:73) at sun.reflect.NativeMethodAccessorImpl.invoke0(Native Method) at sun.reflect.NativeMethodAccessorImpl.invoke(NativeMethodAccessorImpl.java:62) at sun.reflect.DelegatingMethodAccessorImpl.invoke(DelegatingMethodAccessorImpl.java:43) at java.lang.reflect.Method.invoke(Method.java:498) at com.carrotsearch.randomizedtesting.RandomizedRunner.invoke(RandomizedRunner.java:1713) at com.carrotsearch.randomizedtesting.RandomizedRunner$8.evaluate(RandomizedRunner.java:907) at com.carrotsearch.randomizedtesting.RandomizedRunner$9.evaluate(RandomizedRunner.java:943) at com.carrotsearch.randomizedtesting.RandomizedRunner$10.evaluate(RandomizedRunner.java:957) at org.apache.solr.BaseDistributedSearchTestCase$ShardsRepeatRule$ShardsFixedStatement.callStatement(BaseDistributedSearchTestCase.java:992) at org.apache.solr.BaseDistributedSearchTestCase$ShardsRepeatRule$ShardsStatement.evaluate(BaseDistributedSearchTestCase.java:967) at com.carrotsearch.randomizedtesting.rules.SystemPropertiesRestoreRule$1.evaluate(SystemPropertiesRestoreRule.java:57) at org.apache.lucene.util.TestRuleSetupTeardownChained$1.evaluate(TestRuleSetupTeardownChained.java:49) at org.apache.lucene.util.AbstractBeforeAfterRule$1.evaluate(AbstractBeforeAfterRule.java:45) at org.apache.lucene.util.TestRuleThreadAndTestName$1.evaluate(TestRuleThreadAndTestName.java:48) at org.apache.lucene.util.TestRuleIgnoreAfterMaxFailures$1.evaluate(TestRuleIgnoreAfterMaxFailures.java:64) at org.apache.lucene.util.TestRuleMarkFailure$1.evaluate(TestRuleMarkFailure.java:47) at com.carrotsearch.randomizedtesting.rules.StatementAdapter.evaluate(StatementAdapter.java:36) at com.carrotsearch.randomizedtesting.ThreadLeakControl$StatementRunner.run(ThreadLeakControl.java:367) at com.carrotsearch.randomizedtesting.ThreadLeakControl.forkTimeoutingTask(ThreadLeakControl.java:811) at com.carrotsearch.randomizedtesting.ThreadLeakControl$3.evaluate(ThreadLeakControl.java:462) at com.carrotsearch.randomizedtesting.RandomizedRunner.runSingleTest(RandomizedRunner.java:916) at com.carrotsearch.randomizedtesting.RandomizedRunner$5.evaluate(RandomizedRunner.java:802) at com.carrotsearch.randomizedtesting.RandomizedRunner$6.evaluate(RandomizedRunner.java:852) at com.carrotsearch.randomizedtesting.RandomizedRunner$7.evaluate(RandomizedRunner.java:863) at com.carrotsearch.randomizedtesting.rules.StatementAdapter.evaluate(StatementAdapter.java:36) at com.carrotsearch.randomizedtesting.rules.SystemPropertiesRestoreRule$1.evaluate(SystemPropertiesRestoreRule.java:57) at org.apache.lucene.util.AbstractBeforeAfterRule$1.evaluate(AbstractBeforeAfterRule.java:45) at com.carrotsearch.randomizedtesting.rules.StatementAdapter.evaluate(StatementAdapter.java:36) at org.apache.lucene.util.TestRuleStoreClassName$1.evaluate(TestRuleStoreClassName.java:41) at com.carrotsearch.randomizedtesting.rules.NoShadowingOrOverridesOnMethodsRule$1.evaluate(NoShadowingOrOverridesOnMethodsRule.java:40) at com.carrotsearch.randomizedtesting.rules.NoShadowingOrOverridesOnMethodsRule$1.evaluate(NoShadowingOrOverridesOnMethodsRule.java:40) at com.carrotsearch.randomizedtesting.rules.StatementAdapter.evaluate(StatementAdapter.java:36) at com.carrotsearch.randomizedtesting.rules.StatementAdapter.evaluate(StatementAdapter.java:36) at com.carrotsearch.randomizedtesting.rules.StatementAdapter.evaluate(StatementAdapter.java:36) at org.apache.lucene.util.TestRuleAssertionsRequired$1.evaluate(TestRuleAssertionsRequired.java:53) at org.apache.lucene.util.TestRuleMarkFailure$1.evaluate(TestRuleMarkFailure.java:47) at org.apache.lucene.util.TestRuleIgnoreAfterMaxFailures$1.evaluate(TestRuleIgnoreAfterMaxFailures.java:64) at org.apache.lucene.util.TestRuleIgnoreTestSuites$1.evaluate(TestRuleIgnoreTestSuites.java:54) at com.carrotsearch.randomizedtesting.rules.StatementAdapter.evaluate(StatementAdapter.java:36) at com.carrotsearch.randomizedtesting.ThreadLeakControl$StatementRunner.run(ThreadLeakControl.java:367) at java.lang.Thread.run(Thread.java:745) FAILED: junit.framework.TestSuite.org.apache.solr.handler.TestReplicationHandler Error Message: ObjectTracker found 1 object(s) that were not released!!! [NRTCachingDirectory] org.apache.solr.common.util.ObjectReleaseTracker$ObjectTrackerException at org.apache.solr.common.util.ObjectReleaseTracker.track(ObjectReleaseTracker.java:43) at org.apache.solr.core.CachingDirectoryFactory.get(CachingDirectoryFactory.java:347) at org.apache.solr.handler.IndexFetcher.fetchLatestIndex(IndexFetcher.java:369) at org.apache.solr.handler.IndexFetcher.fetchLatestIndex(IndexFetcher.java:251) at org.apache.solr.handler.ReplicationHandler.doFetch(ReplicationHandler.java:397) at org.apache.solr.handler.ReplicationHandler.lambda$handleRequestBody$0(ReplicationHandler.java:279) at java.lang.Thread.run(Thread.java:745) Stack Trace: java.lang.AssertionError: ObjectTracker found 1 object(s) that were not released!!! [NRTCachingDirectory] org.apache.solr.common.util.ObjectReleaseTracker$ObjectTrackerException at org.apache.solr.common.util.ObjectReleaseTracker.track(ObjectReleaseTracker.java:43) at org.apache.solr.core.CachingDirectoryFactory.get(CachingDirectoryFactory.java:347) at org.apache.solr.handler.IndexFetcher.fetchLatestIndex(IndexFetcher.java:369) at org.apache.solr.handler.IndexFetcher.fetchLatestIndex(IndexFetcher.java:251) at org.apache.solr.handler.ReplicationHandler.doFetch(ReplicationHandler.java:397) at org.apache.solr.handler.ReplicationHandler.lambda$handleRequestBody$0(ReplicationHandler.java:279) at java.lang.Thread.run(Thread.java:745) at __randomizedtesting.SeedInfo.seed([D4F93519FE4ADBAD]:0) at org.junit.Assert.fail(Assert.java:93) at org.junit.Assert.assertTrue(Assert.java:43) at org.junit.Assert.assertNull(Assert.java:551) at org.apache.solr.SolrTestCaseJ4.teardownTestCases(SolrTestCaseJ4.java:266) at sun.reflect.NativeMethodAccessorImpl.invoke0(Native Method) at sun.reflect.NativeMethodAccessorImpl.invoke(NativeMethodAccessorImpl.java:62) at sun.reflect.DelegatingMethodAccessorImpl.invoke(DelegatingMethodAccessorImpl.java:43) at java.lang.reflect.Method.invoke(Method.java:498) at com.carrotsearch.randomizedtesting.RandomizedRunner.invoke(RandomizedRunner.java:1713) at com.carrotsearch.randomizedtesting.RandomizedRunner$7.evaluate(RandomizedRunner.java:870) at com.carrotsearch.randomizedtesting.rules.StatementAdapter.evaluate(StatementAdapter.java:36) at com.carrotsearch.randomizedtesting.rules.SystemPropertiesRestoreRule$1.evaluate(SystemPropertiesRestoreRule.java:57) at org.apache.lucene.util.AbstractBeforeAfterRule$1.evaluate(AbstractBeforeAfterRule.java:45) at com.carrotsearch.randomizedtesting.rules.StatementAdapter.evaluate(StatementAdapter.java:36) at org.apache.lucene.util.TestRuleStoreClassName$1.evaluate(TestRuleStoreClassName.java:41) at com.carrotsearch.randomizedtesting.rules.NoShadowingOrOverridesOnMethodsRule$1.evaluate(NoShadowingOrOverridesOnMethodsRule.java:40) at com.carrotsearch.randomizedtesting.rules.NoShadowingOrOverridesOnMethodsRule$1.evaluate(NoShadowingOrOverridesOnMethodsRule.java:40) at com.carrotsearch.randomizedtesting.rules.StatementAdapter.evaluate(StatementAdapter.java:36) at com.carrotsearch.randomizedtesting.rules.StatementAdapter.evaluate(StatementAdapter.java:36) at com.carrotsearch.randomizedtesting.rules.StatementAdapter.evaluate(StatementAdapter.java:36) at org.apache.lucene.util.TestRuleAssertionsRequired$1.evaluate(TestRuleAssertionsRequired.java:53) at org.apache.lucene.util.TestRuleMarkFailure$1.evaluate(TestRuleMarkFailure.java:47) at org.apache.lucene.util.TestRuleIgnoreAfterMaxFailures$1.evaluate(TestRuleIgnoreAfterMaxFailures.java:64) at org.apache.lucene.util.TestRuleIgnoreTestSuites$1.evaluate(TestRuleIgnoreTestSuites.java:54) at com.carrotsearch.randomizedtesting.rules.StatementAdapter.evaluate(StatementAdapter.java:36) at com.carrotsearch.randomizedtesting.ThreadLeakControl$StatementRunner.run(ThreadLeakControl.java:367) at java.lang.Thread.run(Thread.java:745) FAILED: org.apache.solr.cloud.hdfs.HdfsCollectionsAPIDistributedZkTest.testCollectionsAPI Error Message: Expected to see collection awhollynewcollection_0 null Last available state: DocCollection(awhollynewcollection_0//collections/awhollynewcollection_0/state.json/4)={ "replicationFactor":"1", "shards":{ "shard1":{ "range":"80000000-bfffffff", "state":"active", "replicas":{}}, "shard2":{ "range":"c0000000-ffffffff", "state":"active", "replicas":{}}, "shard3":{ "range":"0-3fffffff", "state":"active", "replicas":{}}, "shard4":{ "range":"40000000-7fffffff", "state":"active", "replicas":{}}}, "router":{"name":"compositeId"}, "maxShardsPerNode":"2", "autoAddReplicas":"false"} Stack Trace: java.lang.AssertionError: Expected to see collection awhollynewcollection_0 null Last available state: DocCollection(awhollynewcollection_0//collections/awhollynewcollection_0/state.json/4)={ "replicationFactor":"1", "shards":{ "shard1":{ "range":"80000000-bfffffff", "state":"active", "replicas":{}}, "shard2":{ "range":"c0000000-ffffffff", "state":"active", "replicas":{}}, "shard3":{ "range":"0-3fffffff", "state":"active", "replicas":{}}, "shard4":{ "range":"40000000-7fffffff", "state":"active", "replicas":{}}}, "router":{"name":"compositeId"}, "maxShardsPerNode":"2", "autoAddReplicas":"false"} at __randomizedtesting.SeedInfo.seed([D4F93519FE4ADBAD:9C8C41ADF879F438]:0) at org.junit.Assert.fail(Assert.java:93) at org.apache.solr.cloud.SolrCloudTestCase.waitForState(SolrCloudTestCase.java:237) at org.apache.solr.cloud.CollectionsAPIDistributedZkTest.testCollectionsAPI(CollectionsAPIDistributedZkTest.java:496) at sun.reflect.NativeMethodAccessorImpl.invoke0(Native Method) at sun.reflect.NativeMethodAccessorImpl.invoke(NativeMethodAccessorImpl.java:62) at sun.reflect.DelegatingMethodAccessorImpl.invoke(DelegatingMethodAccessorImpl.java:43) at java.lang.reflect.Method.invoke(Method.java:498) at com.carrotsearch.randomizedtesting.RandomizedRunner.invoke(RandomizedRunner.java:1713) at com.carrotsearch.randomizedtesting.RandomizedRunner$8.evaluate(RandomizedRunner.java:907) at com.carrotsearch.randomizedtesting.RandomizedRunner$9.evaluate(RandomizedRunner.java:943) at com.carrotsearch.randomizedtesting.RandomizedRunner$10.evaluate(RandomizedRunner.java:957) at com.carrotsearch.randomizedtesting.rules.SystemPropertiesRestoreRule$1.evaluate(SystemPropertiesRestoreRule.java:57) at org.apache.lucene.util.TestRuleSetupTeardownChained$1.evaluate(TestRuleSetupTeardownChained.java:49) at org.apache.lucene.util.AbstractBeforeAfterRule$1.evaluate(AbstractBeforeAfterRule.java:45) at org.apache.lucene.util.TestRuleThreadAndTestName$1.evaluate(TestRuleThreadAndTestName.java:48) at org.apache.lucene.util.TestRuleIgnoreAfterMaxFailures$1.evaluate(TestRuleIgnoreAfterMaxFailures.java:64) at org.apache.lucene.util.TestRuleMarkFailure$1.evaluate(TestRuleMarkFailure.java:47) at com.carrotsearch.randomizedtesting.rules.StatementAdapter.evaluate(StatementAdapter.java:36) at com.carrotsearch.randomizedtesting.ThreadLeakControl$StatementRunner.run(ThreadLeakControl.java:367) at com.carrotsearch.randomizedtesting.ThreadLeakControl.forkTimeoutingTask(ThreadLeakControl.java:811) at com.carrotsearch.randomizedtesting.ThreadLeakControl$3.evaluate(ThreadLeakControl.java:462) at com.carrotsearch.randomizedtesting.RandomizedRunner.runSingleTest(RandomizedRunner.java:916) at com.carrotsearch.randomizedtesting.RandomizedRunner$5.evaluate(RandomizedRunner.java:802) at com.carrotsearch.randomizedtesting.RandomizedRunner$6.evaluate(RandomizedRunner.java:852) at com.carrotsearch.randomizedtesting.RandomizedRunner$7.evaluate(RandomizedRunner.java:863) at com.carrotsearch.randomizedtesting.rules.StatementAdapter.evaluate(StatementAdapter.java:36) at com.carrotsearch.randomizedtesting.rules.SystemPropertiesRestoreRule$1.evaluate(SystemPropertiesRestoreRule.java:57) at org.apache.lucene.util.AbstractBeforeAfterRule$1.evaluate(AbstractBeforeAfterRule.java:45) at com.carrotsearch.randomizedtesting.rules.StatementAdapter.evaluate(StatementAdapter.java:36) at org.apache.lucene.util.TestRuleStoreClassName$1.evaluate(TestRuleStoreClassName.java:41) at com.carrotsearch.randomizedtesting.rules.NoShadowingOrOverridesOnMethodsRule$1.evaluate(NoShadowingOrOverridesOnMethodsRule.java:40) at com.carrotsearch.randomizedtesting.rules.NoShadowingOrOverridesOnMethodsRule$1.evaluate(NoShadowingOrOverridesOnMethodsRule.java:40) at com.carrotsearch.randomizedtesting.rules.StatementAdapter.evaluate(StatementAdapter.java:36) at com.carrotsearch.randomizedtesting.rules.StatementAdapter.evaluate(StatementAdapter.java:36) at com.carrotsearch.randomizedtesting.rules.StatementAdapter.evaluate(StatementAdapter.java:36) at org.apache.lucene.util.TestRuleAssertionsRequired$1.evaluate(TestRuleAssertionsRequired.java:53) at org.apache.lucene.util.TestRuleMarkFailure$1.evaluate(TestRuleMarkFailure.java:47) at org.apache.lucene.util.TestRuleIgnoreAfterMaxFailures$1.evaluate(TestRuleIgnoreAfterMaxFailures.java:64) at org.apache.lucene.util.TestRuleIgnoreTestSuites$1.evaluate(TestRuleIgnoreTestSuites.java:54) at com.carrotsearch.randomizedtesting.rules.StatementAdapter.evaluate(StatementAdapter.java:36) at com.carrotsearch.randomizedtesting.ThreadLeakControl$StatementRunner.run(ThreadLeakControl.java:367) at java.lang.Thread.run(Thread.java:745) FAILED: org.apache.solr.cloud.hdfs.HdfsCollectionsAPIDistributedZkTest.testSpecificConfigsets Error Message: KeeperErrorCode = NoNode for /collections/withconfigset2 Stack Trace: org.apache.zookeeper.KeeperException$NoNodeException: KeeperErrorCode = NoNode for /collections/withconfigset2 at __randomizedtesting.SeedInfo.seed([D4F93519FE4ADBAD:F9877A43096E61A1]:0) at org.apache.zookeeper.KeeperException.create(KeeperException.java:111) at org.apache.zookeeper.KeeperException.create(KeeperException.java:51) at org.apache.zookeeper.ZooKeeper.getData(ZooKeeper.java:1155) at org.apache.solr.common.cloud.SolrZkClient$7.execute(SolrZkClient.java:356) at org.apache.solr.common.cloud.SolrZkClient$7.execute(SolrZkClient.java:353) at org.apache.solr.common.cloud.ZkCmdExecutor.retryOperation(ZkCmdExecutor.java:60) at org.apache.solr.common.cloud.SolrZkClient.getData(SolrZkClient.java:353) at org.apache.solr.cloud.CollectionsAPIDistributedZkTest.testSpecificConfigsets(CollectionsAPIDistributedZkTest.java:425) at sun.reflect.NativeMethodAccessorImpl.invoke0(Native Method) at sun.reflect.NativeMethodAccessorImpl.invoke(NativeMethodAccessorImpl.java:62) at sun.reflect.DelegatingMethodAccessorImpl.invoke(DelegatingMethodAccessorImpl.java:43) at java.lang.reflect.Method.invoke(Method.java:498) at com.carrotsearch.randomizedtesting.RandomizedRunner.invoke(RandomizedRunner.java:1713) at com.carrotsearch.randomizedtesting.RandomizedRunner$8.evaluate(RandomizedRunner.java:907) at com.carrotsearch.randomizedtesting.RandomizedRunner$9.evaluate(RandomizedRunner.java:943) at com.carrotsearch.randomizedtesting.RandomizedRunner$10.evaluate(RandomizedRunner.java:957) at com.carrotsearch.randomizedtesting.rules.SystemPropertiesRestoreRule$1.evaluate(SystemPropertiesRestoreRule.java:57) at org.apache.lucene.util.TestRuleSetupTeardownChained$1.evaluate(TestRuleSetupTeardownChained.java:49) at org.apache.lucene.util.AbstractBeforeAfterRule$1.evaluate(AbstractBeforeAfterRule.java:45) at org.apache.lucene.util.TestRuleThreadAndTestName$1.evaluate(TestRuleThreadAndTestName.java:48) at org.apache.lucene.util.TestRuleIgnoreAfterMaxFailures$1.evaluate(TestRuleIgnoreAfterMaxFailures.java:64) at org.apache.lucene.util.TestRuleMarkFailure$1.evaluate(TestRuleMarkFailure.java:47) at com.carrotsearch.randomizedtesting.rules.StatementAdapter.evaluate(StatementAdapter.java:36) at com.carrotsearch.randomizedtesting.ThreadLeakControl$StatementRunner.run(ThreadLeakControl.java:367) at com.carrotsearch.randomizedtesting.ThreadLeakControl.forkTimeoutingTask(ThreadLeakControl.java:811) at com.carrotsearch.randomizedtesting.ThreadLeakControl$3.evaluate(ThreadLeakControl.java:462) at com.carrotsearch.randomizedtesting.RandomizedRunner.runSingleTest(RandomizedRunner.java:916) at com.carrotsearch.randomizedtesting.RandomizedRunner$5.evaluate(RandomizedRunner.java:802) at com.carrotsearch.randomizedtesting.RandomizedRunner$6.evaluate(RandomizedRunner.java:852) at com.carrotsearch.randomizedtesting.RandomizedRunner$7.evaluate(RandomizedRunner.java:863) at com.carrotsearch.randomizedtesting.rules.StatementAdapter.evaluate(StatementAdapter.java:36) at com.carrotsearch.randomizedtesting.rules.SystemPropertiesRestoreRule$1.evaluate(SystemPropertiesRestoreRule.java:57) at org.apache.lucene.util.AbstractBeforeAfterRule$1.evaluate(AbstractBeforeAfterRule.java:45) at com.carrotsearch.randomizedtesting.rules.StatementAdapter.evaluate(StatementAdapter.java:36) at org.apache.lucene.util.TestRuleStoreClassName$1.evaluate(TestRuleStoreClassName.java:41) at com.carrotsearch.randomizedtesting.rules.NoShadowingOrOverridesOnMethodsRule$1.evaluate(NoShadowingOrOverridesOnMethodsRule.java:40) at com.carrotsearch.randomizedtesting.rules.NoShadowingOrOverridesOnMethodsRule$1.evaluate(NoShadowingOrOverridesOnMethodsRule.java:40) at com.carrotsearch.randomizedtesting.rules.StatementAdapter.evaluate(StatementAdapter.java:36) at com.carrotsearch.randomizedtesting.rules.StatementAdapter.evaluate(StatementAdapter.java:36) at com.carrotsearch.randomizedtesting.rules.StatementAdapter.evaluate(StatementAdapter.java:36) at org.apache.lucene.util.TestRuleAssertionsRequired$1.evaluate(TestRuleAssertionsRequired.java:53) at org.apache.lucene.util.TestRuleMarkFailure$1.evaluate(TestRuleMarkFailure.java:47) at org.apache.lucene.util.TestRuleIgnoreAfterMaxFailures$1.evaluate(TestRuleIgnoreAfterMaxFailures.java:64) at org.apache.lucene.util.TestRuleIgnoreTestSuites$1.evaluate(TestRuleIgnoreTestSuites.java:54) at com.carrotsearch.randomizedtesting.rules.StatementAdapter.evaluate(StatementAdapter.java:36) at com.carrotsearch.randomizedtesting.ThreadLeakControl$StatementRunner.run(ThreadLeakControl.java:367) at java.lang.Thread.run(Thread.java:745) Build Log: [...truncated 1839 lines...] [junit4] Suite: org.apache.lucene.search.TestFuzzyQuery [junit4] 2> Dec 12, 2016 10:21:33 PM com.carrotsearch.randomizedtesting.ThreadLeakControl$2 evaluate [junit4] 2> WARNING: Suite execution timed out: org.apache.lucene.search.TestFuzzyQuery [junit4] 2> 1) Thread[id=1, name=main, state=WAITING, group=main] [junit4] 2> at java.lang.Object.wait(Native Method) [junit4] 2> at java.lang.Thread.join(Thread.java:1249) [junit4] 2> at java.lang.Thread.join(Thread.java:1323) [junit4] 2> at com.carrotsearch.randomizedtesting.RandomizedRunner.runSuite(RandomizedRunner.java:608) [junit4] 2> at com.carrotsearch.randomizedtesting.RandomizedRunner.run(RandomizedRunner.java:457) [junit4] 2> at com.carrotsearch.ant.tasks.junit4.slave.SlaveMain.execute(SlaveMain.java:243) [junit4] 2> at com.carrotsearch.ant.tasks.junit4.slave.SlaveMain.main(SlaveMain.java:354) [junit4] 2> at com.carrotsearch.ant.tasks.junit4.slave.SlaveMainSafe.main(SlaveMainSafe.java:10) [junit4] 2> 2) Thread[id=5026, name=SUITE-TestFuzzyQuery-seed#[54B09E7352D7D3C], state=RUNNABLE, group=TGRP-TestFuzzyQuery] [junit4] 2> at java.lang.Thread.getStackTrace(Thread.java:1556) [junit4] 2> at com.carrotsearch.randomizedtesting.ThreadLeakControl$4.run(ThreadLeakControl.java:690) [junit4] 2> at com.carrotsearch.randomizedtesting.ThreadLeakControl$4.run(ThreadLeakControl.java:687) [junit4] 2> at java.security.AccessController.doPrivileged(Native Method) [junit4] 2> at com.carrotsearch.randomizedtesting.ThreadLeakControl.getStackTrace(ThreadLeakControl.java:687) [junit4] 2> at com.carrotsearch.randomizedtesting.ThreadLeakControl.getThreadsWithTraces(ThreadLeakControl.java:703) [junit4] 2> at com.carrotsearch.randomizedtesting.ThreadLeakControl.formatThreadStacksFull(ThreadLeakControl.java:683) [junit4] 2> at com.carrotsearch.randomizedtesting.ThreadLeakControl.access$1000(ThreadLeakControl.java:64) [junit4] 2> at com.carrotsearch.randomizedtesting.ThreadLeakControl$2.evaluate(ThreadLeakControl.java:415) [junit4] 2> at com.carrotsearch.randomizedtesting.RandomizedRunner.runSuite(RandomizedRunner.java:678) [junit4] 2> at com.carrotsearch.randomizedtesting.RandomizedRunner.access$200(RandomizedRunner.java:140) [junit4] 2> at com.carrotsearch.randomizedtesting.RandomizedRunner$2.run(RandomizedRunner.java:598) [junit4] 2> 3) Thread[id=5027, name=TEST-TestFuzzyQuery.testRandom-seed#[54B09E7352D7D3C], state=RUNNABLE, group=TGRP-TestFuzzyQuery] [junit4] 2> at com.carrotsearch.randomizedtesting.RandomizedContext.current(RandomizedContext.java:134) [junit4] 2> at org.apache.lucene.util.LuceneTestCase.random(LuceneTestCase.java:729) [junit4] 2> at org.apache.lucene.search.TestFuzzyQuery.randomSimpleString(TestFuzzyQuery.java:506) [junit4] 2> at org.apache.lucene.search.TestFuzzyQuery.testRandom(TestFuzzyQuery.java:517) [junit4] 2> at sun.reflect.NativeMethodAccessorImpl.invoke0(Native Method) [junit4] 2> at sun.reflect.NativeMethodAccessorImpl.invoke(NativeMethodAccessorImpl.java:62) [junit4] 2> at sun.reflect.DelegatingMethodAccessorImpl.invoke(DelegatingMethodAccessorImpl.java:43) [junit4] 2> at java.lang.reflect.Method.invoke(Method.java:498) [junit4] 2> at com.carrotsearch.randomizedtesting.RandomizedRunner.invoke(RandomizedRunner.java:1713) [junit4] 2> at com.carrotsearch.randomizedtesting.RandomizedRunner$8.evaluate(RandomizedRunner.java:907) [junit4] 2> at com.carrotsearch.randomizedtesting.RandomizedRunner$9.evaluate(RandomizedRunner.java:943) [junit4] 2> at com.carrotsearch.randomizedtesting.RandomizedRunner$10.evaluate(RandomizedRunner.java:957) [junit4] 2> at org.apache.lucene.util.TestRuleSetupTeardownChained$1.evaluate(TestRuleSetupTeardownChained.java:49) [junit4] 2> at org.apache.lucene.util.AbstractBeforeAfterRule$1.evaluate(AbstractBeforeAfterRule.java:45) [junit4] 2> at org.apache.lucene.util.TestRuleThreadAndTestName$1.evaluate(TestRuleThreadAndTestName.java:48) [junit4] 2> at org.apache.lucene.util.TestRuleIgnoreAfterMaxFailures$1.evaluate(TestRuleIgnoreAfterMaxFailures.java:64) [junit4] 2> at org.apache.lucene.util.TestRuleMarkFailure$1.evaluate(TestRuleMarkFailure.java:47) [junit4] 2> at com.carrotsearch.randomizedtesting.rules.StatementAdapter.evaluate(StatementAdapter.java:36) [junit4] 2> at com.carrotsearch.randomizedtesting.ThreadLeakControl$StatementRunner.run(ThreadLeakControl.java:367) [junit4] 2> at com.carrotsearch.randomizedtesting.ThreadLeakControl.forkTimeoutingTask(ThreadLeakControl.java:811) [junit4] 2> at com.carrotsearch.randomizedtesting.ThreadLeakControl$3.evaluate(ThreadLeakControl.java:462) [junit4] 2> at com.carrotsearch.randomizedtesting.RandomizedRunner.runSingleTest(RandomizedRunner.java:916) [junit4] 2> at com.carrotsearch.randomizedtesting.RandomizedRunner$5.evaluate(RandomizedRunner.java:802) [junit4] 2> at com.carrotsearch.randomizedtesting.RandomizedRunner$6.evaluate(RandomizedRunner.java:852) [junit4] 2> at com.carrotsearch.randomizedtesting.RandomizedRunner$7.evaluate(RandomizedRunner.java:863) [junit4] 2> at org.apache.lucene.util.AbstractBeforeAfterRule$1.evaluate(AbstractBeforeAfterRule.java:45) [junit4] 2> at com.carrotsearch.randomizedtesting.rules.StatementAdapter.evaluate(StatementAdapter.java:36) [junit4] 2> at org.apache.lucene.util.TestRuleStoreClassName$1.evaluate(TestRuleStoreClassName.java:41) [junit4] 2> at com.carrotsearch.randomizedtesting.rules.NoShadowingOrOverridesOnMethodsRule$1.evaluate(NoShadowingOrOverridesOnMethodsRule.java:40) [junit4] 2> at com.carrotsearch.randomizedtesting.rules.NoShadowingOrOverridesOnMethodsRule$1.evaluate(NoShadowingOrOverridesOnMethodsRule.java:40) [junit4] 2> at com.carrotsearch.randomizedtesting.rules.StatementAdapter.evaluate(StatementAdapter.java:36) [junit4] 2> at com.carrotsearch.randomizedtesting.rules.StatementAdapter.evaluate(StatementAdapter.java:36) [junit4] 2> at com.carrotsearch.randomizedtesting.rules.StatementAdapter.evaluate(StatementAdapter.java:36) [junit4] 2> at org.apache.lucene.util.TestRuleAssertionsRequired$1.evaluate(TestRuleAssertionsRequired.java:53) [junit4] 2> at org.apache.lucene.util.TestRuleMarkFailure$1.evaluate(TestRuleMarkFailure.java:47) [junit4] 2> at org.apache.lucene.util.TestRuleIgnoreAfterMaxFailures$1.evaluate(TestRuleIgnoreAfterMaxFailures.java:64) [junit4] 2> at org.apache.lucene.util.TestRuleIgnoreTestSuites$1.evaluate(TestRuleIgnoreTestSuites.java:54) [junit4] 2> at com.carrotsearch.randomizedtesting.rules.StatementAdapter.evaluate(StatementAdapter.java:36) [junit4] 2> at com.carrotsearch.randomizedtesting.ThreadLeakControl$StatementRunner.run(ThreadLeakControl.java:367) [junit4] 2> at java.lang.Thread.run(Thread.java:745) [junit4] 2> 4) Thread[id=9, name=JUnit4-serializer-daemon, state=TIMED_WAITING, group=main] [junit4] 2> at java.lang.Thread.sleep(Native Method) [junit4] 2> at com.carrotsearch.ant.tasks.junit4.events.Serializer$1.run(Serializer.java:50) [junit4] 2> NOTE: download the large Jenkins line-docs file by running 'ant get-jenkins-line-docs' in the lucene directory. [junit4] 2> NOTE: reproduce with: ant test -Dtestcase=TestFuzzyQuery -Dtests.method=testRandom -Dtests.seed=54B09E7352D7D3C -Dtests.multiplier=2 -Dtests.nightly=true -Dtests.slow=true -Dtests.linedocsfile=/home/jenkins/jenkins-slave/workspace/Lucene-Solr-NightlyTests-6.x/test-data/enwiki.random.lines.txt -Dtests.locale=en-MT -Dtests.timezone=Europe/Monaco -Dtests.asserts=true -Dtests.file.encoding=UTF-8 [junit4] ERROR 7200s J1 | TestFuzzyQuery.testRandom <<< [junit4] > Throwable #1: java.lang.Exception: Test abandoned because suite timeout was reached. [junit4] > at __randomizedtesting.SeedInfo.seed([54B09E7352D7D3C]:0) [junit4] 2> Dec 12, 2016 10:21:33 PM com.carrotsearch.randomizedtesting.ThreadLeakControl checkThreadLeaks [junit4] 2> WARNING: Will linger awaiting termination of 1 leaked thread(s). [junit4] 2> Dec 12, 2016 10:21:54 PM com.carrotsearch.randomizedtesting.ThreadLeakControl checkThreadLeaks [junit4] 2> SEVERE: 1 thread leaked from SUITE scope at org.apache.lucene.search.TestFuzzyQuery: [junit4] 2> 1) Thread[id=5027, name=TEST-TestFuzzyQuery.testRandom-seed#[54B09E7352D7D3C], state=RUNNABLE, group=TGRP-TestFuzzyQuery] [junit4] 2> at com.carrotsearch.randomizedtesting.RandomizedContext.getRandomness(RandomizedContext.java:92) [junit4] 2> at com.carrotsearch.randomizedtesting.RandomizedContext.getRandom(RandomizedContext.java:114) [junit4] 2> at org.apache.lucene.util.LuceneTestCase.random(LuceneTestCase.java:729) [junit4] 2> at org.apache.lucene.search.TestFuzzyQuery.randomSimpleString(TestFuzzyQuery.java:503) [junit4] 2> at org.apache.lucene.search.TestFuzzyQuery.testRandom(TestFuzzyQuery.java:517) [junit4] 2> at sun.reflect.NativeMethodAccessorImpl.invoke0(Native Method) [junit4] 2> at sun.reflect.NativeMethodAccessorImpl.invoke(NativeMethodAccessorImpl.java:62) [junit4] 2> at sun.reflect.DelegatingMethodAccessorImpl.invoke(DelegatingMethodAccessorImpl.java:43) [junit4] 2> at java.lang.reflect.Method.invoke(Method.java:498) [junit4] 2> at com.carrotsearch.randomizedtesting.RandomizedRunner.invoke(RandomizedRunner.java:1713) [junit4] 2> at com.carrotsearch.randomizedtesting.RandomizedRunner$8.evaluate(RandomizedRunner.java:907) [junit4] 2> at com.carrotsearch.randomizedtesting.RandomizedRunner$9.evaluate(RandomizedRunner.java:943) [junit4] 2> at com.carrotsearch.randomizedtesting.RandomizedRunner$10.evaluate(RandomizedRunner.java:957) [junit4] 2> at org.apache.lucene.util.TestRuleSetupTeardownChained$1.evaluate(TestRuleSetupTeardownChained.java:49) [junit4] 2> at org.apache.lucene.util.AbstractBeforeAfterRule$1.evaluate(AbstractBeforeAfterRule.java:45) [junit4] 2> at org.apache.lucene.util.TestRuleThreadAndTestName$1.evaluate(TestRuleThreadAndTestName.java:48) [junit4] 2> at org.apache.lucene.util.TestRuleIgnoreAfterMaxFailures$1.evaluate(TestRuleIgnoreAfterMaxFailures.java:64) [junit4] 2> at org.apache.lucene.util.TestRuleMarkFailure$1.evaluate(TestRuleMarkFailure.java:47) [junit4] 2> at com.carrotsearch.randomizedtesting.rules.StatementAdapter.evaluate(StatementAdapter.java:36) [junit4] 2> at com.carrotsearch.randomizedtesting.ThreadLeakControl$StatementRunner.run(ThreadLeakControl.java:367) [junit4] 2> at com.carrotsearch.randomizedtesting.ThreadLeakControl.forkTimeoutingTask(ThreadLeakControl.java:811) [junit4] 2> at com.carrotsearch.randomizedtesting.ThreadLeakControl$3.evaluate(ThreadLeakControl.java:462) [junit4] 2> at com.carrotsearch.randomizedtesting.RandomizedRunner.runSingleTest(RandomizedRunner.java:916) [junit4] 2> at com.carrotsearch.randomizedtesting.RandomizedRunner$5.evaluate(RandomizedRunner.java:802) [junit4] 2> at com.carrotsearch.randomizedtesting.RandomizedRunner$6.evaluate(RandomizedRunner.java:852) [junit4] 2> at com.carrotsearch.randomizedtesting.RandomizedRunner$7.evaluate(RandomizedRunner.java:863) [junit4] 2> at org.apache.lucene.util.AbstractBeforeAfterRule$1.evaluate(AbstractBeforeAfterRule.java:45) [junit4] 2> at com.carrotsearch.randomizedtesting.rules.StatementAdapter.evaluate(StatementAdapter.java:36) [junit4] 2> at org.apache.lucene.util.TestRuleStoreClassName$1.evaluate(TestRuleStoreClassName.java:41) [junit4] 2> at com.carrotsearch.randomizedtesting.rules.NoShadowingOrOverridesOnMethodsRule$1.evaluate(NoShadowingOrOverridesOnMethodsRule.java:40) [junit4] 2> at com.carrotsearch.randomizedtesting.rules.NoShadowingOrOverridesOnMethodsRule$1.evaluate(NoShadowingOrOverridesOnMethodsRule.java:40) [junit4] 2> at com.carrotsearch.randomizedtesting.rules.StatementAdapter.evaluate(StatementAdapter.java:36) [junit4] 2> at com.carrotsearch.randomizedtesting.rules.StatementAdapter.evaluate(StatementAdapter.java:36) [junit4] 2> at com.carrotsearch.randomizedtesting.rules.StatementAdapter.evaluate(StatementAdapter.java:36) [junit4] 2> at org.apache.lucene.util.TestRuleAssertionsRequired$1.evaluate(TestRuleAssertionsRequired.java:53) [junit4] 2> at org.apache.lucene.util.TestRuleMarkFailure$1.evaluate(TestRuleMarkFailure.java:47) [junit4] 2> at org.apache.lucene.util.TestRuleIgnoreAfterMaxFailures$1.evaluate(TestRuleIgnoreAfterMaxFailures.java:64) [junit4] 2> at org.apache.lucene.util.TestRuleIgnoreTestSuites$1.evaluate(TestRuleIgnoreTestSuites.java:54) [junit4] 2> at com.carrotsearch.randomizedtesting.rules.StatementAdapter.evaluate(StatementAdapter.java:36) [junit4] 2> at com.carrotsearch.randomizedtesting.ThreadLeakControl$StatementRunner.run(ThreadLeakControl.java:367) [junit4] 2> at java.lang.Thread.run(Thread.java:745) [junit4] 2> Dec 12, 2016 10:21:54 PM com.carrotsearch.randomizedtesting.ThreadLeakControl tryToInterruptAll [junit4] 2> INFO: Starting to interrupt leaked threads: [junit4] 2> 1) Thread[id=5027, name=TEST-TestFuzzyQuery.testRandom-seed#[54B09E7352D7D3C], state=RUNNABLE, group=TGRP-TestFuzzyQuery] [junit4] 2> Dec 12, 2016 10:21:57 PM com.carrotsearch.randomizedtesting.ThreadLeakControl tryToInterruptAll [junit4] 2> SEVERE: There are still zombie threads that couldn't be terminated: [junit4] 2> 1) Thread[id=5027, name=TEST-TestFuzzyQuery.testRandom-seed#[54B09E7352D7D3C], state=RUNNABLE, group=TGRP-TestFuzzyQuery] [junit4] 2> at java.lang.Object.hashCode(Native Method) [junit4] 2> at java.util.WeakHashMap.hash(WeakHashMap.java:298) [junit4] 2> at java.util.WeakHashMap.getEntry(WeakHashMap.java:426) [junit4] 2> at java.util.WeakHashMap.containsKey(WeakHashMap.java:417) [junit4] 2> at com.carrotsearch.randomizedtesting.RandomizedContext.context(RandomizedContext.java:258) [junit4] 2> at com.carrotsearch.randomizedtesting.RandomizedContext.current(RandomizedContext.java:134) [junit4] 2> at org.apache.lucene.util.LuceneTestCase.random(LuceneTestCase.java:729) [junit4] 2> at org.apache.lucene.search.TestFuzzyQuery.randomSimpleString(TestFuzzyQuery.java:506) [junit4] 2> at org.apache.lucene.search.TestFuzzyQuery.testRandom(TestFuzzyQuery.java:517) [junit4] 2> at sun.reflect.NativeMethodAccessorImpl.invoke0(Native Method) [junit4] 2> at sun.reflect.NativeMethodAccessorImpl.invoke(NativeMethodAccessorImpl.java:62) [junit4] 2> at sun.reflect.DelegatingMethodAccessorImpl.invoke(DelegatingMethodAccessorImpl.java:43) [junit4] 2> at java.lang.reflect.Method.invoke(Method.java:498) [junit4] 2> at com.carrotsearch.rando [...truncated too long message...] ultMBeanServerInterceptor.safeGetClassName(DefaultMBeanServerInterceptor.java:1595) [junit4] 2> at com.sun.jmx.interceptor.DefaultMBeanServerInterceptor.checkMBeanPermission(DefaultMBeanServerInterceptor.java:1813) [junit4] 2> at com.sun.jmx.interceptor.DefaultMBeanServerInterceptor.exclusiveUnregisterMBean(DefaultMBeanServerInterceptor.java:430) [junit4] 2> at com.sun.jmx.interceptor.DefaultMBeanServerInterceptor.unregisterMBean(DefaultMBeanServerInterceptor.java:415) [junit4] 2> at com.sun.jmx.mbeanserver.JmxMBeanServer.unregisterMBean(JmxMBeanServer.java:546) [junit4] 2> at org.apache.hadoop.metrics2.util.MBeans.unregister(MBeans.java:81) [junit4] 2> at org.apache.hadoop.metrics2.impl.MetricsSourceAdapter.stopMBeans(MetricsSourceAdapter.java:226) [junit4] 2> at org.apache.hadoop.metrics2.impl.MetricsSourceAdapter.stop(MetricsSourceAdapter.java:211) [junit4] 2> at org.apache.hadoop.metrics2.impl.MetricsSystemImpl.stopSources(MetricsSystemImpl.java:463) [junit4] 2> at org.apache.hadoop.metrics2.impl.MetricsSystemImpl.stop(MetricsSystemImpl.java:213) [junit4] 2> at org.apache.hadoop.metrics2.impl.MetricsSystemImpl.shutdown(MetricsSystemImpl.java:594) [junit4] 2> at org.apache.hadoop.metrics2.lib.DefaultMetricsSystem.shutdownInstance(DefaultMetricsSystem.java:72) [junit4] 2> at org.apache.hadoop.metrics2.lib.DefaultMetricsSystem.shutdown(DefaultMetricsSystem.java:68) [junit4] 2> at org.apache.hadoop.hdfs.server.namenode.metrics.NameNodeMetrics.shutdown(NameNodeMetrics.java:171) [junit4] 2> at org.apache.hadoop.hdfs.server.namenode.NameNode.stop(NameNode.java:872) [junit4] 2> at org.apache.hadoop.hdfs.MiniDFSCluster.shutdown(MiniDFSCluster.java:1726) [junit4] 2> at org.apache.hadoop.hdfs.MiniDFSCluster.shutdown(MiniDFSCluster.java:1705) [junit4] 2> at org.apache.solr.cloud.hdfs.HdfsTestUtil.teardownClass(HdfsTestUtil.java:198) [junit4] 2> at org.apache.solr.cloud.hdfs.HdfsSyncSliceTest.teardownClass(HdfsSyncSliceTest.java:46) [junit4] 2> at sun.reflect.NativeMethodAccessorImpl.invoke0(Native Method) [junit4] 2> at sun.reflect.NativeMethodAccessorImpl.invoke(NativeMethodAccessorImpl.java:62) [junit4] 2> at sun.reflect.DelegatingMethodAccessorImpl.invoke(DelegatingMethodAccessorImpl.java:43) [junit4] 2> at java.lang.reflect.Method.invoke(Method.java:498) [junit4] 2> at com.carrotsearch.randomizedtesting.RandomizedRunner.invoke(RandomizedRunner.java:1713) [junit4] 2> at com.carrotsearch.randomizedtesting.RandomizedRunner$7.evaluate(RandomizedRunner.java:870) [junit4] 2> at com.carrotsearch.randomizedtesting.rules.StatementAdapter.evaluate(StatementAdapter.java:36) [junit4] 2> at com.carrotsearch.randomizedtesting.rules.SystemPropertiesRestoreRule$1.evaluate(SystemPropertiesRestoreRule.java:57) [junit4] 2> at org.apache.lucene.util.AbstractBeforeAfterRule$1.evaluate(AbstractBeforeAfterRule.java:45) [junit4] 2> at com.carrotsearch.randomizedtesting.rules.StatementAdapter.evaluate(StatementAdapter.java:36) [junit4] 2> at org.apache.lucene.util.TestRuleStoreClassName$1.evaluate(TestRuleStoreClassName.java:41) [junit4] 2> at com.carrotsearch.randomizedtesting.rules.NoShadowingOrOverridesOnMethodsRule$1.evaluate(NoShadowingOrOverridesOnMethodsRule.java:40) [junit4] 2> at com.carrotsearch.randomizedtesting.rules.NoShadowingOrOverridesOnMethodsRule$1.evaluate(NoShadowingOrOverridesOnMethodsRule.java:40) [junit4] 2> at com.carrotsearch.randomizedtesting.rules.StatementAdapter.evaluate(StatementAdapter.java:36) [junit4] 2> at com.carrotsearch.randomizedtesting.rules.StatementAdapter.evaluate(StatementAdapter.java:36) [junit4] 2> at com.carrotsearch.randomizedtesting.rules.StatementAdapter.evaluate(StatementAdapter.java:36) [junit4] 2> at org.apache.lucene.util.TestRuleAssertionsRequired$1.evaluate(TestRuleAssertionsRequired.java:53) [junit4] 2> at org.apache.lucene.util.TestRuleMarkFailure$1.evaluate(TestRuleMarkFailure.java:47) [junit4] 2> at org.apache.lucene.util.TestRuleIgnoreAfterMaxFailures$1.evaluate(TestRuleIgnoreAfterMaxFailures.java:64) [junit4] 2> at org.apache.lucene.util.TestRuleIgnoreTestSuites$1.evaluate(TestRuleIgnoreTestSuites.java:54) [junit4] 2> at com.carrotsearch.randomizedtesting.rules.StatementAdapter.evaluate(StatementAdapter.java:36) [junit4] 2> at com.carrotsearch.randomizedtesting.ThreadLeakControl$StatementRunner.run(ThreadLeakControl.java:367) [junit4] 2> at java.lang.Thread.run(Thread.java:745) [junit4] 2> Caused by: java.lang.NullPointerException [junit4] 2> at org.apache.hadoop.hdfs.server.blockmanagement.BlocksMap.size(BlocksMap.java:203) [junit4] 2> at org.apache.hadoop.hdfs.server.blockmanagement.BlockManager.getTotalBlocks(BlockManager.java:3370) [junit4] 2> at org.apache.hadoop.hdfs.server.namenode.FSNamesystem.getBlocksTotal(FSNamesystem.java:5729) [junit4] 2> ... 54 more [junit4] 2> 4984490 INFO (SUITE-HdfsSyncSliceTest-seed#[D4F93519FE4ADBAD]-worker) [ ] o.a.s.SolrTestCaseJ4 ###deleteCore [junit4] 2> NOTE: leaving temporary files on disk at: /x1/jenkins/jenkins-slave/workspace/Lucene-Solr-NightlyTests-6.x/checkout/solr/build/solr-core/test/J1/temp/solr.cloud.hdfs.HdfsSyncSliceTest_D4F93519FE4ADBAD-001 [junit4] 2> Dec 13, 2016 12:52:22 AM com.carrotsearch.randomizedtesting.ThreadLeakControl checkThreadLeaks [junit4] 2> WARNING: Will linger awaiting termination of 34 leaked thread(s). [junit4] 2> NOTE: test params are: codec=Asserting(Lucene62): {}, docValues:{}, maxPointsInLeafNode=406, maxMBSortInHeap=5.280005789508717, sim=RandomSimilarity(queryNorm=false,coord=yes): {}, locale=sr, timezone=MET [junit4] 2> NOTE: Linux 3.13.0-85-generic amd64/Oracle Corporation 1.8.0_102 (64-bit)/cpus=4,threads=2,free=394348320,total=525860864 [junit4] 2> NOTE: All tests run in this JVM: [TestConfigSets, TestAuthenticationFramework, TestSolrIndexConfig, TestExclusionRuleCollectionAccess, TestCharFilters, SpellCheckCollatorTest, DateRangeFieldTest, TermVectorComponentTest, CoreSorterTest, TestSolrCloudWithKerberosAlt, TestExpandComponent, TestSchemaResource, TestSolrXml, TestJettySolrRunner, DistributedFacetPivotLargeTest, TestFieldSortValues, DistribJoinFromCollectionTest, TestUseDocValuesAsStored2, SpellCheckComponentTest, OverseerStatusTest, DocumentBuilderTest, TestSuggestSpellingConverter, TestDynamicLoading, TestDeleteCollectionOnDownNodes, DistributedTermsComponentTest, TestHashPartitioner, SearchHandlerTest, ConfigSetsAPITest, SolrIndexSplitterTest, TestShardHandlerFactory, OverseerCollectionConfigSetProcessorTest, TestSolr4Spatial2, IndexSchemaTest, TestClusterProperties, TestLegacyFieldCache, TestSystemIdResolver, TestQuerySenderListener, TestRequestForwarding, TestSweetSpotSimilarityFactory, DateMathParserTest, WordBreakSolrSpellCheckerTest, TestStressUserVersions, JavabinLoaderTest, SchemaVersionSpecificBehaviorTest, URLClassifyProcessorTest, RecoveryAfterSoftCommitTest, TestCloudPivotFacet, JsonLoaderTest, SampleTest, HdfsDirectoryFactoryTest, TestFieldCacheReopen, ZkSolrClientTest, DirectSolrConnectionTest, ShardRoutingCustomTest, TestRandomRequestDistribution, ChaosMonkeySafeLeaderTest, TestSolrCLIRunExample, TestSolrConfigHandlerCloud, TestWordDelimiterFilterFactory, TestCursorMarkWithoutUniqueKey, SortByFunctionTest, TestPKIAuthenticationPlugin, VersionInfoTest, TestFastOutputStream, TestCollapseQParserPlugin, TestSimpleTrackingShardHandler, ReplicationFactorTest, TestStressLiveNodes, TestStressVersions, CollectionsAPIAsyncDistributedZkTest, TestRTGBase, DeleteNodeTest, DistanceUnitsTest, ZkCLITest, TestTrie, RequestLoggingTest, TestAnalyzeInfixSuggestions, SolrInfoMBeanTest, TestCoreContainer, SolrCLIZkUtilsTest, LoggingHandlerTest, BlobRepositoryCloudTest, TestFieldTypeCollectionResource, SharedFSAutoReplicaFailoverTest, TestIntervalFaceting, CdcrReplicationHandlerTest, SystemInfoHandlerTest, BigEndianAscendingWordDeserializerTest, TestManagedSchemaThreadSafety, TestConfigOverlay, BasicAuthIntegrationTest, TestChildDocTransformer, HdfsBasicDistributedZk2Test, TestUpdate, TestMiniSolrCloudClusterSSL, CursorMarkTest, TestClusterStateMutator, BasicFunctionalityTest, CustomCollectionTest, TestNonDefinedSimilarityFactory, TestXmlQParserPlugin, TestExactSharedStatsCache, TestBM25SimilarityFactory, HdfsChaosMonkeySafeLeaderTest, TestUniqueKeyFieldResource, OpenCloseCoreStressTest, TestDistributedGrouping, JSONWriterTest, CdcrUpdateLogTest, TestRealTimeGet, TestJoin, QueryElevationComponentTest, BadIndexSchemaTest, TestSort, TestFunctionQuery, TestIndexSearcher, HighlighterTest, SoftAutoCommitTest, SuggesterTSTTest, SuggesterTest, SpatialFilterTest, PolyFieldTest, FieldMutatingUpdateProcessorTest, TestAtomicUpdateErrorCases, DefaultValueUpdateProcessorTest, TestRemoteStreaming, DistanceFunctionTest, DebugComponentTest, CacheHeaderTest, IndexBasedSpellCheckerTest, TestSurroundQueryParser, TestQueryUtils, StandardRequestHandlerTest, DirectSolrSpellCheckerTest, TestQueryTypes, FileBasedSpellCheckerTest, TestValueSourceCache, TestIndexingPerformance, MoreLikeThisHandlerTest, IndexSchemaRuntimeFieldTest, RegexBoostProcessorTest, UpdateRequestProcessorFactoryTest, MBeansHandlerTest, TestPartialUpdateDeduplication, CSVRequestHandlerTest, TestBinaryResponseWriter, TestLFUCache, SolrTestCaseJ4Test, TestCrossCoreJoin, TestDistributedMissingSort, TestHighlightDedupGrouping, TestEmbeddedSolrServerConstructors, AliasIntegrationTest, AsyncCallRequestStatusResponseTest, CdcrReplicationDistributedZkTest, TestCloudPseudoReturnFields, TestCloudRecovery, TestLeaderInitiatedRecoveryThread, TestRandomFlRTGCloud, TriLevelCompositeIdRoutingTest, HdfsBasicDistributedZkTest, HdfsSyncSliceTest] [junit4] Completed [518/660 (7!)] on J1 in 48.12s, 1 test, 1 error <<< FAILURES! [...truncated 62827 lines...]