lucene-dev mailing list archives

Site index · List index
Message view « Date » · « Thread »
Top « Date » · « Thread »
From Michael McCandless <luc...@mikemccandless.com>
Subject Re: [JENKINS] Lucene-Solr-master-Windows (64bit/jdk1.8.0_102) - Build # 6263 - Failure!
Date Fri, 02 Dec 2016 22:56:49 GMT
I pushed a fix.

Mike McCandless

http://blog.mikemccandless.com


On Fri, Dec 2, 2016 at 5:50 PM, Policeman Jenkins Server
<jenkins@thetaphi.de> wrote:
> Build: https://jenkins.thetaphi.de/job/Lucene-Solr-master-Windows/6263/
> Java: 64bit/jdk1.8.0_102 -XX:-UseCompressedOops -XX:+UseParallelGC
>
> 1 tests failed.
> FAILED:  org.apache.lucene.index.TestTermsEnum.testIntersectRegexp
>
> Error Message:
> Unexpected exception type, expected IllegalArgumentException
>
> Stack Trace:
> junit.framework.AssertionFailedError: Unexpected exception type, expected IllegalArgumentException
>         at __randomizedtesting.SeedInfo.seed([9F4D013AF40E0332:31B7B038EEC1FDC2]:0)
>         at org.apache.lucene.util.LuceneTestCase.expectThrows(LuceneTestCase.java:2681)
>         at org.apache.lucene.index.TestTermsEnum.testIntersectRegexp(TestTermsEnum.java:1013)
>         at sun.reflect.NativeMethodAccessorImpl.invoke0(Native Method)
>         at sun.reflect.NativeMethodAccessorImpl.invoke(NativeMethodAccessorImpl.java:62)
>         at sun.reflect.DelegatingMethodAccessorImpl.invoke(DelegatingMethodAccessorImpl.java:43)
>         at java.lang.reflect.Method.invoke(Method.java:498)
>         at com.carrotsearch.randomizedtesting.RandomizedRunner.invoke(RandomizedRunner.java:1713)
>         at com.carrotsearch.randomizedtesting.RandomizedRunner$8.evaluate(RandomizedRunner.java:907)
>         at com.carrotsearch.randomizedtesting.RandomizedRunner$9.evaluate(RandomizedRunner.java:943)
>         at com.carrotsearch.randomizedtesting.RandomizedRunner$10.evaluate(RandomizedRunner.java:957)
>         at org.apache.lucene.util.TestRuleSetupTeardownChained$1.evaluate(TestRuleSetupTeardownChained.java:49)
>         at org.apache.lucene.util.AbstractBeforeAfterRule$1.evaluate(AbstractBeforeAfterRule.java:45)
>         at org.apache.lucene.util.TestRuleThreadAndTestName$1.evaluate(TestRuleThreadAndTestName.java:48)
>         at org.apache.lucene.util.TestRuleIgnoreAfterMaxFailures$1.evaluate(TestRuleIgnoreAfterMaxFailures.java:64)
>         at org.apache.lucene.util.TestRuleMarkFailure$1.evaluate(TestRuleMarkFailure.java:47)
>         at com.carrotsearch.randomizedtesting.rules.StatementAdapter.evaluate(StatementAdapter.java:36)
>         at com.carrotsearch.randomizedtesting.ThreadLeakControl$StatementRunner.run(ThreadLeakControl.java:367)
>         at com.carrotsearch.randomizedtesting.ThreadLeakControl.forkTimeoutingTask(ThreadLeakControl.java:811)
>         at com.carrotsearch.randomizedtesting.ThreadLeakControl$3.evaluate(ThreadLeakControl.java:462)
>         at com.carrotsearch.randomizedtesting.RandomizedRunner.runSingleTest(RandomizedRunner.java:916)
>         at com.carrotsearch.randomizedtesting.RandomizedRunner$5.evaluate(RandomizedRunner.java:802)
>         at com.carrotsearch.randomizedtesting.RandomizedRunner$6.evaluate(RandomizedRunner.java:852)
>         at com.carrotsearch.randomizedtesting.RandomizedRunner$7.evaluate(RandomizedRunner.java:863)
>         at org.apache.lucene.util.AbstractBeforeAfterRule$1.evaluate(AbstractBeforeAfterRule.java:45)
>         at com.carrotsearch.randomizedtesting.rules.StatementAdapter.evaluate(StatementAdapter.java:36)
>         at org.apache.lucene.util.TestRuleStoreClassName$1.evaluate(TestRuleStoreClassName.java:41)
>         at com.carrotsearch.randomizedtesting.rules.NoShadowingOrOverridesOnMethodsRule$1.evaluate(NoShadowingOrOverridesOnMethodsRule.java:40)
>         at com.carrotsearch.randomizedtesting.rules.NoShadowingOrOverridesOnMethodsRule$1.evaluate(NoShadowingOrOverridesOnMethodsRule.java:40)
>         at com.carrotsearch.randomizedtesting.rules.StatementAdapter.evaluate(StatementAdapter.java:36)
>         at com.carrotsearch.randomizedtesting.rules.StatementAdapter.evaluate(StatementAdapter.java:36)
>         at com.carrotsearch.randomizedtesting.rules.StatementAdapter.evaluate(StatementAdapter.java:36)
>         at org.apache.lucene.util.TestRuleAssertionsRequired$1.evaluate(TestRuleAssertionsRequired.java:53)
>         at org.apache.lucene.util.TestRuleMarkFailure$1.evaluate(TestRuleMarkFailure.java:47)
>         at org.apache.lucene.util.TestRuleIgnoreAfterMaxFailures$1.evaluate(TestRuleIgnoreAfterMaxFailures.java:64)
>         at org.apache.lucene.util.TestRuleIgnoreTestSuites$1.evaluate(TestRuleIgnoreTestSuites.java:54)
>         at com.carrotsearch.randomizedtesting.rules.StatementAdapter.evaluate(StatementAdapter.java:36)
>         at com.carrotsearch.randomizedtesting.ThreadLeakControl$StatementRunner.run(ThreadLeakControl.java:367)
>         at java.lang.Thread.run(Thread.java:745)
> Caused by: java.lang.NullPointerException
>         at org.apache.lucene.codecs.memory.FSTOrdTermsReader$TermsReader$IntersectTermsEnum.isAccept(FSTOrdTermsReader.java:762)
>         at org.apache.lucene.codecs.memory.FSTOrdTermsReader$TermsReader$IntersectTermsEnum.<init>(FSTOrdTermsReader.java:593)
>         at org.apache.lucene.codecs.memory.FSTOrdTermsReader$TermsReader.intersect(FSTOrdTermsReader.java:273)
>         at org.apache.lucene.index.TestTermsEnum.lambda$testIntersectRegexp$0(TestTermsEnum.java:1013)
>         at org.apache.lucene.util.LuceneTestCase.expectThrows(LuceneTestCase.java:2676)
>         ... 37 more
>
>
>
>
> Build Log:
> [...truncated 884 lines...]
>    [junit4] Suite: org.apache.lucene.index.TestTermsEnum
>    [junit4]   2> NOTE: reproduce with: ant test  -Dtestcase=TestTermsEnum -Dtests.method=testIntersectRegexp
-Dtests.seed=9F4D013AF40E0332 -Dtests.slow=true -Dtests.locale=th -Dtests.timezone=Australia/Darwin
-Dtests.asserts=true -Dtests.file.encoding=US-ASCII
>    [junit4] FAILURE 0.01s J1 | TestTermsEnum.testIntersectRegexp <<<
>    [junit4]    > Throwable #1: junit.framework.AssertionFailedError: Unexpected exception
type, expected IllegalArgumentException
>    [junit4]    >        at __randomizedtesting.SeedInfo.seed([9F4D013AF40E0332:31B7B038EEC1FDC2]:0)
>    [junit4]    >        at org.apache.lucene.util.LuceneTestCase.expectThrows(LuceneTestCase.java:2681)
>    [junit4]    >        at org.apache.lucene.index.TestTermsEnum.testIntersectRegexp(TestTermsEnum.java:1013)
>    [junit4]    >        at java.lang.Thread.run(Thread.java:745)
>    [junit4]    > Caused by: java.lang.NullPointerException
>    [junit4]    >        at org.apache.lucene.codecs.memory.FSTOrdTermsReader$TermsReader$IntersectTermsEnum.isAccept(FSTOrdTermsReader.java:762)
>    [junit4]    >        at org.apache.lucene.codecs.memory.FSTOrdTermsReader$TermsReader$IntersectTermsEnum.<init>(FSTOrdTermsReader.java:593)
>    [junit4]    >        at org.apache.lucene.codecs.memory.FSTOrdTermsReader$TermsReader.intersect(FSTOrdTermsReader.java:273)
>    [junit4]    >        at org.apache.lucene.index.TestTermsEnum.lambda$testIntersectRegexp$0(TestTermsEnum.java:1013)
>    [junit4]    >        at org.apache.lucene.util.LuceneTestCase.expectThrows(LuceneTestCase.java:2676)
>    [junit4]    >        ... 37 more
>    [junit4]   2> NOTE: test params are: codec=Asserting(Lucene70): {date=PostingsFormat(name=MockRandom),
field=PostingsFormat(name=MockRandom), f=PostingsFormat(name=MockRandom), docid=Lucene50(blocksize=128),
titleTokenized=FST50, id=Lucene50(blocksize=128), body=PostingsFormat(name=MockRandom), title=PostingsFormat(name=LuceneVarGapDocFreqInterval),
field2=PostingsFormat(name=MockRandom)}, docValues:{docid_intDV=DocValuesFormat(name=Lucene70),
f=DocValuesFormat(name=Lucene70), id=DocValuesFormat(name=Lucene70), titleDV=DocValuesFormat(name=Lucene70)},
maxPointsInLeafNode=425, maxMBSortInHeap=7.8776683623653705, sim=RandomSimilarity(queryNorm=true):
{field=DFR G2, titleTokenized=IB LL-LZ(0.3), body=DFR G3(800.0), field2=DFR I(ne)B1}, locale=th,
timezone=Australia/Darwin
>    [junit4]   2> NOTE: Windows 10 10.0 amd64/Oracle Corporation 1.8.0_102 (64-bit)/cpus=3,threads=1,free=252273416,total=532152320
>    [junit4]   2> NOTE: All tests run in this JVM: [TestMultiLevelSkipList, TestIndexWriterMaxDocs,
TestMultiCollector, TestTopDocsMerge, TestComplexExplanations, TestIndexWriterExceptions,
TestNotDocIdSet, FiniteStringsIteratorTest, TestIndexWriterConfig, Test2BTerms, TestFieldsReader,
TestRadixSelector, Test2BPoints, TestBooleanQueryVisitSubscorers, TestMatchNoDocsQuery, TestIndexingSequenceNumbers,
TestDirectoryReader, TestSimilarityBase, TestFastCompressionMode, TestMathUtil, TestDateTools,
TestDirectoryReaderReopen, TestParallelCompositeReader, TestClassicSimilarity, TestTermsEnum2,
TestIntroSorter, TestDoc, TestParallelReaderEmptyIndex, Test2BSortedDocValuesOrds, TestSameTokenSamePosition,
TestLucene50StoredFieldsFormat, TestTryDelete, TestPointQueries, TestTerms, TestLucene50TermVectorsFormat,
TestNot, TestStressNRT, TestPersistentSnapshotDeletionPolicy, TestRamUsageEstimator, TestSloppyPhraseQuery2,
TestIntArrayDocIdSet, TestOmitTf, TestLogMergePolicy, TestLongBitSet, TestSpanNotQuery, TestStandardAnalyzer,
TestStressAdvance, TestHighCompressionMode, TestCodecs, TestCompiledAutomaton, TestMaxPosition,
TestFieldValueQuery, TestPerSegmentDeletes, TestSubScorerFreqs, TestBytesRef, TestTransactions,
TestPerFieldDocValuesFormat, TestSynonymQuery, TestCharsRefBuilder, TestIntsRef, TestMinimize,
TestArrayUtil, TestNativeFSLockFactory, TestSearcherManager, TestPostingsOffsets, TestConcurrentMergeScheduler,
TestDuelingCodecsAtNight, TestMultiTermsEnum, TestVirtualMethod, TestNRTThreads, TestMultiThreadTermVectors,
TestCrashCausesCorruptIndex, TestBooleanQuery, TestControlledRealTimeReopenThread, TestFlushByRamOrCountsPolicy,
TestReqExclBulkScorer, TestAllFilesHaveCodecHeader, TestSpanMultiTermQueryWrapper, TestReaderWrapperDVTypeCheck,
TestDirectMonotonic, TestIndexCommit, TestNGramPhraseQuery, TestFrequencyTrackingRingBuffer,
TestMultiTermConstantScore, TestTermsEnum]
>    [junit4] Completed [205/438 (1!)] on J1 in 16.02s, 12 tests, 1 failure <<<
FAILURES!
>
> [...truncated 74269 lines...]
> BUILD FAILED
> C:\Users\jenkins\workspace\Lucene-Solr-master-Windows\build.xml:765: The following error
occurred while executing this line:
> C:\Users\jenkins\workspace\Lucene-Solr-master-Windows\build.xml:645: The following error
occurred while executing this line:
> C:\Users\jenkins\workspace\Lucene-Solr-master-Windows\build.xml:633: Source checkout
is modified!!! Offending files:
> * solr/licenses/commons-fileupload-1.3.2.jar.sha1
>
> Total time: 99 minutes 42 seconds
> Build step 'Invoke Ant' marked build as failure
> Archiving artifacts
> [WARNINGS] Skipping publisher since build result is FAILURE
> Recording test results
> Email was triggered for: Failure - Any
> Sending email for trigger: Failure - Any
>

---------------------------------------------------------------------
To unsubscribe, e-mail: dev-unsubscribe@lucene.apache.org
For additional commands, e-mail: dev-help@lucene.apache.org


Mime
View raw message