lucene-dev mailing list archives

Site index · List index
Message view « Date » · « Thread »
Top « Date » · « Thread »
From Apache Jenkins Server <jenk...@builds.apache.org>
Subject [JENKINS] Lucene-Solr-NightlyTests-6.x - Build # 229 - Still Unstable
Date Fri, 16 Dec 2016 20:27:58 GMT
Build: https://builds.apache.org/job/Lucene-Solr-NightlyTests-6.x/229/

6 tests failed.
FAILED:  org.apache.solr.cloud.ChaosMonkeyNothingIsSafeTest.test

Error Message:
There were too many update fails (911 > 60) - we expect it can happen, but shouldn't easily

Stack Trace:
java.lang.AssertionError: There were too many update fails (911 > 60) - we expect it can happen, but shouldn't easily
	at __randomizedtesting.SeedInfo.seed([564FB800CB832D4C:DE1B87DA657F40B4]:0)
	at org.junit.Assert.fail(Assert.java:93)
	at org.junit.Assert.assertTrue(Assert.java:43)
	at org.junit.Assert.assertFalse(Assert.java:68)
	at org.apache.solr.cloud.ChaosMonkeyNothingIsSafeTest.test(ChaosMonkeyNothingIsSafeTest.java:218)
	at sun.reflect.NativeMethodAccessorImpl.invoke0(Native Method)
	at sun.reflect.NativeMethodAccessorImpl.invoke(NativeMethodAccessorImpl.java:62)
	at sun.reflect.DelegatingMethodAccessorImpl.invoke(DelegatingMethodAccessorImpl.java:43)
	at java.lang.reflect.Method.invoke(Method.java:498)
	at com.carrotsearch.randomizedtesting.RandomizedRunner.invoke(RandomizedRunner.java:1713)
	at com.carrotsearch.randomizedtesting.RandomizedRunner$8.evaluate(RandomizedRunner.java:907)
	at com.carrotsearch.randomizedtesting.RandomizedRunner$9.evaluate(RandomizedRunner.java:943)
	at com.carrotsearch.randomizedtesting.RandomizedRunner$10.evaluate(RandomizedRunner.java:957)
	at org.apache.solr.BaseDistributedSearchTestCase$ShardsRepeatRule$ShardsFixedStatement.callStatement(BaseDistributedSearchTestCase.java:992)
	at org.apache.solr.BaseDistributedSearchTestCase$ShardsRepeatRule$ShardsStatement.evaluate(BaseDistributedSearchTestCase.java:967)
	at com.carrotsearch.randomizedtesting.rules.SystemPropertiesRestoreRule$1.evaluate(SystemPropertiesRestoreRule.java:57)
	at org.apache.lucene.util.TestRuleSetupTeardownChained$1.evaluate(TestRuleSetupTeardownChained.java:49)
	at org.apache.lucene.util.AbstractBeforeAfterRule$1.evaluate(AbstractBeforeAfterRule.java:45)
	at org.apache.lucene.util.TestRuleThreadAndTestName$1.evaluate(TestRuleThreadAndTestName.java:48)
	at org.apache.lucene.util.TestRuleIgnoreAfterMaxFailures$1.evaluate(TestRuleIgnoreAfterMaxFailures.java:64)
	at org.apache.lucene.util.TestRuleMarkFailure$1.evaluate(TestRuleMarkFailure.java:47)
	at com.carrotsearch.randomizedtesting.rules.StatementAdapter.evaluate(StatementAdapter.java:36)
	at com.carrotsearch.randomizedtesting.ThreadLeakControl$StatementRunner.run(ThreadLeakControl.java:367)
	at com.carrotsearch.randomizedtesting.ThreadLeakControl.forkTimeoutingTask(ThreadLeakControl.java:811)
	at com.carrotsearch.randomizedtesting.ThreadLeakControl$3.evaluate(ThreadLeakControl.java:462)
	at com.carrotsearch.randomizedtesting.RandomizedRunner.runSingleTest(RandomizedRunner.java:916)
	at com.carrotsearch.randomizedtesting.RandomizedRunner$5.evaluate(RandomizedRunner.java:802)
	at com.carrotsearch.randomizedtesting.RandomizedRunner$6.evaluate(RandomizedRunner.java:852)
	at com.carrotsearch.randomizedtesting.RandomizedRunner$7.evaluate(RandomizedRunner.java:863)
	at com.carrotsearch.randomizedtesting.rules.StatementAdapter.evaluate(StatementAdapter.java:36)
	at com.carrotsearch.randomizedtesting.rules.SystemPropertiesRestoreRule$1.evaluate(SystemPropertiesRestoreRule.java:57)
	at org.apache.lucene.util.AbstractBeforeAfterRule$1.evaluate(AbstractBeforeAfterRule.java:45)
	at com.carrotsearch.randomizedtesting.rules.StatementAdapter.evaluate(StatementAdapter.java:36)
	at org.apache.lucene.util.TestRuleStoreClassName$1.evaluate(TestRuleStoreClassName.java:41)
	at com.carrotsearch.randomizedtesting.rules.NoShadowingOrOverridesOnMethodsRule$1.evaluate(NoShadowingOrOverridesOnMethodsRule.java:40)
	at com.carrotsearch.randomizedtesting.rules.NoShadowingOrOverridesOnMethodsRule$1.evaluate(NoShadowingOrOverridesOnMethodsRule.java:40)
	at com.carrotsearch.randomizedtesting.rules.StatementAdapter.evaluate(StatementAdapter.java:36)
	at com.carrotsearch.randomizedtesting.rules.StatementAdapter.evaluate(StatementAdapter.java:36)
	at com.carrotsearch.randomizedtesting.rules.StatementAdapter.evaluate(StatementAdapter.java:36)
	at org.apache.lucene.util.TestRuleAssertionsRequired$1.evaluate(TestRuleAssertionsRequired.java:53)
	at org.apache.lucene.util.TestRuleMarkFailure$1.evaluate(TestRuleMarkFailure.java:47)
	at org.apache.lucene.util.TestRuleIgnoreAfterMaxFailures$1.evaluate(TestRuleIgnoreAfterMaxFailures.java:64)
	at org.apache.lucene.util.TestRuleIgnoreTestSuites$1.evaluate(TestRuleIgnoreTestSuites.java:54)
	at com.carrotsearch.randomizedtesting.rules.StatementAdapter.evaluate(StatementAdapter.java:36)
	at com.carrotsearch.randomizedtesting.ThreadLeakControl$StatementRunner.run(ThreadLeakControl.java:367)
	at java.lang.Thread.run(Thread.java:745)


FAILED:  org.apache.solr.cloud.hdfs.StressHdfsTest.test

Error Message:
Could not find collection:delete_data_dir

Stack Trace:
java.lang.AssertionError: Could not find collection:delete_data_dir
	at __randomizedtesting.SeedInfo.seed([564FB800CB832D4C:DE1B87DA657F40B4]:0)
	at org.junit.Assert.fail(Assert.java:93)
	at org.junit.Assert.assertTrue(Assert.java:43)
	at org.junit.Assert.assertNotNull(Assert.java:526)
	at org.apache.solr.cloud.AbstractDistribZkTestBase.waitForRecoveriesToFinish(AbstractDistribZkTestBase.java:156)
	at org.apache.solr.cloud.AbstractDistribZkTestBase.waitForRecoveriesToFinish(AbstractDistribZkTestBase.java:141)
	at org.apache.solr.cloud.AbstractDistribZkTestBase.waitForRecoveriesToFinish(AbstractDistribZkTestBase.java:136)
	at org.apache.solr.cloud.AbstractFullDistribZkTestBase.waitForRecoveriesToFinish(AbstractFullDistribZkTestBase.java:856)
	at org.apache.solr.cloud.hdfs.StressHdfsTest.createAndDeleteCollection(StressHdfsTest.java:159)
	at org.apache.solr.cloud.hdfs.StressHdfsTest.test(StressHdfsTest.java:103)
	at sun.reflect.NativeMethodAccessorImpl.invoke0(Native Method)
	at sun.reflect.NativeMethodAccessorImpl.invoke(NativeMethodAccessorImpl.java:62)
	at sun.reflect.DelegatingMethodAccessorImpl.invoke(DelegatingMethodAccessorImpl.java:43)
	at java.lang.reflect.Method.invoke(Method.java:498)
	at com.carrotsearch.randomizedtesting.RandomizedRunner.invoke(RandomizedRunner.java:1713)
	at com.carrotsearch.randomizedtesting.RandomizedRunner$8.evaluate(RandomizedRunner.java:907)
	at com.carrotsearch.randomizedtesting.RandomizedRunner$9.evaluate(RandomizedRunner.java:943)
	at com.carrotsearch.randomizedtesting.RandomizedRunner$10.evaluate(RandomizedRunner.java:957)
	at org.apache.solr.BaseDistributedSearchTestCase$ShardsRepeatRule$ShardsFixedStatement.callStatement(BaseDistributedSearchTestCase.java:992)
	at org.apache.solr.BaseDistributedSearchTestCase$ShardsRepeatRule$ShardsStatement.evaluate(BaseDistributedSearchTestCase.java:967)
	at com.carrotsearch.randomizedtesting.rules.SystemPropertiesRestoreRule$1.evaluate(SystemPropertiesRestoreRule.java:57)
	at org.apache.lucene.util.TestRuleSetupTeardownChained$1.evaluate(TestRuleSetupTeardownChained.java:49)
	at org.apache.lucene.util.AbstractBeforeAfterRule$1.evaluate(AbstractBeforeAfterRule.java:45)
	at org.apache.lucene.util.TestRuleThreadAndTestName$1.evaluate(TestRuleThreadAndTestName.java:48)
	at org.apache.lucene.util.TestRuleIgnoreAfterMaxFailures$1.evaluate(TestRuleIgnoreAfterMaxFailures.java:64)
	at org.apache.lucene.util.TestRuleMarkFailure$1.evaluate(TestRuleMarkFailure.java:47)
	at com.carrotsearch.randomizedtesting.rules.StatementAdapter.evaluate(StatementAdapter.java:36)
	at com.carrotsearch.randomizedtesting.ThreadLeakControl$StatementRunner.run(ThreadLeakControl.java:367)
	at com.carrotsearch.randomizedtesting.ThreadLeakControl.forkTimeoutingTask(ThreadLeakControl.java:811)
	at com.carrotsearch.randomizedtesting.ThreadLeakControl$3.evaluate(ThreadLeakControl.java:462)
	at com.carrotsearch.randomizedtesting.RandomizedRunner.runSingleTest(RandomizedRunner.java:916)
	at com.carrotsearch.randomizedtesting.RandomizedRunner$5.evaluate(RandomizedRunner.java:802)
	at com.carrotsearch.randomizedtesting.RandomizedRunner$6.evaluate(RandomizedRunner.java:852)
	at com.carrotsearch.randomizedtesting.RandomizedRunner$7.evaluate(RandomizedRunner.java:863)
	at com.carrotsearch.randomizedtesting.rules.StatementAdapter.evaluate(StatementAdapter.java:36)
	at com.carrotsearch.randomizedtesting.rules.SystemPropertiesRestoreRule$1.evaluate(SystemPropertiesRestoreRule.java:57)
	at org.apache.lucene.util.AbstractBeforeAfterRule$1.evaluate(AbstractBeforeAfterRule.java:45)
	at com.carrotsearch.randomizedtesting.rules.StatementAdapter.evaluate(StatementAdapter.java:36)
	at org.apache.lucene.util.TestRuleStoreClassName$1.evaluate(TestRuleStoreClassName.java:41)
	at com.carrotsearch.randomizedtesting.rules.NoShadowingOrOverridesOnMethodsRule$1.evaluate(NoShadowingOrOverridesOnMethodsRule.java:40)
	at com.carrotsearch.randomizedtesting.rules.NoShadowingOrOverridesOnMethodsRule$1.evaluate(NoShadowingOrOverridesOnMethodsRule.java:40)
	at com.carrotsearch.randomizedtesting.rules.StatementAdapter.evaluate(StatementAdapter.java:36)
	at com.carrotsearch.randomizedtesting.rules.StatementAdapter.evaluate(StatementAdapter.java:36)
	at com.carrotsearch.randomizedtesting.rules.StatementAdapter.evaluate(StatementAdapter.java:36)
	at org.apache.lucene.util.TestRuleAssertionsRequired$1.evaluate(TestRuleAssertionsRequired.java:53)
	at org.apache.lucene.util.TestRuleMarkFailure$1.evaluate(TestRuleMarkFailure.java:47)
	at org.apache.lucene.util.TestRuleIgnoreAfterMaxFailures$1.evaluate(TestRuleIgnoreAfterMaxFailures.java:64)
	at org.apache.lucene.util.TestRuleIgnoreTestSuites$1.evaluate(TestRuleIgnoreTestSuites.java:54)
	at com.carrotsearch.randomizedtesting.rules.StatementAdapter.evaluate(StatementAdapter.java:36)
	at com.carrotsearch.randomizedtesting.ThreadLeakControl$StatementRunner.run(ThreadLeakControl.java:367)
	at java.lang.Thread.run(Thread.java:745)


FAILED:  org.apache.solr.core.HdfsDirectoryFactoryTest.testInitArgsOrSysPropConfig

Error Message:
The max direct memory is likely too low.  Either increase it (by adding -XX:MaxDirectMemorySize=<size>g -XX:+UseLargePages to your containers startup args) or disable direct allocation using solr.hdfs.blockcache.direct.memory.allocation=false in solrconfig.xml. If you are putting the block cache on the heap, your java heap size might not be large enough. Failed allocating ~134.217728 MB.

Stack Trace:
java.lang.RuntimeException: The max direct memory is likely too low.  Either increase it (by adding -XX:MaxDirectMemorySize=<size>g -XX:+UseLargePages to your containers startup args) or disable direct allocation using solr.hdfs.blockcache.direct.memory.allocation=false in solrconfig.xml. If you are putting the block cache on the heap, your java heap size might not be large enough. Failed allocating ~134.217728 MB.
	at __randomizedtesting.SeedInfo.seed([564FB800CB832D4C:A1E0712B360AC767]:0)
	at org.apache.solr.core.HdfsDirectoryFactory.createBlockCache(HdfsDirectoryFactory.java:304)
	at org.apache.solr.core.HdfsDirectoryFactory.getBlockDirectoryCache(HdfsDirectoryFactory.java:286)
	at org.apache.solr.core.HdfsDirectoryFactory.create(HdfsDirectoryFactory.java:220)
	at org.apache.solr.core.HdfsDirectoryFactoryTest.testInitArgsOrSysPropConfig(HdfsDirectoryFactoryTest.java:108)
	at sun.reflect.NativeMethodAccessorImpl.invoke0(Native Method)
	at sun.reflect.NativeMethodAccessorImpl.invoke(NativeMethodAccessorImpl.java:62)
	at sun.reflect.DelegatingMethodAccessorImpl.invoke(DelegatingMethodAccessorImpl.java:43)
	at java.lang.reflect.Method.invoke(Method.java:498)
	at com.carrotsearch.randomizedtesting.RandomizedRunner.invoke(RandomizedRunner.java:1713)
	at com.carrotsearch.randomizedtesting.RandomizedRunner$8.evaluate(RandomizedRunner.java:907)
	at com.carrotsearch.randomizedtesting.RandomizedRunner$9.evaluate(RandomizedRunner.java:943)
	at com.carrotsearch.randomizedtesting.RandomizedRunner$10.evaluate(RandomizedRunner.java:957)
	at com.carrotsearch.randomizedtesting.rules.SystemPropertiesRestoreRule$1.evaluate(SystemPropertiesRestoreRule.java:57)
	at org.apache.lucene.util.TestRuleSetupTeardownChained$1.evaluate(TestRuleSetupTeardownChained.java:49)
	at org.apache.lucene.util.AbstractBeforeAfterRule$1.evaluate(AbstractBeforeAfterRule.java:45)
	at org.apache.lucene.util.TestRuleThreadAndTestName$1.evaluate(TestRuleThreadAndTestName.java:48)
	at org.apache.lucene.util.TestRuleIgnoreAfterMaxFailures$1.evaluate(TestRuleIgnoreAfterMaxFailures.java:64)
	at org.apache.lucene.util.TestRuleMarkFailure$1.evaluate(TestRuleMarkFailure.java:47)
	at com.carrotsearch.randomizedtesting.rules.StatementAdapter.evaluate(StatementAdapter.java:36)
	at com.carrotsearch.randomizedtesting.ThreadLeakControl$StatementRunner.run(ThreadLeakControl.java:367)
	at com.carrotsearch.randomizedtesting.ThreadLeakControl.forkTimeoutingTask(ThreadLeakControl.java:811)
	at com.carrotsearch.randomizedtesting.ThreadLeakControl$3.evaluate(ThreadLeakControl.java:462)
	at com.carrotsearch.randomizedtesting.RandomizedRunner.runSingleTest(RandomizedRunner.java:916)
	at com.carrotsearch.randomizedtesting.RandomizedRunner$5.evaluate(RandomizedRunner.java:802)
	at com.carrotsearch.randomizedtesting.RandomizedRunner$6.evaluate(RandomizedRunner.java:852)
	at com.carrotsearch.randomizedtesting.RandomizedRunner$7.evaluate(RandomizedRunner.java:863)
	at com.carrotsearch.randomizedtesting.rules.StatementAdapter.evaluate(StatementAdapter.java:36)
	at com.carrotsearch.randomizedtesting.rules.SystemPropertiesRestoreRule$1.evaluate(SystemPropertiesRestoreRule.java:57)
	at org.apache.lucene.util.AbstractBeforeAfterRule$1.evaluate(AbstractBeforeAfterRule.java:45)
	at com.carrotsearch.randomizedtesting.rules.StatementAdapter.evaluate(StatementAdapter.java:36)
	at org.apache.lucene.util.TestRuleStoreClassName$1.evaluate(TestRuleStoreClassName.java:41)
	at com.carrotsearch.randomizedtesting.rules.NoShadowingOrOverridesOnMethodsRule$1.evaluate(NoShadowingOrOverridesOnMethodsRule.java:40)
	at com.carrotsearch.randomizedtesting.rules.NoShadowingOrOverridesOnMethodsRule$1.evaluate(NoShadowingOrOverridesOnMethodsRule.java:40)
	at com.carrotsearch.randomizedtesting.rules.StatementAdapter.evaluate(StatementAdapter.java:36)
	at com.carrotsearch.randomizedtesting.rules.StatementAdapter.evaluate(StatementAdapter.java:36)
	at com.carrotsearch.randomizedtesting.rules.StatementAdapter.evaluate(StatementAdapter.java:36)
	at org.apache.lucene.util.TestRuleAssertionsRequired$1.evaluate(TestRuleAssertionsRequired.java:53)
	at org.apache.lucene.util.TestRuleMarkFailure$1.evaluate(TestRuleMarkFailure.java:47)
	at org.apache.lucene.util.TestRuleIgnoreAfterMaxFailures$1.evaluate(TestRuleIgnoreAfterMaxFailures.java:64)
	at org.apache.lucene.util.TestRuleIgnoreTestSuites$1.evaluate(TestRuleIgnoreTestSuites.java:54)
	at com.carrotsearch.randomizedtesting.rules.StatementAdapter.evaluate(StatementAdapter.java:36)
	at com.carrotsearch.randomizedtesting.ThreadLeakControl$StatementRunner.run(ThreadLeakControl.java:367)
	at java.lang.Thread.run(Thread.java:745)
Caused by: java.lang.OutOfMemoryError: Direct buffer memory
	at java.nio.Bits.reserveMemory(Bits.java:693)
	at java.nio.DirectByteBuffer.<init>(DirectByteBuffer.java:123)
	at java.nio.ByteBuffer.allocateDirect(ByteBuffer.java:311)
	at org.apache.solr.store.blockcache.BlockCache.<init>(BlockCache.java:68)
	at org.apache.solr.core.HdfsDirectoryFactory.createBlockCache(HdfsDirectoryFactory.java:302)
	... 42 more


FAILED:  org.apache.solr.handler.TestReplicationHandler.doTestStressReplication

Error Message:
[index.20161216191651467, replication.properties, index.properties, index.20161216191706772, snapshot_metadata] expected:<1> but was:<2>

Stack Trace:
java.lang.AssertionError: [index.20161216191651467, replication.properties, index.properties, index.20161216191706772, snapshot_metadata] expected:<1> but was:<2>
	at __randomizedtesting.SeedInfo.seed([564FB800CB832D4C:8DE4B8C6CEAB44FF]:0)
	at org.junit.Assert.fail(Assert.java:93)
	at org.junit.Assert.failNotEquals(Assert.java:647)
	at org.junit.Assert.assertEquals(Assert.java:128)
	at org.junit.Assert.assertEquals(Assert.java:472)
	at org.apache.solr.handler.TestReplicationHandler.checkForSingleIndex(TestReplicationHandler.java:909)
	at org.apache.solr.handler.TestReplicationHandler.doTestStressReplication(TestReplicationHandler.java:876)
	at sun.reflect.NativeMethodAccessorImpl.invoke0(Native Method)
	at sun.reflect.NativeMethodAccessorImpl.invoke(NativeMethodAccessorImpl.java:62)
	at sun.reflect.DelegatingMethodAccessorImpl.invoke(DelegatingMethodAccessorImpl.java:43)
	at java.lang.reflect.Method.invoke(Method.java:498)
	at com.carrotsearch.randomizedtesting.RandomizedRunner.invoke(RandomizedRunner.java:1713)
	at com.carrotsearch.randomizedtesting.RandomizedRunner$8.evaluate(RandomizedRunner.java:907)
	at com.carrotsearch.randomizedtesting.RandomizedRunner$9.evaluate(RandomizedRunner.java:943)
	at com.carrotsearch.randomizedtesting.RandomizedRunner$10.evaluate(RandomizedRunner.java:957)
	at com.carrotsearch.randomizedtesting.rules.SystemPropertiesRestoreRule$1.evaluate(SystemPropertiesRestoreRule.java:57)
	at org.apache.lucene.util.TestRuleSetupTeardownChained$1.evaluate(TestRuleSetupTeardownChained.java:49)
	at org.apache.lucene.util.AbstractBeforeAfterRule$1.evaluate(AbstractBeforeAfterRule.java:45)
	at org.apache.lucene.util.TestRuleThreadAndTestName$1.evaluate(TestRuleThreadAndTestName.java:48)
	at org.apache.lucene.util.TestRuleIgnoreAfterMaxFailures$1.evaluate(TestRuleIgnoreAfterMaxFailures.java:64)
	at org.apache.lucene.util.TestRuleMarkFailure$1.evaluate(TestRuleMarkFailure.java:47)
	at com.carrotsearch.randomizedtesting.rules.StatementAdapter.evaluate(StatementAdapter.java:36)
	at com.carrotsearch.randomizedtesting.ThreadLeakControl$StatementRunner.run(ThreadLeakControl.java:367)
	at com.carrotsearch.randomizedtesting.ThreadLeakControl.forkTimeoutingTask(ThreadLeakControl.java:811)
	at com.carrotsearch.randomizedtesting.ThreadLeakControl$3.evaluate(ThreadLeakControl.java:462)
	at com.carrotsearch.randomizedtesting.RandomizedRunner.runSingleTest(RandomizedRunner.java:916)
	at com.carrotsearch.randomizedtesting.RandomizedRunner$5.evaluate(RandomizedRunner.java:802)
	at com.carrotsearch.randomizedtesting.RandomizedRunner$6.evaluate(RandomizedRunner.java:852)
	at com.carrotsearch.randomizedtesting.RandomizedRunner$7.evaluate(RandomizedRunner.java:863)
	at com.carrotsearch.randomizedtesting.rules.StatementAdapter.evaluate(StatementAdapter.java:36)
	at com.carrotsearch.randomizedtesting.rules.SystemPropertiesRestoreRule$1.evaluate(SystemPropertiesRestoreRule.java:57)
	at org.apache.lucene.util.AbstractBeforeAfterRule$1.evaluate(AbstractBeforeAfterRule.java:45)
	at com.carrotsearch.randomizedtesting.rules.StatementAdapter.evaluate(StatementAdapter.java:36)
	at org.apache.lucene.util.TestRuleStoreClassName$1.evaluate(TestRuleStoreClassName.java:41)
	at com.carrotsearch.randomizedtesting.rules.NoShadowingOrOverridesOnMethodsRule$1.evaluate(NoShadowingOrOverridesOnMethodsRule.java:40)
	at com.carrotsearch.randomizedtesting.rules.NoShadowingOrOverridesOnMethodsRule$1.evaluate(NoShadowingOrOverridesOnMethodsRule.java:40)
	at com.carrotsearch.randomizedtesting.rules.StatementAdapter.evaluate(StatementAdapter.java:36)
	at com.carrotsearch.randomizedtesting.rules.StatementAdapter.evaluate(StatementAdapter.java:36)
	at com.carrotsearch.randomizedtesting.rules.StatementAdapter.evaluate(StatementAdapter.java:36)
	at org.apache.lucene.util.TestRuleAssertionsRequired$1.evaluate(TestRuleAssertionsRequired.java:53)
	at org.apache.lucene.util.TestRuleMarkFailure$1.evaluate(TestRuleMarkFailure.java:47)
	at org.apache.lucene.util.TestRuleIgnoreAfterMaxFailures$1.evaluate(TestRuleIgnoreAfterMaxFailures.java:64)
	at org.apache.lucene.util.TestRuleIgnoreTestSuites$1.evaluate(TestRuleIgnoreTestSuites.java:54)
	at com.carrotsearch.randomizedtesting.rules.StatementAdapter.evaluate(StatementAdapter.java:36)
	at com.carrotsearch.randomizedtesting.ThreadLeakControl$StatementRunner.run(ThreadLeakControl.java:367)
	at java.lang.Thread.run(Thread.java:745)


FAILED:  org.apache.solr.cloud.hdfs.HdfsCollectionsAPIDistributedZkTest.testCollectionsAPI

Error Message:
Expected to see collection awhollynewcollection_0 null Last available state: DocCollection(awhollynewcollection_0//collections/awhollynewcollection_0/state.json/2)={   "replicationFactor":"4",   "shards":{"shard1":{       "range":"80000000-7fffffff",       "state":"active",       "replicas":{}}},   "router":{"name":"compositeId"},   "maxShardsPerNode":"2",   "autoAddReplicas":"false"}

Stack Trace:
java.lang.AssertionError: Expected to see collection awhollynewcollection_0
null
Last available state: DocCollection(awhollynewcollection_0//collections/awhollynewcollection_0/state.json/2)={
  "replicationFactor":"4",
  "shards":{"shard1":{
      "range":"80000000-7fffffff",
      "state":"active",
      "replicas":{}}},
  "router":{"name":"compositeId"},
  "maxShardsPerNode":"2",
  "autoAddReplicas":"false"}
	at __randomizedtesting.SeedInfo.seed([564FB800CB832D4C:1E3ACCB4CDB002D9]:0)
	at org.junit.Assert.fail(Assert.java:93)
	at org.apache.solr.cloud.SolrCloudTestCase.waitForState(SolrCloudTestCase.java:237)
	at org.apache.solr.cloud.CollectionsAPIDistributedZkTest.testCollectionsAPI(CollectionsAPIDistributedZkTest.java:496)
	at sun.reflect.NativeMethodAccessorImpl.invoke0(Native Method)
	at sun.reflect.NativeMethodAccessorImpl.invoke(NativeMethodAccessorImpl.java:62)
	at sun.reflect.DelegatingMethodAccessorImpl.invoke(DelegatingMethodAccessorImpl.java:43)
	at java.lang.reflect.Method.invoke(Method.java:498)
	at com.carrotsearch.randomizedtesting.RandomizedRunner.invoke(RandomizedRunner.java:1713)
	at com.carrotsearch.randomizedtesting.RandomizedRunner$8.evaluate(RandomizedRunner.java:907)
	at com.carrotsearch.randomizedtesting.RandomizedRunner$9.evaluate(RandomizedRunner.java:943)
	at com.carrotsearch.randomizedtesting.RandomizedRunner$10.evaluate(RandomizedRunner.java:957)
	at com.carrotsearch.randomizedtesting.rules.SystemPropertiesRestoreRule$1.evaluate(SystemPropertiesRestoreRule.java:57)
	at org.apache.lucene.util.TestRuleSetupTeardownChained$1.evaluate(TestRuleSetupTeardownChained.java:49)
	at org.apache.lucene.util.AbstractBeforeAfterRule$1.evaluate(AbstractBeforeAfterRule.java:45)
	at org.apache.lucene.util.TestRuleThreadAndTestName$1.evaluate(TestRuleThreadAndTestName.java:48)
	at org.apache.lucene.util.TestRuleIgnoreAfterMaxFailures$1.evaluate(TestRuleIgnoreAfterMaxFailures.java:64)
	at org.apache.lucene.util.TestRuleMarkFailure$1.evaluate(TestRuleMarkFailure.java:47)
	at com.carrotsearch.randomizedtesting.rules.StatementAdapter.evaluate(StatementAdapter.java:36)
	at com.carrotsearch.randomizedtesting.ThreadLeakControl$StatementRunner.run(ThreadLeakControl.java:367)
	at com.carrotsearch.randomizedtesting.ThreadLeakControl.forkTimeoutingTask(ThreadLeakControl.java:811)
	at com.carrotsearch.randomizedtesting.ThreadLeakControl$3.evaluate(ThreadLeakControl.java:462)
	at com.carrotsearch.randomizedtesting.RandomizedRunner.runSingleTest(RandomizedRunner.java:916)
	at com.carrotsearch.randomizedtesting.RandomizedRunner$5.evaluate(RandomizedRunner.java:802)
	at com.carrotsearch.randomizedtesting.RandomizedRunner$6.evaluate(RandomizedRunner.java:852)
	at com.carrotsearch.randomizedtesting.RandomizedRunner$7.evaluate(RandomizedRunner.java:863)
	at com.carrotsearch.randomizedtesting.rules.StatementAdapter.evaluate(StatementAdapter.java:36)
	at com.carrotsearch.randomizedtesting.rules.SystemPropertiesRestoreRule$1.evaluate(SystemPropertiesRestoreRule.java:57)
	at org.apache.lucene.util.AbstractBeforeAfterRule$1.evaluate(AbstractBeforeAfterRule.java:45)
	at com.carrotsearch.randomizedtesting.rules.StatementAdapter.evaluate(StatementAdapter.java:36)
	at org.apache.lucene.util.TestRuleStoreClassName$1.evaluate(TestRuleStoreClassName.java:41)
	at com.carrotsearch.randomizedtesting.rules.NoShadowingOrOverridesOnMethodsRule$1.evaluate(NoShadowingOrOverridesOnMethodsRule.java:40)
	at com.carrotsearch.randomizedtesting.rules.NoShadowingOrOverridesOnMethodsRule$1.evaluate(NoShadowingOrOverridesOnMethodsRule.java:40)
	at com.carrotsearch.randomizedtesting.rules.StatementAdapter.evaluate(StatementAdapter.java:36)
	at com.carrotsearch.randomizedtesting.rules.StatementAdapter.evaluate(StatementAdapter.java:36)
	at com.carrotsearch.randomizedtesting.rules.StatementAdapter.evaluate(StatementAdapter.java:36)
	at org.apache.lucene.util.TestRuleAssertionsRequired$1.evaluate(TestRuleAssertionsRequired.java:53)
	at org.apache.lucene.util.TestRuleMarkFailure$1.evaluate(TestRuleMarkFailure.java:47)
	at org.apache.lucene.util.TestRuleIgnoreAfterMaxFailures$1.evaluate(TestRuleIgnoreAfterMaxFailures.java:64)
	at org.apache.lucene.util.TestRuleIgnoreTestSuites$1.evaluate(TestRuleIgnoreTestSuites.java:54)
	at com.carrotsearch.randomizedtesting.rules.StatementAdapter.evaluate(StatementAdapter.java:36)
	at com.carrotsearch.randomizedtesting.ThreadLeakControl$StatementRunner.run(ThreadLeakControl.java:367)
	at java.lang.Thread.run(Thread.java:745)


FAILED:  org.apache.solr.cloud.hdfs.HdfsCollectionsAPIDistributedZkTest.testSpecificConfigsets

Error Message:
KeeperErrorCode = NoNode for /collections/withconfigset2

Stack Trace:
org.apache.zookeeper.KeeperException$NoNodeException: KeeperErrorCode = NoNode for /collections/withconfigset2
	at __randomizedtesting.SeedInfo.seed([564FB800CB832D4C:7B31F75A3CA79740]:0)
	at org.apache.zookeeper.KeeperException.create(KeeperException.java:111)
	at org.apache.zookeeper.KeeperException.create(KeeperException.java:51)
	at org.apache.zookeeper.ZooKeeper.getData(ZooKeeper.java:1155)
	at org.apache.solr.common.cloud.SolrZkClient$7.execute(SolrZkClient.java:356)
	at org.apache.solr.common.cloud.SolrZkClient$7.execute(SolrZkClient.java:353)
	at org.apache.solr.common.cloud.ZkCmdExecutor.retryOperation(ZkCmdExecutor.java:60)
	at org.apache.solr.common.cloud.SolrZkClient.getData(SolrZkClient.java:353)
	at org.apache.solr.cloud.CollectionsAPIDistributedZkTest.testSpecificConfigsets(CollectionsAPIDistributedZkTest.java:425)
	at sun.reflect.NativeMethodAccessorImpl.invoke0(Native Method)
	at sun.reflect.NativeMethodAccessorImpl.invoke(NativeMethodAccessorImpl.java:62)
	at sun.reflect.DelegatingMethodAccessorImpl.invoke(DelegatingMethodAccessorImpl.java:43)
	at java.lang.reflect.Method.invoke(Method.java:498)
	at com.carrotsearch.randomizedtesting.RandomizedRunner.invoke(RandomizedRunner.java:1713)
	at com.carrotsearch.randomizedtesting.RandomizedRunner$8.evaluate(RandomizedRunner.java:907)
	at com.carrotsearch.randomizedtesting.RandomizedRunner$9.evaluate(RandomizedRunner.java:943)
	at com.carrotsearch.randomizedtesting.RandomizedRunner$10.evaluate(RandomizedRunner.java:957)
	at com.carrotsearch.randomizedtesting.rules.SystemPropertiesRestoreRule$1.evaluate(SystemPropertiesRestoreRule.java:57)
	at org.apache.lucene.util.TestRuleSetupTeardownChained$1.evaluate(TestRuleSetupTeardownChained.java:49)
	at org.apache.lucene.util.AbstractBeforeAfterRule$1.evaluate(AbstractBeforeAfterRule.java:45)
	at org.apache.lucene.util.TestRuleThreadAndTestName$1.evaluate(TestRuleThreadAndTestName.java:48)
	at org.apache.lucene.util.TestRuleIgnoreAfterMaxFailures$1.evaluate(TestRuleIgnoreAfterMaxFailures.java:64)
	at org.apache.lucene.util.TestRuleMarkFailure$1.evaluate(TestRuleMarkFailure.java:47)
	at com.carrotsearch.randomizedtesting.rules.StatementAdapter.evaluate(StatementAdapter.java:36)
	at com.carrotsearch.randomizedtesting.ThreadLeakControl$StatementRunner.run(ThreadLeakControl.java:367)
	at com.carrotsearch.randomizedtesting.ThreadLeakControl.forkTimeoutingTask(ThreadLeakControl.java:811)
	at com.carrotsearch.randomizedtesting.ThreadLeakControl$3.evaluate(ThreadLeakControl.java:462)
	at com.carrotsearch.randomizedtesting.RandomizedRunner.runSingleTest(RandomizedRunner.java:916)
	at com.carrotsearch.randomizedtesting.RandomizedRunner$5.evaluate(RandomizedRunner.java:802)
	at com.carrotsearch.randomizedtesting.RandomizedRunner$6.evaluate(RandomizedRunner.java:852)
	at com.carrotsearch.randomizedtesting.RandomizedRunner$7.evaluate(RandomizedRunner.java:863)
	at com.carrotsearch.randomizedtesting.rules.StatementAdapter.evaluate(StatementAdapter.java:36)
	at com.carrotsearch.randomizedtesting.rules.SystemPropertiesRestoreRule$1.evaluate(SystemPropertiesRestoreRule.java:57)
	at org.apache.lucene.util.AbstractBeforeAfterRule$1.evaluate(AbstractBeforeAfterRule.java:45)
	at com.carrotsearch.randomizedtesting.rules.StatementAdapter.evaluate(StatementAdapter.java:36)
	at org.apache.lucene.util.TestRuleStoreClassName$1.evaluate(TestRuleStoreClassName.java:41)
	at com.carrotsearch.randomizedtesting.rules.NoShadowingOrOverridesOnMethodsRule$1.evaluate(NoShadowingOrOverridesOnMethodsRule.java:40)
	at com.carrotsearch.randomizedtesting.rules.NoShadowingOrOverridesOnMethodsRule$1.evaluate(NoShadowingOrOverridesOnMethodsRule.java:40)
	at com.carrotsearch.randomizedtesting.rules.StatementAdapter.evaluate(StatementAdapter.java:36)
	at com.carrotsearch.randomizedtesting.rules.StatementAdapter.evaluate(StatementAdapter.java:36)
	at com.carrotsearch.randomizedtesting.rules.StatementAdapter.evaluate(StatementAdapter.java:36)
	at org.apache.lucene.util.TestRuleAssertionsRequired$1.evaluate(TestRuleAssertionsRequired.java:53)
	at org.apache.lucene.util.TestRuleMarkFailure$1.evaluate(TestRuleMarkFailure.java:47)
	at org.apache.lucene.util.TestRuleIgnoreAfterMaxFailures$1.evaluate(TestRuleIgnoreAfterMaxFailures.java:64)
	at org.apache.lucene.util.TestRuleIgnoreTestSuites$1.evaluate(TestRuleIgnoreTestSuites.java:54)
	at com.carrotsearch.randomizedtesting.rules.StatementAdapter.evaluate(StatementAdapter.java:36)
	at com.carrotsearch.randomizedtesting.ThreadLeakControl$StatementRunner.run(ThreadLeakControl.java:367)
	at java.lang.Thread.run(Thread.java:745)




Build Log:
[...truncated 12630 lines...]
   [junit4] Suite: org.apache.solr.handler.TestReplicationHandler
   [junit4]   2> Creating dataDir: /x1/jenkins/jenkins-slave/workspace/Lucene-Solr-NightlyTests-6.x/checkout/solr/build/solr-core/test/J1/temp/solr.handler.TestReplicationHandler_564FB800CB832D4C-001/init-core-data-001
   [junit4]   2> 2154304 INFO  (SUITE-TestReplicationHandler-seed#[564FB800CB832D4C]-worker) [    ] o.a.s.SolrTestCaseJ4 Randomized ssl (false) and clientAuth (false) via: @org.apache.solr.SolrTestCaseJ4$SuppressSSL(bugUrl=None)
   [junit4]   2> 2154306 INFO  (TEST-TestReplicationHandler.doTestRepeater-seed#[564FB800CB832D4C]) [    ] o.a.s.SolrTestCaseJ4 ###Starting doTestRepeater
   [junit4]   2> 2154306 INFO  (TEST-TestReplicationHandler.doTestRepeater-seed#[564FB800CB832D4C]) [    ] o.a.s.SolrTestCaseJ4 Writing core.properties file to /x1/jenkins/jenkins-slave/workspace/Lucene-Solr-NightlyTests-6.x/checkout/solr/build/solr-core/test/J1/temp/solr.handler.TestReplicationHandler_564FB800CB832D4C-001/solr-instance-001/collection1
   [junit4]   2> 2154310 INFO  (TEST-TestReplicationHandler.doTestRepeater-seed#[564FB800CB832D4C]) [    ] o.e.j.s.Server jetty-9.3.14.v20161028
   [junit4]   2> 2154378 INFO  (TEST-TestReplicationHandler.doTestRepeater-seed#[564FB800CB832D4C]) [    ] o.e.j.s.h.ContextHandler Started o.e.j.s.ServletContextHandler@74514d9{/solr,null,AVAILABLE}
   [junit4]   2> 2154380 INFO  (TEST-TestReplicationHandler.doTestRepeater-seed#[564FB800CB832D4C]) [    ] o.e.j.s.AbstractConnector Started ServerConnector@791b6ad8{HTTP/1.1,[http/1.1]}{127.0.0.1:56993}
   [junit4]   2> 2154380 INFO  (TEST-TestReplicationHandler.doTestRepeater-seed#[564FB800CB832D4C]) [    ] o.e.j.s.Server Started @2158139ms
   [junit4]   2> 2154380 INFO  (TEST-TestReplicationHandler.doTestRepeater-seed#[564FB800CB832D4C]) [    ] o.a.s.c.s.e.JettySolrRunner Jetty properties: {solr.data.dir=/x1/jenkins/jenkins-slave/workspace/Lucene-Solr-NightlyTests-6.x/checkout/solr/build/solr-core/test/J1/temp/solr.handler.TestReplicationHandler_564FB800CB832D4C-001/solr-instance-001/collection1/data, hostContext=/solr, hostPort=56993}
   [junit4]   2> 2154381 ERROR (TEST-TestReplicationHandler.doTestRepeater-seed#[564FB800CB832D4C]) [    ] o.a.s.s.StartupLoggingUtils Missing Java Option solr.log.dir. Logging may be missing or incomplete.
   [junit4]   2> 2154381 INFO  (TEST-TestReplicationHandler.doTestRepeater-seed#[564FB800CB832D4C]) [    ] o.a.s.s.SolrDispatchFilter  ___      _       Welcome to Apache Solr™ version 6.4.0
   [junit4]   2> 2154381 INFO  (TEST-TestReplicationHandler.doTestRepeater-seed#[564FB800CB832D4C]) [    ] o.a.s.s.SolrDispatchFilter / __| ___| |_ _   Starting in standalone mode on port null
   [junit4]   2> 2154381 INFO  (TEST-TestReplicationHandler.doTestRepeater-seed#[564FB800CB832D4C]) [    ] o.a.s.s.SolrDispatchFilter \__ \/ _ \ | '_|  Install dir: null
   [junit4]   2> 2154381 INFO  (TEST-TestReplicationHandler.doTestRepeater-seed#[564FB800CB832D4C]) [    ] o.a.s.s.SolrDispatchFilter |___/\___/_|_|    Start time: 2016-12-16T19:16:00.653Z
   [junit4]   2> 2154381 INFO  (TEST-TestReplicationHandler.doTestRepeater-seed#[564FB800CB832D4C]) [    ] o.a.s.c.SolrXmlConfig Loading container configuration from /x1/jenkins/jenkins-slave/workspace/Lucene-Solr-NightlyTests-6.x/checkout/solr/build/solr-core/test/J1/temp/solr.handler.TestReplicationHandler_564FB800CB832D4C-001/solr-instance-001/solr.xml
   [junit4]   2> 2154453 INFO  (TEST-TestReplicationHandler.doTestRepeater-seed#[564FB800CB832D4C]) [    ] o.a.s.u.UpdateShardHandler Creating UpdateShardHandler HTTP client with params: socketTimeout=340000&connTimeout=45000&retry=true
   [junit4]   2> 2154455 INFO  (TEST-TestReplicationHandler.doTestRepeater-seed#[564FB800CB832D4C]) [    ] o.a.s.c.CorePropertiesLocator Found 1 core definitions underneath /x1/jenkins/jenkins-slave/workspace/Lucene-Solr-NightlyTests-6.x/checkout/solr/build/solr-core/test/J1/temp/solr.handler.TestReplicationHandler_564FB800CB832D4C-001/solr-instance-001/.
   [junit4]   2> 2154455 INFO  (TEST-TestReplicationHandler.doTestRepeater-seed#[564FB800CB832D4C]) [    ] o.a.s.c.CorePropertiesLocator Cores are: [collection1]
   [junit4]   2> 2154464 WARN  (coreLoadExecutor-4339-thread-1) [    x:collection1] o.a.s.c.Config Beginning with Solr 5.5, <mergePolicy> is deprecated, use <mergePolicyFactory> instead.
   [junit4]   2> 2154465 INFO  (coreLoadExecutor-4339-thread-1) [    x:collection1] o.a.s.c.SolrConfig Using Lucene MatchVersion: 6.4.0
   [junit4]   2> 2154490 INFO  (coreLoadExecutor-4339-thread-1) [    x:collection1] o.a.s.s.IndexSchema [collection1] Schema name=test
   [junit4]   2> 2154492 INFO  (coreLoadExecutor-4339-thread-1) [    x:collection1] o.a.s.s.IndexSchema Loaded schema test/1.2 with uniqueid field id
   [junit4]   2> 2154498 INFO  (coreLoadExecutor-4339-thread-1) [    x:collection1] o.a.s.c.CoreContainer Creating SolrCore 'collection1' using configuration from instancedir /x1/jenkins/jenkins-slave/workspace/Lucene-Solr-NightlyTests-6.x/checkout/solr/build/solr-core/test/J1/temp/solr.handler.TestReplicationHandler_564FB800CB832D4C-001/solr-instance-001/./collection1
   [junit4]   2> 2154498 INFO  (coreLoadExecutor-4339-thread-1) [    x:collection1] o.a.s.c.SolrCore [[collection1] ] Opening new SolrCore at [/x1/jenkins/jenkins-slave/workspace/Lucene-Solr-NightlyTests-6.x/checkout/solr/build/solr-core/test/J1/temp/solr.handler.TestReplicationHandler_564FB800CB832D4C-001/solr-instance-001/collection1], dataDir=[/x1/jenkins/jenkins-slave/workspace/Lucene-Solr-NightlyTests-6.x/checkout/solr/build/solr-core/test/J1/temp/solr.handler.TestReplicationHandler_564FB800CB832D4C-001/solr-instance-001/./collection1/data/]
   [junit4]   2> 2154528 INFO  (coreLoadExecutor-4339-thread-1) [    x:collection1] o.a.s.u.RandomMergePolicy RandomMergePolicy wrapping class org.apache.lucene.index.LogDocMergePolicy: [LogDocMergePolicy: minMergeSize=1000, mergeFactor=45, maxMergeSize=9223372036854775807, maxMergeSizeForForcedMerge=9223372036854775807, calibrateSizeByDeletes=false, maxMergeDocs=2147483647, maxCFSSegmentSizeMB=8.796093022207999E12, noCFSRatio=0.2723911934847102]
   [junit4]   2> 2154551 INFO  (coreLoadExecutor-4339-thread-1) [    x:collection1] o.a.s.u.CommitTracker Hard AutoCommit: disabled
   [junit4]   2> 2154551 INFO  (coreLoadExecutor-4339-thread-1) [    x:collection1] o.a.s.u.CommitTracker Soft AutoCommit: disabled
   [junit4]   2> 2154552 INFO  (coreLoadExecutor-4339-thread-1) [    x:collection1] o.a.s.u.RandomMergePolicy RandomMergePolicy wrapping class org.apache.lucene.index.TieredMergePolicy: [TieredMergePolicy: maxMergeAtOnce=6, maxMergeAtOnceExplicit=4, maxMergedSegmentMB=0.6982421875, floorSegmentMB=0.8662109375, forceMergeDeletesPctAllowed=3.134132437153958, segmentsPerTier=45.0, maxCFSSegmentSizeMB=8.796093022207999E12, noCFSRatio=0.0
   [junit4]   2> 2154552 INFO  (coreLoadExecutor-4339-thread-1) [    x:collection1] o.a.s.s.SolrIndexSearcher Opening [Searcher@d99ea33[collection1] main]
   [junit4]   2> 2154552 INFO  (coreLoadExecutor-4339-thread-1) [    x:collection1] o.a.s.r.ManagedResourceStorage File-based storage initialized to use dir: /x1/jenkins/jenkins-slave/workspace/Lucene-Solr-NightlyTests-6.x/checkout/solr/build/solr-core/test/J1/temp/solr.handler.TestReplicationHandler_564FB800CB832D4C-001/solr-instance-001/collection1/conf
   [junit4]   2> 2154553 INFO  (coreLoadExecutor-4339-thread-1) [    x:collection1] o.a.s.h.ReplicationHandler Replication enabled for following config files: schema.xml,xslt/dummy.xsl
   [junit4]   2> 2154553 INFO  (coreLoadExecutor-4339-thread-1) [    x:collection1] o.a.s.h.ReplicationHandler Commits will be reserved for  10000
   [junit4]   2> 2154559 INFO  (searcherExecutor-4340-thread-1-processing-x:collection1) [    x:collection1] o.a.s.c.SolrCore [collection1] Registered new searcher Searcher@d99ea33[collection1] main{ExitableDirectoryReader(UninvertingDirectoryReader())}
   [junit4]   2> 2154971 INFO  (TEST-TestReplicationHandler.doTestRepeater-seed#[564FB800CB832D4C]) [    ] o.a.s.SolrTestCaseJ4 Writing core.properties file to /x1/jenkins/jenkins-slave/workspace/Lucene-Solr-NightlyTests-6.x/checkout/solr/build/solr-core/test/J1/temp/solr.handler.TestReplicationHandler_564FB800CB832D4C-001/solr-instance-002/collection1
   [junit4]   2> 2154975 INFO  (TEST-TestReplicationHandler.doTestRepeater-seed#[564FB800CB832D4C]) [    ] o.e.j.s.Server jetty-9.3.14.v20161028
   [junit4]   2> 2155007 INFO  (TEST-TestReplicationHandler.doTestRepeater-seed#[564FB800CB832D4C]) [    ] o.e.j.s.h.ContextHandler Started o.e.j.s.ServletContextHandler@4e85e0d{/solr,null,AVAILABLE}
   [junit4]   2> 2155007 INFO  (TEST-TestReplicationHandler.doTestRepeater-seed#[564FB800CB832D4C]) [    ] o.e.j.s.AbstractConnector Started ServerConnector@5ac4ed3c{HTTP/1.1,[http/1.1]}{127.0.0.1:56330}
   [junit4]   2> 2155007 INFO  (TEST-TestReplicationHandler.doTestRepeater-seed#[564FB800CB832D4C]) [    ] o.e.j.s.Server Started @2158766ms
   [junit4]   2> 2155007 INFO  (TEST-TestReplicationHandler.doTestRepeater-seed#[564FB800CB832D4C]) [    ] o.a.s.c.s.e.JettySolrRunner Jetty properties: {solr.data.dir=/x1/jenkins/jenkins-slave/workspace/Lucene-Solr-NightlyTests-6.x/checkout/solr/build/solr-core/test/J1/temp/solr.handler.TestReplicationHandler_564FB800CB832D4C-001/solr-instance-002/collection1/data, hostContext=/solr, hostPort=56330}
   [junit4]   2> 2155050 ERROR (TEST-TestReplicationHandler.doTestRepeater-seed#[564FB800CB832D4C]) [    ] o.a.s.s.StartupLoggingUtils Missing Java Option solr.log.dir. Logging may be missing or incomplete.
   [junit4]   2> 2155050 INFO  (TEST-TestReplicationHandler.doTestRepeater-seed#[564FB800CB832D4C]) [    ] o.a.s.s.SolrDispatchFilter  ___      _       Welcome to Apache Solr™ version 6.4.0
   [junit4]   2> 2155050 INFO  (TEST-TestReplicationHandler.doTestRepeater-seed#[564FB800CB832D4C]) [    ] o.a.s.s.SolrDispatchFilter / __| ___| |_ _   Starting in standalone mode on port null
   [junit4]   2> 2155050 INFO  (TEST-TestReplicationHandler.doTestRepeater-seed#[564FB800CB832D4C]) [    ] o.a.s.s.SolrDispatchFilter \__ \/ _ \ | '_|  Install dir: null
   [junit4]   2> 2155050 INFO  (TEST-TestReplicationHandler.doTestRepeater-seed#[564FB800CB832D4C]) [    ] o.a.s.s.SolrDispatchFilter |___/\___/_|_|    Start time: 2016-12-16T19:16:01.322Z
   [junit4]   2> 2155051 INFO  (TEST-TestReplicationHandler.doTestRepeater-seed#[564FB800CB832D4C]) [    ] o.a.s.c.SolrXmlConfig Loading container configuration from /x1/jenkins/jenkins-slave/workspace/Lucene-Solr-NightlyTests-6.x/checkout/solr/build/solr-core/test/J1/temp/solr.handler.TestReplicationHandler_564FB800CB832D4C-001/solr-instance-002/solr.xml
   [junit4]   2> 2155065 INFO  (TEST-TestReplicationHandler.doTestRepeater-seed#[564FB800CB832D4C]) [    ] o.a.s.u.UpdateShardHandler Creating UpdateShardHandler HTTP client with params: socketTimeout=340000&connTimeout=45000&retry=true
   [junit4]   2> 2155074 INFO  (TEST-TestReplicationHandler.doTestRepeater-seed#[564FB800CB832D4C]) [    ] o.a.s.c.CorePropertiesLocator Found 1 core definitions underneath /x1/jenkins/jenkins-slave/workspace/Lucene-Solr-NightlyTests-6.x/checkout/solr/build/solr-core/test/J1/temp/solr.handler.TestReplicationHandler_564FB800CB832D4C-001/solr-instance-002/.
   [junit4]   2> 2155074 INFO  (TEST-TestReplicationHandler.doTestRepeater-seed#[564FB800CB832D4C]) [    ] o.a.s.c.CorePropertiesLocator Cores are: [collection1]
   [junit4]   2> 2155082 WARN  (coreLoadExecutor-4349-thread-1) [    x:collection1] o.a.s.c.Config Beginning with Solr 5.5, <mergePolicy> is deprecated, use <mergePolicyFactory> instead.
   [junit4]   2> 2155084 INFO  (coreLoadExecutor-4349-thread-1) [    x:collection1] o.a.s.c.SolrConfig Using Lucene MatchVersion: 6.4.0
   [junit4]   2> 2155105 INFO  (coreLoadExecutor-4349-thread-1) [    x:collection1] o.a.s.s.IndexSchema [collection1] Schema name=test
   [junit4]   2> 2155107 INFO  (coreLoadExecutor-4349-thread-1) [    x:collection1] o.a.s.s.IndexSchema Loaded schema test/1.2 with uniqueid field id
   [junit4]   2> 2155108 INFO  (coreLoadExecutor-4349-thread-1) [    x:collection1] o.a.s.c.CoreContainer Creating SolrCore 'collection1' using configuration from instancedir /x1/jenkins/jenkins-slave/workspace/Lucene-Solr-NightlyTests-6.x/checkout/solr/build/solr-core/test/J1/temp/solr.handler.TestReplicationHandler_564FB800CB832D4C-001/solr-instance-002/./collection1
   [junit4]   2> 2155109 INFO  (coreLoadExecutor-4349-thread-1) [    x:collection1] o.a.s.c.SolrCore [[collection1] ] Opening new SolrCore at [/x1/jenkins/jenkins-slave/workspace/Lucene-Solr-NightlyTests-6.x/checkout/solr/build/solr-core/test/J1/temp/solr.handler.TestReplicationHandler_564FB800CB832D4C-001/solr-instance-002/collection1], dataDir=[/x1/jenkins/jenkins-slave/workspace/Lucene-Solr-NightlyTests-6.x/checkout/solr/build/solr-core/test/J1/temp/solr.handler.TestReplicationHandler_564FB800CB832D4C-001/solr-instance-002/./collection1/data/]
   [junit4]   2> 2155122 INFO  (coreLoadExecutor-4349-thread-1) [    x:collection1] o.a.s.u.RandomMergePolicy RandomMergePolicy wrapping class org.apache.lucene.index.LogDocMergePolicy: [LogDocMergePolicy: minMergeSize=1000, mergeFactor=45, maxMergeSize=9223372036854775807, maxMergeSizeForForcedMerge=9223372036854775807, calibrateSizeByDeletes=false, maxMergeDocs=2147483647, maxCFSSegmentSizeMB=8.796093022207999E12, noCFSRatio=0.2723911934847102]
   [junit4]   2> 2155138 INFO  (coreLoadExecutor-4349-thread-1) [    x:collection1] o.a.s.u.CommitTracker Hard AutoCommit: disabled
   [junit4]   2> 2155138 INFO  (coreLoadExecutor-4349-thread-1) [    x:collection1] o.a.s.u.CommitTracker Soft AutoCommit: disabled
   [junit4]   2> 2155139 INFO  (coreLoadExecutor-4349-thread-1) [    x:collection1] o.a.s.u.RandomMergePolicy RandomMergePolicy wrapping class org.apache.lucene.index.TieredMergePolicy: [TieredMergePolicy: maxMergeAtOnce=6, maxMergeAtOnceExplicit=4, maxMergedSegmentMB=0.6982421875, floorSegmentMB=0.8662109375, forceMergeDeletesPctAllowed=3.134132437153958, segmentsPerTier=45.0, maxCFSSegmentSizeMB=8.796093022207999E12, noCFSRatio=0.0
   [junit4]   2> 2155143 INFO  (coreLoadExecutor-4349-thread-1) [    x:collection1] o.a.s.s.SolrIndexSearcher Opening [Searcher@f818e3e[collection1] main]
   [junit4]   2> 2155144 INFO  (coreLoadExecutor-4349-thread-1) [    x:collection1] o.a.s.r.ManagedResourceStorage File-based storage initialized to use dir: /x1/jenkins/jenkins-slave/workspace/Lucene-Solr-NightlyTests-6.x/checkout/solr/build/solr-core/test/J1/temp/solr.handler.TestReplicationHandler_564FB800CB832D4C-001/solr-instance-002/collection1/conf
   [junit4]   2> 2155157 INFO  (coreLoadExecutor-4349-thread-1) [    x:collection1] o.a.s.h.ReplicationHandler Poll scheduled at an interval of 1000ms
   [junit4]   2> 2155158 INFO  (searcherExecutor-4350-thread-1-processing-x:collection1) [    x:collection1] o.a.s.c.SolrCore [collection1] Registered new searcher Searcher@f818e3e[collection1] main{ExitableDirectoryReader(UninvertingDirectoryReader())}
   [junit4]   2> 2155385 INFO  (qtp1896429911-23704) [    x:collection1] o.a.s.c.S.Request [collection1]  webapp=/solr path=/replication params={qt=/replication&wt=javabin&version=2&command=indexversion} status=0 QTime=0
   [junit4]   2> 2155385 INFO  (indexFetcher-4354-thread-1) [    x:collection1] o.a.s.h.IndexFetcher Master's generation: 1
   [junit4]   2> 2155385 INFO  (indexFetcher-4354-thread-1) [    x:collection1] o.a.s.h.IndexFetcher Master's version: 0
   [junit4]   2> 2155385 INFO  (indexFetcher-4354-thread-1) [    x:collection1] o.a.s.h.IndexFetcher Slave's generation: 1
   [junit4]   2> 2155586 INFO  (TEST-TestReplicationHandler.doTestRepeater-seed#[564FB800CB832D4C]) [    ] o.e.j.s.AbstractConnector Stopped ServerConnector@5ac4ed3c{HTTP/1.1,[http/1.1]}{127.0.0.1:0}
   [junit4]   2> 2155586 INFO  (TEST-TestReplicationHandler.doTestRepeater-seed#[564FB800CB832D4C]) [    ] o.a.s.c.CoreContainer Shutting down CoreContainer instance=1963477174
   [junit4]   2> 2155593 INFO  (coreCloseExecutor-4355-thread-1) [    x:collection1] o.a.s.c.SolrCore [collection1]  CLOSING SolrCore org.apache.solr.core.SolrCore@274fcb62
   [junit4]   2> 2155597 INFO  (TEST-TestReplicationHandler.doTestRepeater-seed#[564FB800CB832D4C]) [    ] o.e.j.s.h.ContextHandler Stopped o.e.j.s.ServletContextHandler@4e85e0d{/solr,null,UNAVAILABLE}
   [junit4]   2> 2155601 INFO  (TEST-TestReplicationHandler.doTestRepeater-seed#[564FB800CB832D4C]) [    ] o.e.j.s.Server jetty-9.3.14.v20161028
   [junit4]   2> 2155603 INFO  (TEST-TestReplicationHandler.doTestRepeater-seed#[564FB800CB832D4C]) [    ] o.e.j.s.h.ContextHandler Started o.e.j.s.ServletContextHandler@16da66fa{/solr,null,AVAILABLE}
   [junit4]   2> 2155603 INFO  (TEST-TestReplicationHandler.doTestRepeater-seed#[564FB800CB832D4C]) [    ] o.e.j.s.AbstractConnector Started ServerConnector@278fc8ea{HTTP/1.1,[http/1.1]}{127.0.0.1:55550}
   [junit4]   2> 2155603 INFO  (TEST-TestReplicationHandler.doTestRepeater-seed#[564FB800CB832D4C]) [    ] o.e.j.s.Server Started @2159362ms
   [junit4]   2> 2155604 INFO  (TEST-TestReplicationHandler.doTestRepeater-seed#[564FB800CB832D4C]) [    ] o.a.s.c.s.e.JettySolrRunner Jetty properties: {solr.data.dir=/x1/jenkins/jenkins-slave/workspace/Lucene-Solr-NightlyTests-6.x/checkout/solr/build/solr-core/test/J1/temp/solr.handler.TestReplicationHandler_564FB800CB832D4C-001/solr-instance-002/collection1/data, hostContext=/solr, hostPort=55550}
   [junit4]   2> 2155604 ERROR (TEST-TestReplicationHandler.doTestRepeater-seed#[564FB800CB832D4C]) [    ] o.a.s.s.StartupLoggingUtils Missing Java Option solr.log.dir. Logging may be missing or incomplete.
   [junit4]   2> 2155604 INFO  (TEST-TestReplicationHandler.doTestRepeater-seed#[564FB800CB832D4C]) [    ] o.a.s.s.SolrDispatchFilter  ___      _       Welcome to Apache Solr™ version 6.4.0
   [junit4]   2> 2155604 INFO  (TEST-TestReplicationHandler.doTestRepeater-seed#[564FB800CB832D4C]) [    ] o.a.s.s.SolrDispatchFilter / __| ___| |_ _   Starting in standalone mode on port null
   [junit4]   2> 2155604 INFO  (TEST-TestReplicationHandler.doTestRepeater-seed#[564FB800CB832D4C]) [    ] o.a.s.s.SolrDispatchFilter \__ \/ _ \ | '_|  Install dir: null
   [junit4]   2> 2155604 INFO  (TEST-TestReplicationHandler.doTestRepeater-seed#[564FB800CB832D4C]) [    ] o.a.s.s.SolrDispatchFilter |___/\___/_|_|    Start time: 2016-12-16T19:16:01.876Z
   [junit4]   2> 2155608 INFO  (TEST-TestReplicationHandler.doTestRepeater-seed#[564FB800CB832D4C]) [    ] o.a.s.c.SolrXmlConfig Loading container configuration from /x1/jenkins/jenkins-slave/workspace/Lucene-Solr-NightlyTests-6.x/checkout/solr/build/solr-core/test/J1/temp/solr.handler.TestReplicationHandler_564FB800CB832D4C-001/solr-instance-002/solr.xml
   [junit4]   2> 2155621 INFO  (TEST-TestReplicationHandler.doTestRepeater-seed#[564FB800CB832D4C]) [    ] o.a.s.u.UpdateShardHandler Creating UpdateShardHandler HTTP client with params: socketTimeout=340000&connTimeout=45000&retry=true
   [junit4]   2> 2155625 INFO  (TEST-TestReplicationHandler.doTestRepeater-seed#[564FB800CB832D4C]) [    ] o.a.s.c.CorePropertiesLocator Found 1 core definitions underneath /x1/jenkins/jenkins-slave/workspace/Lucene-Solr-NightlyTests-6.x/checkout/solr/build/solr-core/test/J1/temp/solr.handler.TestReplicationHandler_564FB800CB832D4C-001/solr-instance-002/.
   [junit4]   2> 2155625 INFO  (TEST-TestReplicationHandler.doTestRepeater-seed#[564FB800CB832D4C]) [    ] o.a.s.c.CorePropertiesLocator Cores are: [collection1]
   [junit4]   2> 2155636 WARN  (coreLoadExecutor-4362-thread-1) [    x:collection1] o.a.s.c.Config Beginning with Solr 5.5, <mergePolicy> is deprecated, use <mergePolicyFactory> instead.
   [junit4]   2> 2155637 INFO  (coreLoadExecutor-4362-thread-1) [    x:collection1] o.a.s.c.SolrConfig Using Lucene MatchVersion: 6.4.0
   [junit4]   2> 2155648 INFO  (coreLoadExecutor-4362-thread-1) [    x:collection1] o.a.s.s.IndexSchema [collection1] Schema name=test
   [junit4]   2> 2155672 INFO  (coreLoadExecutor-4362-thread-1) [    x:collection1] o.a.s.s.IndexSchema Loaded schema test/1.2 with uniqueid field id
   [junit4]   2> 2155674 INFO  (coreLoadExecutor-4362-thread-1) [    x:collection1] o.a.s.c.CoreContainer Creating SolrCore 'collection1' using configuration from instancedir /x1/jenkins/jenkins-slave/workspace/Lucene-Solr-NightlyTests-6.x/checkout/solr/build/solr-core/test/J1/temp/solr.handler.TestReplicationHandler_564FB800CB832D4C-001/solr-instance-002/./collection1
   [junit4]   2> 2155674 INFO  (coreLoadExecutor-4362-thread-1) [    x:collection1] o.a.s.c.SolrCore [[collection1] ] Opening new SolrCore at [/x1/jenkins/jenkins-slave/workspace/Lucene-Solr-NightlyTests-6.x/checkout/solr/build/solr-core/test/J1/temp/solr.handler.TestReplicationHandler_564FB800CB832D4C-001/solr-instance-002/collection1], dataDir=[/x1/jenkins/jenkins-slave/workspace/Lucene-Solr-NightlyTests-6.x/checkout/solr/build/solr-core/test/J1/temp/solr.handler.TestReplicationHandler_564FB800CB832D4C-001/solr-instance-002/./collection1/data/]
   [junit4]   2> 2155676 INFO  (coreLoadExecutor-4362-thread-1) [    x:collection1] o.a.s.u.RandomMergePolicy RandomMergePolicy wrapping class org.apache.lucene.index.LogDocMergePolicy: [LogDocMergePolicy: minMergeSize=1000, mergeFactor=45, maxMergeSize=9223372036854775807, maxMergeSizeForForcedMerge=9223372036854775807, calibrateSizeByDeletes=false, maxMergeDocs=2147483647, maxCFSSegmentSizeMB=8.796093022207999E12, noCFSRatio=0.2723911934847102]
   [junit4]   2> 2155695 INFO  (coreLoadExecutor-4362-thread-1) [    x:collection1] o.a.s.u.CommitTracker Hard AutoCommit: disabled
   [junit4]   2> 2155695 INFO  (coreLoadExecutor-4362-thread-1) [    x:collection1] o.a.s.u.CommitTracker Soft AutoCommit: disabled
   [junit4]   2> 2155695 INFO  (coreLoadExecutor-4362-thread-1) [    x:collection1] o.a.s.u.RandomMergePolicy RandomMergePolicy wrapping class org.apache.lucene.index.TieredMergePolicy: [TieredMergePolicy: maxMergeAtOnce=6, maxMergeAtOnceExplicit=4, maxMergedSegmentMB=0.6982421875, floorSegmentMB=0.8662109375, forceMergeDeletesPctAllowed=3.134132437153958, segmentsPerTier=45.0, maxCFSSegmentSizeMB=8.796093022207999E12, noCFSRatio=0.0
   [junit4]   2> 2155695 INFO  (coreLoadExecutor-4362-thread-1) [    x:collection1] o.a.s.s.SolrIndexSearcher Opening [Searcher@4a2982a9[collection1] main]
   [junit4]   2> 2155696 INFO  (coreLoadExecutor-4362-thread-1) [    x:collection1] o.a.s.r.ManagedResourceStorage File-based storage initialized to use dir: /x1/jenkins/jenkins-slave/workspace/Lucene-Solr-NightlyTests-6.x/checkout/solr/build/solr-core/test/J1/temp/solr.handler.TestReplicationHandler_564FB800CB832D4C-001/solr-instance-002/collection1/conf
   [junit4]   2> 2155696 INFO  (coreLoadExecutor-4362-thread-1) [    x:collection1] o.a.s.h.ReplicationHandler Commits will be reserved for  10000
   [junit4]   2> 2155696 INFO  (searcherExecutor-4363-thread-1-processing-x:collection1) [    x:collection1] o.a.s.c.SolrCore [collection1] Registered new searcher Searcher@4a2982a9[collection1] main{ExitableDirectoryReader(UninvertingDirectoryReader())}
   [junit4]   2> 2156141 INFO  (TEST-TestReplicationHandler.doTestRepeater-seed#[564FB800CB832D4C]) [    ] o.a.s.SolrTestCaseJ4 Writing core.properties file to /x1/jenkins/jenkins-slave/workspace/Lucene-Solr-NightlyTests-6.x/checkout/solr/build/solr-core/test/J1/temp/solr.handler.TestReplicationHandler_564FB800CB832D4C-001/solr-instance-003/collection1
   [junit4]   2> 2156144 INFO  (TEST-TestReplicationHandler.doTestRepeater-seed#[564FB800CB832D4C]) [    ] o.e.j.s.Server jetty-9.3.14.v20161028
   [junit4]   2> 2156152 INFO  (TEST-TestReplicationHandler.doTestRepeater-seed#[564FB800CB832D4C]) [    ] o.e.j.s.h.ContextHandler Started o.e.j.s.ServletContextHandler@5c783523{/solr,null,AVAILABLE}
   [junit4]   2> 2156153 INFO  (TEST-TestReplicationHandler.doTestRepeater-seed#[564FB800CB832D4C]) [    ] o.e.j.s.AbstractConnector Started ServerConnector@3ab7f718{HTTP/1.1,[http/1.1]}{127.0.0.1:58206}
   [junit4]   2> 2156154 INFO  (TEST-TestReplicationHandler.doTestRepeater-seed#[564FB800CB832D4C]) [    ] o.e.j.s.Server Started @2159912ms
   [junit4]   2> 2156154 INFO  (TEST-TestReplicationHandler.doTestRepeater-seed#[564FB800CB832D4C]) [    ] o.a.s.c.s.e.JettySolrRunner Jetty properties: {solr.data.dir=/x1/jenkins/jenkins-slave/workspace/Lucene-Solr-NightlyTests-6.x/checkout/solr/build/solr-core/test/J1/temp/solr.handler.TestReplicationHandler_564FB800CB832D4C-001/solr-instance-003/collection1/data, hostContext=/solr, hostPort=58206}
   [junit4]   2> 2156154 ERROR (TEST-TestReplicationHandler.doTestRepeater-seed#[564FB800CB832D4C]) [    ] o.a.s.s.StartupLoggingUtils Missing Java Option solr.log.dir. Logging may be missing or incomplete.
   [junit4]   2> 2156154 INFO  (TEST-TestReplicationHandler.doTestRepeater-seed#[564FB800CB832D4C]) [    ] o.a.s.s.SolrDispatchFilter  ___      _       Welcome to Apache Solr™ version 6.4.0
   [junit4]   2> 2156154 INFO  (TEST-TestReplicationHandler.doTestRepeater-seed#[564FB800CB832D4C]) [    ] o.a.s.s.SolrDispatchFilter / __| ___| |_ _   Starting in standalone mode on port null
   [junit4]   2> 2156154 INFO  (TEST-TestReplicationHandler.doTestRepeater-seed#[564FB800CB832D4C]) [    ] o.a.s.s.SolrDispatchFilter \__ \/ _ \ | '_|  Install dir: null
   [junit4]   2> 2156154 INFO  (TEST-TestReplicationHandler.doTestRepeater-seed#[564FB800CB832D4C]) [    ] o.a.s.s.SolrDispatchFilter |___/\___/_|_|    Start time: 2016-12-16T19:16:02.426Z
   [junit4]   2> 2156155 INFO  (TEST-TestReplicationHandler.doTestRepeater-seed#[564FB800CB832D4C]) [    ] o.a.s.c.SolrXmlConfig Loading container configuration from /x1/jenkins/jenkins-slave/workspace/Lucene-Solr-NightlyTests-6.x/checkout/solr/build/solr-core/test/J1/temp/solr.handler.TestReplicationHandler_564FB800CB832D4C-001/solr-instance-003/solr.xml
   [junit4]   2> 2156160 INFO  (TEST-TestReplicationHandler.doTestRepeater-seed#[564FB800CB832D4C]) [    ] o.a.s.u.UpdateShardHandler Creating UpdateShardHandler HTTP client with params: socketTimeout=340000&connTimeout=45000&retry=true
   [junit4]   2> 2156163 INFO  (TEST-TestReplicationHandler.doTestRepeater-seed#[564FB800CB832D4C]) [    ] o.a.s.c.CorePropertiesLocator Found 1 core definitions underneath /x1/jenkins/jenkins-slave/workspace/Lucene-Solr-NightlyTests-6.x/checkout/solr/build/solr-core/test/J1/temp/solr.handler.TestReplicationHandler_564FB800CB832D4C-001/solr-instance-003/.
   [junit4]   2> 2156163 INFO  (TEST-TestReplicationHandler.doTestRepeater-seed#[564FB800CB832D4C]) [    ] o.a.s.c.CorePropertiesLocator Cores are: [collection1]
   [junit4]   2> 2156170 WARN  (coreLoadExecutor-4372-thread-1) [    x:collection1] o.a.s.c.Config Beginning with Solr 5.5, <mergePolicy> is deprecated, use <mergePolicyFactory> instead.
   [junit4]   2> 2156171 INFO  (coreLoadExecutor-4372-thread-1) [    x:collection1] o.a.s.c.SolrConfig Using Lucene MatchVersion: 6.4.0
   [junit4]   2> 2156179 INFO  (coreLoadExecutor-4372-thread-1) [    x:collection1] o.a.s.s.IndexSchema [collection1] Schema name=test
   [junit4]   2> 2156181 INFO  (coreLoadExecutor-4372-thread-1) [    x:collection1] o.a.s.s.IndexSchema Loaded schema test/1.2 with uniqueid field id
   [junit4]   2> 2156182 INFO  (coreLoadExecutor-4372-thread-1) [    x:collection1] o.a.s.c.CoreContainer Creating SolrCore 'collection1' using configuration from instancedir /x1/jenkins/jenkins-slave/workspace/Lucene-Solr-NightlyTests-6.x/checkout/solr/build/solr-core/test/J1/temp/solr.handler.TestReplicationHandler_564FB800CB832D4C-001/solr-instance-003/./collection1
   [junit4]   2> 2156182 INFO  (coreLoadExecutor-4372-thread-1) [    x:collection1] o.a.s.c.SolrCore [[collection1] ] Opening new SolrCore at [/x1/jenkins/jenkins-slave/workspace/Lucene-Solr-NightlyTests-6.x/checkout/solr/build/solr-core/test/J1/temp/solr.handler.TestReplicationHandler_564FB800CB832D4C-001/solr-instance-003/collection1], dataDir=[/x1/jenkins/jenkins-slave/workspace/Lucene-Solr-NightlyTests-6.x/checkout/solr/build/solr-core/test/J1/temp/solr.handler.TestReplicationHandler_564FB800CB832D4C-001/solr-instance-003/./collection1/data/]
   [junit4]   2> 2156184 INFO  (coreLoadExecutor-4372-thread-1) [    x:collection1] o.a.s.u.RandomMergePolicy RandomMergePolicy wrapping class org.apache.lucene.index.LogDocMergePolicy: [LogDocMergePolicy: minMergeSize=1000, mergeFactor=45, maxMergeSize=9223372036854775807, maxMergeSizeForForcedMerge=9223372036854775807, calibrateSizeByDeletes=false, maxMergeDocs=2147483647, maxCFSSegmentSizeMB=8.796093022207999E12, noCFSRatio=0.2723911934847102]
   [junit4]   2> 2156190 INFO  (coreLoadExecutor-4372-thread-1) [    x:collection1] o.a.s.u.CommitTracker Hard AutoCommit: disabled
   [junit4]   2> 2156190 INFO  (coreLoadExecutor-4372-thread-1) [    x:collection1] o.a.s.u.CommitTracker Soft AutoCommit: disabled
   [junit4]   2> 2156190 INFO  (coreLoadExecutor-4372-thread-1) [    x:collection1] o.a.s.u.RandomMergePolicy RandomMergePolicy wrapping class org.apache.lucene.index.TieredMergePolicy: [TieredMergePolicy: maxMergeAtOnce=6, maxMergeAtOnceExplicit=4, maxMergedSegmentMB=0.6982421875, floorSegmentMB=0.8662109375, forceMergeDeletesPctAllowed=3.134132437153958, segmentsPerTier=45.0, maxCFSSegmentSizeMB=8.796093022207999E12, noCFSRatio=0.0
   [junit4]   2> 2156191 INFO  (coreLoadExecutor-4372-thread-1) [    x:collection1] o.a.s.s.SolrIndexSearcher Opening [Searcher@1f5d956[collection1] main]
   [junit4]   2> 2156191 INFO  (coreLoadExecutor-4372-thread-1) [    x:collection1] o.a.s.r.ManagedResourceStorage File-based storage initialized to use dir: /x1/jenkins/jenkins-slave/workspace/Lucene-Solr-NightlyTests-6.x/checkout/solr/build/solr-core/test/J1/temp/solr.handler.TestReplicationHandler_564FB800CB832D4C-001/solr-instance-003/collection1/conf
   [junit4]   2> 2156191 WARN  (coreLoadExecutor-4372-thread-1) [    x:collection1] o.a.s.h.IndexFetcher 'masterUrl' must be specified without the /replication suffix
   [junit4]   2> 2156192 INFO  (coreLoadExecutor-4372-thread-1) [    x:collection1] o.a.s.h.ReplicationHandler  No value set for 'pollInterval'. Timer Task not started.
   [junit4]   2> 2156192 INFO  (coreLoadExecutor-4372-thread-1) [    x:collection1] o.a.s.h.ReplicationHandler Replication enabled for following config files: schema.xml
   [junit4]   2> 2156192 INFO  (coreLoadExecutor-4372-thread-1) [    x:collection1] o.a.s.h.ReplicationHandler Commits will be reserved for  10000
   [junit4]   2> 2156192 INFO  (searcherExecutor-4373-thread-1-processing-x:collection1) [    x:collection1] o.a.s.c.SolrCore [collection1] Registered new searcher Searcher@1f5d956[collection1] main{ExitableDirectoryReader(UninvertingDirectoryReader())}
   [junit4]   2> 2156667 INFO  (qtp1896429911-23707) [    x:collection1] o.a.s.u.p.LogUpdateProcessorFactory [collection1]  webapp=/solr path=/update params={wt=javabin&version=2}{add=[0]} 0 1
   [junit4]   2> 2156668 INFO  (qtp1896429911-23708) [    x:collection1] o.a.s.u.p.LogUpdateProcessorFactory [collection1]  webapp=/solr path=/update params={wt=javabin&version=2}{add=[1]} 0 0
   [junit4]   2> 2156670 INFO  (qtp1896429911-23701) [    x:collection1] o.a.s.u.p.LogUpdateProcessorFactory [collection1]  webapp=/solr path=/update params={wt=javabin&version=2}{add=[2]} 0 0
   [junit4]   2> 2156672 INFO  (qtp1896429911-23704) [    x:collection1] o.a.s.u.DirectUpdateHandler2 start commit{,optimize=false,openSearcher=true,waitSearcher=true,expungeDeletes=false,softCommit=false,prepareCommit=false}
   [junit4]   2> 2156672 INFO  (qtp1896429911-23704) [    x:collection1] o.a.s.u.SolrIndexWriter Calling setCommitData with IW:org.apache.solr.update.SolrIndexWriter@1f197ed
   [junit4]   2> 2156677 INFO  (qtp1896429911-23704) [    x:collection1] o.a.s.s.SolrIndexSearcher Opening [Searcher@2ed6c929[collection1] main]
   [junit4]   2> 2156677 INFO  (qtp1896429911-23704) [    x:collection1] o.a.s.u.DirectUpdateHandler2 end_commit_flush
   [junit4]   2> 2156677 INFO  (searcherExecutor-4340-thread-1-processing-x:collection1) [    x:collection1] o.a.s.c.SolrCore [collection1] Registered new searcher Searcher@2ed6c929[collection1] main{ExitableDirectoryReader(UninvertingDirectoryReader(Uninverting(_0(6.4.0):C3)))}
   [junit4]   2> 2156678 INFO  (qtp1896429911-23704) [    x:collection1] o.a.s.u.p.LogUpdateProcessorFactory [collection1]  webapp=/solr path=/update params={waitSearcher=true&commit=true&softCommit=false&wt=javabin&version=2}{commit=} 0 5
   [junit4]   2> 2156683 WARN  (explicit-fetchindex-cmd) [    x:collection1] o.a.s.h.IndexFetcher 'masterUrl' must be specified without the /replication suffix
   [junit4]   2> 2156684 INFO  (qtp1896429911-23702) [    x:collection1] o.a.s.c.S.Request [collection1]  webapp=/solr path=/replication params={qt=/replication&wt=javabin&version=2&command=indexversion} status=0 QTime=0
   [junit4]   2> 2156687 INFO  (explicit-fetchindex-cmd) [    x:collection1] o.a.s.h.IndexFetcher Master's generation: 2
   [junit4]   2> 2156687 INFO  (explicit-fetchindex-cmd) [    x:collection1] o.a.s.h.IndexFetcher Master's version: 1481915762944
   [junit4]   2> 2156687 INFO  (explicit-fetchindex-cmd) [    x:collection1] o.a.s.h.IndexFetcher Slave's generation: 1
   [junit4]   2> 2156687 INFO  (explicit-fetchindex-cmd) [    x:collection1] o.a.s.h.IndexFetcher Starting replication process
   [junit4]   2> 2156702 INFO  (qtp1896429911-23707) [    x:collection1] o.a.s.c.S.Request [collection1]  webapp=/solr path=/replication params={generation=2&qt=/replication&wt=javabin&version=2&command=filelist} status=0 QTime=2
   [junit4]   2> 2156702 INFO  (explicit-fetchindex-cmd) [    x:collection1] o.a.s.h.IndexFetcher Number of files in latest index in master: 9
   [junit4]   2> 2156703 INFO  (explicit-fetchindex-cmd) [    x:collection1] o.a.s.u.RandomMergePolicy RandomMergePolicy wrapping class org.apache.lucene.index.MockRandomMergePolicy: org.apache.lucene.index.MockRandomMergePolicy@cc14eab
   [junit4]   2> 2156703 INFO  (explicit-fetchindex-cmd) [    x:collection1] o.a.s.u.DefaultSolrCoreState New IndexWriter is ready to be used.
   [junit4]   2> 2156703 INFO  (explicit-fetchindex-cmd) [    x:collection1] o.a.s.h.IndexFetcher Starting download (fullCopy=false) to MockDirectoryWrapper(RAMDirectory@88fb6c3 lockFactory=org.apache.lucene.store.SingleInstanceLockFactory@2c28ddf2)
   [junit4]   2> 2156705 INFO  (qtp1896429911-23708) [    x:collection1] o.a.s.c.S.Request [collection1]  webapp=/solr path=/replication params={generation=2&qt=/replication&file=_0.si&checksum=true&wt=filestream&command=filecontent} status=0 QTime=0
   [junit4]   2> 2156714 INFO  (qtp1896429911-23708) [    x:collection1] o.a.s.c.S.Request [collection1]  webapp=/solr path=/replication params={generation=2&qt=/replication&file=_0_FST50_0.doc&checksum=true&wt=filestream&command=filecontent} status=0 QTime=0
   [junit4]   2> 2156725 INFO  (qtp1896429911-23704) [    x:collection1] o.a.s.c.S.Request [collection1]  webapp=/solr path=/replication params={generation=2&qt=/replication&file=_0.nvd&checksum=true&wt=filestream&command=filecontent} status=0 QTime=0
   [junit4]   2> 2156729 INFO  (qtp1896429911-23706) [    x:collection1] o.a.s.c.S.Request [collection1]  webapp=/solr path=/replication params={generation=2&qt=/replication&file=_0.fdx&checksum=true&wt=filestream&command=filecontent} status=0 QTime=0
   [junit4]   2> 2156731 INFO  (qtp1896429911-23702) [    x:collection1] o.a.s.c.S.Request [collection1]  webapp=/solr path=/replication params={generation=2&qt=/replication&file=_0_FST50_0.tfp&checksum=true&wt=filestream&command=filecontent} status=0 QTime=0
   [junit4]   2> 2156740 INFO  (qtp1896429911-23707) [    x:collection1] o.a.s.c.S.Request [collection1]  webapp=/solr path=/replication params={generation=2&qt=/replication&file=_0.fdt&checksum=true&wt=filestream&command=filecontent} status=0 QTime=0
   [junit4]   2> 2156743 INFO  (qtp1896429911-23701) [    x:collection1] o.a.s.c.S.Request [collection1]  webapp=/solr path=/replication params={generation=2&qt=/replication&file=_0.fnm&checksum=true&wt=filestream&command=filecontent} status=0 QTime=0
   [junit4]   2> 2156745 INFO  (qtp1896429911-23708) [    x:collection1] o.a.s.c.S.Request [collection1]  webapp=/solr path=/replication params={generation=2&qt=/replication&file=_0.nvm&checksum=true&wt=filestream&command=filecontent} status=0 QTime=0
   [junit4]   2> 2156747 INFO  (qtp1896429911-23704) [    x:collection1] o.a.s.c.S.Request [collection1]  webapp=/solr path=/replication params={generation=2&qt=/replication&file=segments_2&checksum=true&wt=filestream&command=filecontent} status=0 QTime=0
   [junit4]   2> 2156748 INFO  (explicit-fetchindex-cmd) [    x:collection1] o.a.s.h.IndexFetcher Total time taken for download (fullCopy=false,bytesDownloaded=1501) : 0 secs (null bytes/sec) to MockDirectoryWrapper(RAMDirectory@88fb6c3 lockFactory=org.apache.lucene.store.SingleInstanceLockFactory@2c28ddf2)
   [junit4]   2> 2156750 INFO  (explicit-fetchindex-cmd) [    x:collection1] o.a.s.u.RandomMergePolicy RandomMergePolicy wrapping class org.apache.lucene.index.TieredMergePolicy: [TieredMergePolicy: maxMergeAtOnce=36, maxMergeAtOnceExplicit=35, maxMergedSegmentMB=0.8701171875, floorSegmentMB=1.4775390625, forceMergeDeletesPctAllowed=10.802995612434938, segmentsPerTier=36.0, maxCFSSegmentSizeMB=8.796093022207999E12, noCFSRatio=0.4506024650409598
   [junit4]   2> 2156750 INFO  (explicit-fetchindex-cmd) [    x:collection1] o.a.s.u.DefaultSolrCoreState New IndexWriter is ready to be used.
   [junit4]   2> 2156751 INFO  (explicit-fetchindex-cmd) [    x:collection1] o.a.s.s.SolrIndexSearcher Opening [Searcher@9e4a26c[collection1] main]
   [junit4]   2> 2156751 INFO  (searcherExecutor-4373-thread-1-processing-x:collection1) [    x:collection1] o.a.s.c.SolrCore [collection1] Registered new searcher Searcher@9e4a26c[collection1] main{ExitableDirectoryReader(UninvertingDirectoryReader(Uninverting(_0(6.4.0):C3)))}
   [junit4]   2> 2156752 INFO  (qtp1272903588-23759) [    x:collection1] o.a.s.c.S.Request [collection1]  webapp=/solr path=/replication params={wait=true&masterUrl=http://127.0.0.1:56993/solr/collection1/replication&command=fetchindex} status=0 QTime=72
   [junit4]   2> 2156755 INFO  (qtp1272903588-23757) [    x:collection1] o.a.s.c.S.Request [collection1]  webapp=/solr path=/select params={q=*:*&sort=id+desc&wt=javabin&version=2} hits=3 status=0 QTime=0
   [junit4]   2> 2156755 INFO  (TEST-TestReplicationHandler.doTestRepeater-seed#[564FB800CB832D4C]) [    ] o.a.s.h.TestReplicationHandler Waited for 0ms and found 3 docs
   [junit4]   2> 2156757 WARN  (explicit-fetchindex-cmd) [    x:collection1] o.a.s.h.IndexFetcher 'masterUrl' must be specified without the /replication suffix
   [junit4]   2> 2156759 INFO  (qtp1272903588-23757) [    x:collection1] o.a.s.c.S.Request [collection1]  webapp=/solr path=/replication params={qt=/replication&wt=javabin&version=2&command=indexversion} status=0 QTime=0
   [junit4]   2> 2156759 INFO  (explicit-fetchindex-cmd) [    x:collection1] o.a.s.h.IndexFetcher Master's generation: 2
   [junit4]   2> 2156759 INFO  (explicit-fetchindex-cmd) [    x:collection1] o.a.s.h.IndexFetcher Master's version: 1481915762944
   [junit4]   2> 2156759 INFO  (explicit-fetchindex-cmd) [    x:collection1] o.a.s.h.IndexFetcher Slave's generation: 1
   [junit4]   2> 2156759 INFO  (explicit-fetchindex-cmd) [    x:collection1] o.a.s.h.IndexFetcher Starting replication process
   [junit4]   2> 2156763 INFO  (qtp1272903588-23763) [    x:collection1] o.a.s.c.S.Request [collection1]  webapp=/solr path=/replication params={generation=2&qt=/replication&wt=javabin&version=2&command=filelist} status=0 QTime=1
   [junit4]   2> 2156763 INFO  (explicit-fetchindex-cmd) [    x:collection1] o.a.s.h.IndexFetcher Number of files in latest index in master: 9
   [junit4]   2> 2156765 INFO  (explicit-fetchindex-cmd) [    x:collection1] o.a.s.u.RandomMergePolicy RandomMergePolicy wrapping class org.apache.lucene.index.MockRandomMergePolicy: org.apache.lucene.index.MockRandomMergePolicy@4fb38143
   [junit4]   2> 2156766 INFO  (explicit-fetchindex-cmd) [    x:collection1] o.a.s.u.DefaultSolrCoreState New IndexWriter is ready to be used.
   [junit4]   2> 2156766 INFO  (explicit-fetchindex-cmd) [    x:collection1] o.a.s.h.IndexFetcher Starting download (fullCopy=false) to MockDirectoryWrapper(RAMDirectory@4bfd3a49 lockFactory=org.apache.lucene.store.SingleInstanceLockFactory@7900b206)
   [junit4]   2> 2156767 INFO  (qtp1272903588-23756) [    x:collection1] o.a.s.c.S.Request [collection1]  webapp=/solr path=/replication params={generation=2&qt=/replication&file=_0.si&checksum=true&wt=filestream&command=filecontent} status=0 QTime=0
   [junit4]   2> 2156770 INFO  (qtp1272903588-23759) [    x:collection1] o.a.s.c.S.Request [collection1]  webapp=/solr path=/replication params={generation=2&qt=/replication&file=_0_FST50_0.doc&checksum=true&wt=filestream&command=filecontent} status=0 QTime=0
   [junit4]   2> 2156772 INFO  (qtp1272903588-23761) [    x:collection1] o.a.s.c.S.Request [collection1]  webapp=/solr path=/replication params={generation=2&qt=/replication&file=_0.nvd&checksum=true&wt=filestream&command=filecontent} status=0 QTime=0
   [junit4]   2> 2156775 INFO  (qtp1272903588-23762) [    x:collection1] o.a.s.c.S.Request [collection1]  webapp=/solr path=/replication params={generation=2&qt=/replication&file=_0.fdx&checksum=true&wt=filestream&command=filecontent} status=0 QTime=0
   [junit4]   2> 2156777 INFO  (qtp1272903588-23757) [    x:collection1] o.a.s.c.S.Request [collection1]  webapp=/solr path=/replication params={generation=2&qt=/replication&file=_0_FST50_0.tfp&checksum=true&wt=filestream&command=filecontent} status=0 QTime=0
   [junit4]   2> 2156779 INFO  (qtp1272903588-23763) [    x:collection1] o.a.s.c.S.Request [collection1]  webapp=/solr path=/replication params={generation=2&qt=/replication&file=_0.fdt&checksum=true&wt=filestream&command=filecontent} status=0 QTime=0
   [junit4]   2> 2156781 INFO  (qtp1272903588-23756) [    x:collection1] o.a.s.c.S.Request [collection1]  webapp=/solr path=/replication params={generation=2&qt=/replication&file=_0.fnm&checksum=true&wt=filestream&command=filecontent} status=0 QTime=0
   [junit4]   2> 2156784 INFO  (qtp1272903588-23756) [    x:collection1] o.a.s.c.S.Request [collection1]  webapp=/solr path=/replication params={generation=2&qt=/replication&file=_0.nvm&checksum=true&wt=filestream&command=filecontent} status=0 QTime=0
   [junit4]   2> 2156786 INFO  (qtp1272903588-23761) [    x:collection1] o.a.s.c.S.Request [collection1]  webapp=/solr path=/replication params={generation=2&qt=/replication&file=segments_2&checksum=true&wt=filestream&command=filecontent} status=0 QTime=0
   [junit4]   2> 2156787 INFO  (explicit-fetchindex-cmd) [    x:collection1] o.a.s.h.IndexFetcher Total time taken for download (fullCopy=false,bytesDownloaded=1501) : 0 secs (null bytes/sec) to MockDirectoryWrapper(RAMDirectory@4bfd3a49 lockFactory=org.apache.lucene.store.SingleInstanceLockFactory@7900b206)
   [junit4]   2> 2156788 INFO  (explicit-fetchindex-cmd) [    x:collection1] o.a.s.u.RandomMergePolicy RandomMergePolicy wrapping class org.apache.lucene.index.TieredMergePolicy: [TieredMergePolicy: maxMergeAtOnce=36, maxMergeAtOnceExplicit=35, maxMergedSegmentMB=0.8701171875, floorSegmentMB=1.4775390625, forceMergeDeletesPctAllowed=10.802995612434938, segmentsPerTier=36.0, maxCFSSegmentSizeMB=8.796093022207999E12, noCFSRatio=0.4506024650409598
   [junit4]   2> 2156790 INFO  (explicit-fetchindex-cmd) [    x:collection1] o.a.s.u.DefaultSolrCoreState New IndexWriter is ready to be used.
   [junit4]   2> 2156790 INFO  (explicit-fetchindex-cmd) [    x:collection1] o.a.s.s.SolrIndexSearcher Opening [Searcher@67e368e8[collection1] main]
   [junit4]   2> 2156790 INFO  (searcherExecutor-4363-thread-1-processing-x:collection1) [    x:collection1] o.a.s.c.SolrCore [collection1] Registered new searcher Searcher@67e368e8[collection1] main{ExitableDirectoryReader(UninvertingDirectoryReader(Uninverting(_0(6.4.0):C3)))}
   [junit4]   2> 2156791 INFO  (qtp221920995-23742) [    x:collection1] o.a.s.c.S.Request [collection1]  webapp=/solr path=/replication params={wait=true&masterUrl=http://127.0.0.1:58206/solr/collection1/replication&command=fetchindex} status=0 QTime=33
   [junit4]   2> 2156792 INFO  (qtp221920995-23743) [    x:collection1] o.a.s.c.S.Request [collection1]  webapp=/solr path=/select params={q=*:*&sort=id+desc&wt=javabin&version=2} hits=3 status=0 QTime=0
   [junit4]   2> 2156793 INFO  (TEST-TestReplicationHandler.doTestRepeater-seed#[564FB800CB832D4C]) [    ] o.a.s.h.TestReplicationHandler Waited for 0ms and found 3 docs
   [junit4]   2> 2156795 INFO  (qtp1896429911-23705) [    x:collection1] o.a.s.c.S.Request [collection1]  webapp=/solr path=/replication params={_trace=getDetails&qt=/replication&wt=javabin&version=2&command=details} status=0 QTime=0
   [junit4]   2> 2156797 INFO  (qtp1896429911-23702) [    x:collection1] o.a.s.c.S.Request [collection1]  webapp=/solr path=/replication params={_trace=getDetails&qt=/replication&wt=javabin&version=2&command=details} status=0 QTime=0
   [junit4]   2> 2156800 WARN  (qtp1272903588-23762) [    x:collection1] o.a.s.h.ReplicationHandler Exception while invoking 'details' method for replication on master 
   [junit4]   2> org.apache.solr.client.solrj.SolrServerException: Server refused connection at: http://127.0.0.1:TEST_PORT/solr
   [junit4]   2> 	at org.apache.solr.client.solrj.impl.HttpSolrClient.executeMethod(HttpSolrClient.java:600)
   [junit4]   2> 	at org.apache.solr.client.solrj.impl.HttpSolrClient.request(HttpSolrClient.java:262)
   [junit4]   2> 	at org.apache.solr.client.solrj.impl.HttpSolrClient.request(HttpSolrClient.java:251)
   [junit4]   2> 	at org.apache.solr.client.solrj.SolrClient.request(SolrClient.java:1219)
   [junit4]   2> 	at org.apache.solr.handler.IndexFetcher.getDetails(IndexFetcher.java:1713)
   [junit4]   2> 	at org.apache.solr.handler.ReplicationHandler.getReplicationDetails(ReplicationHandler.java:931)
   [junit4]   2> 	at org.apache.solr.handler.ReplicationHandler.handleRequestBody(ReplicationHandler.java:312)
   [junit4]   2> 	at org.apache.solr.handler.RequestHandlerBase.handleRequest(RequestHandlerBase.java:152)
   [junit4]   2> 	at org.apache.solr.core.SolrCore.execute(SolrCore.java:2209)
   [junit4]   2> 	at org.apache.solr.servlet.HttpSolrCall.execute(HttpSolrCall.java:658)
   [junit4]   2> 	at org.apache.solr.servlet.HttpSolrCall.call(HttpSolrCall.java:464)
   [junit4]   2> 	at org.apache.solr.servlet.SolrDispatchFilter.doFilter(SolrDispatchFilter.java:318)
   [junit4]   2> 	at org.apache.solr.servlet.SolrDispatchFilter.doFilter(SolrDispatchFilter.java:269)
   [junit4]   2> 	at org.eclipse.jetty.servlet.ServletHandler$CachedChain.doFilter(ServletHandler.java:1699)
   [junit4]   2> 	at org.apache.solr.client.solrj.embedded.JettySolrRunner$DebugFilter.doFilter(JettySolrRunner.java:110)
   [junit4]   2> 	at org.eclipse.jetty.servlet.ServletHandler$CachedChain.doFilter(ServletHandler.java:1699)
   [junit4]   2> 	at org.eclipse.jetty.servlet.ServletHandler.doHandle(ServletHandler.java:582)
   [junit4]   2> 	at org.eclipse.jetty.server.session.SessionHandler.doHandle(SessionHandler.java:224)
   [junit4]   2> 	at org.eclipse.jetty.server.handler.ContextHandler.doHandle(ContextHandler.java:1180)
   [junit4]   2> 	at org.eclipse.jetty.servlet.ServletHandler.doScope(ServletHandler.java:512)
   [junit4]   2> 	at org.eclipse.jetty.server.session.SessionHandler.doScope(SessionHandler.java:185)
   [junit4]   2> 	at org.eclipse.jetty.server.handler.ContextHandler.doScope(ContextHandler.java:1112)
   [junit4]   2> 	at org.eclipse.jetty.server.handler.ScopedHandler.handle(ScopedHandler.java:141)
   [junit4]   2> 	at org.eclipse.jetty.server.handler.gzip.GzipHandler.handle(GzipHandler.java:462)
   [junit4]   2> 	at org.eclipse.jetty.server.handler.HandlerWrapper.handle(HandlerWrapper.java:134)
   [junit4]   2> 	at org.eclipse.jetty.server.Server.handle(Server.java:534)
   [junit4]   2> 	at org.eclipse.jetty.server.HttpChannel.handle(HttpChannel.java:320)
   [junit4]   2> 	at org.eclipse.jetty.server.HttpConnection.onFillable(HttpConnection.java:251)
   [junit4]   2> 	at org.eclipse.jetty.io.AbstractConnection$ReadCallback.succeeded(AbstractConnection.java:273)
   [junit4]   2> 	at org.eclipse.jetty.io.FillInterest.fillable(FillInterest.java:95)
   [junit4]   2> 	at org.eclipse.jetty.io.SelectChannelEndPoint$2.run(SelectChannelEndPoint.java:93)
   [junit4]   2> 	at org.eclipse.jetty.util.thread.strategy.ExecuteProduceConsume.executeProduceConsume(ExecuteProduceConsume.java:303)
   [junit4]   2> 	at org.eclipse.jetty.util.thread.strategy.ExecuteProduceConsume.produceConsume(ExecuteProduceConsume.java:148)
   [junit4]   2> 	at org.eclipse.jetty.util.thread.strategy.ExecuteProduceConsume.run(ExecuteProduceConsume.java:136)
   [junit4]   2> 	at org.eclipse.jetty.util.thread.QueuedThreadPool.runJob(QueuedThreadPool.java:671)
   [junit4]   2> 	at org.eclipse.jetty.util.thread.QueuedThreadPool$2.run(QueuedThreadPool.java:589)
   [junit4]   2> 	at java.lang.Thread.run(Thread.java:745)
   [junit4]   2> Caused by: java.net.ConnectException: Connection refused
   [junit4]   2> 	at java.net.PlainSocketImpl.socketConnect(Native Method)
   [junit4]   2> 	at java.net.AbstractPlainSocketImpl.doConnect(AbstractPlainSocketImpl.java:350)
   [junit4]   2> 	at java.net.AbstractPlainSocketImpl.connectToAddress(AbstractPlainSocketImpl.java:206)
   [junit4]   2> 	at java.net.AbstractPlainSocketImpl.connect(AbstractPlainSocketImpl.java:188)
   [junit4]   2> 	at java.net.SocksSocketImpl.connect(SocksSocketImpl.java:392)
   [junit4]   2> 	at java.net.Socket.connect(Socket.java:589)
   [junit4]   2> 	at org.apache.http.conn.scheme.PlainSocketFactory.connectSocket(PlainSocketFactory.java:117)
   [junit4]   2> 	at org.apache.http.impl.conn.DefaultClientConnectionOperator.openConnection(DefaultClientConnectionOperator.java:177)
   [junit4]   2> 	at org.apache.http.impl.conn.ManagedClientConnectionImpl.open(ManagedClientConnectionImpl.java:304)
   [junit4]   2> 	at org.apache.http.impl.client.DefaultRequestDirector.tryConnect(DefaultRequestDirector.java:611)
   [junit4]   2> 	at org.apache.http.impl.client.DefaultRequestDirector.execute(DefaultRequestDirector.java:446)
   [junit4]   2> 	at org.apache.http.impl.client.AbstractHttpClient.doExecute(AbstractHttpClient.java:882)
   [junit4]   2> 	at org.apache.http.impl.client.CloseableHttpClient.execute(CloseableHttpClient.java:82)
   [junit4]   2> 	at org.apache.http.impl.client.CloseableHttpClient.execute(CloseableHttpClient.java:55)
   [junit4]   2> 	at org.apache.solr.client.solrj.impl.HttpSolrClient.executeMethod(HttpSolrClient.java:498)
   [junit4]   2> 	... 36 more
   [junit4]   2> 2156801 INFO  (qtp1272903588-23762) [    x:collection1] o.a.s.c.S.Request [collection1]  webapp=/solr path=/replication params={_trace=getDetails&qt=/replication&wt=javabin&version=2&command=details} status=0 QTime=3
   [junit4]   2> 2156803 INFO  (qtp1896429911-23707) [    x:collection1] o.a.s.c.S.Request [collection1]  webapp=/solr path=/replication params={_trace=assertVersions&qt=/replication&wt=javabin&version=2&command=indexversion} status=0 QTime=0
   [junit4]   2> 2156804 INFO  (qtp1272903588-23757) [    x:collection1] o.a.s.c.S.Request [collection1]  webapp=/solr path=/replication params={_trace=assertVersions&qt=/replication&wt=javabin&version=2&command=indexversion} status=0 QTime=0
   [junit4]   2> 2156807 WARN  (qtp1272903588-23763) [    x:collection1] o.a.s.h.ReplicationHandler Exception while invoking 'details' method for replication on master 
   [junit4]   2> org.apache.solr.client.solrj.SolrServerException: Server refused connection at: http://127.0.0.1:TEST_PORT/solr
   [junit4]   2> 	at org.apache.solr.client.solrj.impl.HttpSolrClient.executeMethod(HttpSolrClient.java:600)
   [junit4]   2> 	at org.apache.solr.client.solrj.impl.HttpSolrClient.request(HttpSolrClient.java:262)
   [junit4]   2> 	at org.apache.solr.client.solrj.impl.HttpSolrClient.request(HttpSolrClient.java:251)
   [junit4]   2> 	at org.apache.solr.client.solrj.SolrClient.request(SolrClient.java:1219)
   [junit4]   2> 	at org.apache.solr.handler.IndexFetcher.getDetails(IndexFetcher.java:1713)
   [junit4]   2> 	at org.apache.solr.handler.ReplicationHandler.getReplicationDetails(ReplicationHandler.java:931)
   [junit4]   2> 	at org.apache.solr.handler.ReplicationHandler.handleRequestBody(ReplicationHandler.java:312)
   [junit4]   2> 	at org.apache.solr.handler.RequestHandlerBase.handleRequest(RequestHandlerBase.java:152)
   [junit4]   2> 	at org.apache.solr.core.SolrCore.execute(SolrCore.java:2209)
   [junit4]   2> 	at org.apache.solr.servlet.HttpSolrCall.execute(HttpSolrCall.java:658)
   [junit4]   2> 	at org.apache.solr.servlet.HttpSolrCall.call(HttpSolrCall.java:464)
   [junit4]   2> 	at org.apache.solr.servlet.SolrDispatchFilter.doFilter(SolrDispatchFilter.java:318)
   [junit4]   2> 	at org.apache.solr.servlet.SolrDispatchFilter.doFilter(SolrDispatchFilter.java:269)
   [junit4]   2> 	at org.eclipse.jetty.servlet.ServletHandler$CachedChain.doFilter(ServletHandler.java:1699)
   [junit4]   2> 	at org.apache.solr.client.solrj.embedded.JettySolrRunner$DebugFilter.doFilter(JettySolrRunner.java:110)
   [junit4]   2> 	at org.eclipse.jetty.servlet.ServletHandler$CachedChain.doFilter(ServletHandler.java:1699)
   [junit4]   2> 	at org.eclipse.jetty.servlet.ServletHandler.doHandle(ServletHandler.java:582)
   [junit4]   2> 	at org.eclipse.jetty.server.session.SessionHandler.doHandle(SessionHandler.java:224)
   [junit4]   2> 	at org.eclipse.jetty.server.handler.ContextHandler.doHandle(ContextHandler.java:1180)
   [junit4]   2> 	at org.eclipse.jetty.servlet.ServletHandler.doScope(ServletHandler.java:512)
   [junit4]   2> 	at org.eclipse.jetty.server.session.SessionHandler.doScope(SessionHandler.java:185)
   [junit4]   2> 	at org.eclipse.jetty.server.handler.ContextHandler.doScope(ContextHandler.java:1112)
   [junit4]   2> 	at org.eclipse.jetty.server.handler.ScopedHandler.handle(ScopedHandler.java:141)
   [junit4]   2> 	at org.eclipse.jetty.server.handler.gzip.GzipHandler.handle(GzipHandler.java:462)
   [junit4]   2> 	at org.eclipse.jetty.server.handler.HandlerWrapper.handle(HandlerWrapper.java:134)
   [junit4]   2> 	at org.eclipse.jetty.server.Server.handle(Server.java:534)
   [junit4]   2> 	at org.eclipse.jetty.server.HttpChannel.handle(HttpChannel.java:320)
   [junit4]   2> 	at org.eclipse.jetty.server.HttpConnection.onFillable(HttpConnection.java:251)
   [junit4]   2> 	at org.eclipse.jetty.io.AbstractConnection$ReadCallback.succeeded(AbstractConnection.java:273)
   [junit4]   2> 	at org.eclipse.jetty.io.FillInterest.fillable(FillInterest.java:95)
   [junit4]   2> 	at org.eclipse.jetty.io.SelectChannelEndPoint$2.run(SelectChannelEndPoint.java:93)
   [junit4]   2> 	at org.eclipse.jetty.util.thread.strategy.ExecuteProduceConsume.executeProduceConsume(ExecuteProduceConsume.java:303)
   [junit4]   2> 	at org.eclipse.jetty.util.thread.strategy.ExecuteProduceConsume.produceConsume(ExecuteProduceConsume.java:148)
   [junit4]   2> 	at org.eclipse.jetty.util.thread.strategy.ExecuteProduceConsume.run(ExecuteProduceConsume.java:136)
   [junit4]   2> 	at org.eclipse.jetty.util.thread.QueuedThreadPool.runJob(QueuedThreadPool.java:671)
   [junit4]   2> 	at org.eclipse.jetty.util.thread.QueuedThreadPool$2.run(QueuedThreadPool.java:589)
   [junit4]   2> 	at java.lang.Thread.run(Thread.java:745)
   [junit4]   2> Caused by: java.net.ConnectException: Connection refused
   [junit4]   2> 	at java.net.PlainSocketImpl.socketConnect(Native Method)
   [junit4]   2> 	at java.net.AbstractPlainSocketImpl.doConnect(AbstractPlainSocketImpl.java:350)
   [junit4]   2> 	at java.net.AbstractPlainSocketImpl.connectToAddress(AbstractPlainSocketImpl.java:206)
   [junit4]   2> 	at java.net.AbstractPlainSocketImpl.connect(AbstractPlainSocketImpl.java:188)
   [junit4]   2> 	at java.net.SocksSocketImpl.connect(SocksSocketImpl.java:392)
   [junit4]   2> 	at java.net.Socket.connect(Socket.java:589)
   [junit4]   2> 	at org.apache.http.conn.scheme.PlainSocketFactory.connectSocket(PlainSocketFactory.java:117)
   [junit4]   2> 	at org.apache.http.impl.conn.DefaultClientConnectionOperator.openConnection(DefaultClientConnectionOperator.java:177)
   [junit4]   2> 	at org.apache.http.impl.conn.ManagedClientConnectionImpl.open(ManagedClientConnectionImpl.java:304)
   [junit4]   2> 	at org.apache.http.impl.client.DefaultRequestDirector.tryConnect(DefaultRequestDirector.java:611)
   [junit4]   2> 	at org.apache.http.impl.client.DefaultRequestDirector.execute(DefaultRequestDirector.java:446)
   [junit4]   2> 	at org.apache.http.impl.client.AbstractHttpClient.doExecute(AbstractHttpClient.java:882)
   [junit4]   2> 	at org.apache.http.impl.client.CloseableHttpClient.execute(CloseableHttpClient.java:82)
   [junit4]   2> 	at org.apache.http.impl.client.CloseableHttpClient.execute(CloseableHttpClient.java:55)
   [junit4]   2> 	at org.apache.solr.client.solrj.impl.HttpSolrClient.executeMethod(HttpSolrClient.java:498)
   [junit4]   2> 	... 36 more
   [junit4]   2> 2156808 INFO  (qtp1272903588-23763) [    x:collection1] o.a.s.c.S.Request [collection1]  webapp=/solr path=/replication params={_trace=getDetails&qt=/replication&wt=javabin&version=2&command=details} status=0 QTime=1
   [junit4]   2> 2156810 WARN  (qtp1272903588-23759) [    x:collection1] o.a.s.h.ReplicationHandler Exception while invoking 'details' method for replication on master 
   [junit4]   2> org.apache.solr.client.solrj.SolrServerException: Server refused connection at: http://127.0.0.1:TEST_PORT/solr
   [junit4]   2> 	at org.apache.solr.client.solrj.impl.HttpSolrClient.executeMethod(HttpSolrClient.java:600)
   [junit4]   2> 	at org.apache.solr.client.solrj.impl.HttpSolrClient.request(HttpSolrClient.java:262)
   [junit4]   2> 	at org.apache.solr.client.solrj.impl.HttpSolrClient.request(HttpSolrClient.java:251)
   [junit4]   2> 	at org.apache.solr.client.solrj.SolrClient.request(SolrClient.java:1219)
   [junit4]   2> 	at org.apache.solr.handler.IndexFetcher.getDetails(IndexFetcher.java:1713)
   [junit4]   2> 	at org.apache.solr.handler.ReplicationHandler.getReplicationDetails(ReplicationHandler.java:931)
   [junit4]   2> 	at org.apache.solr.handler.ReplicationHandler.handleRequestBody(ReplicationHandler.java:312)
   [junit4]   2> 	at org.apache.solr.handler.RequestHandlerBase.handleRequest(RequestHandlerBase.java:152)
   [junit4]   2> 	at org.apache.solr.core.SolrCore.execute(SolrCore.java:2209)
   [junit4]   2> 	at org.apache.solr.servlet.HttpSolrCall.execute(HttpSolrCall.java:658)
   [junit4]   2> 	at org.apache.solr.servlet.HttpSolrCall.call(HttpSolrCall.java:464)
   [junit4]   2> 	at org.apache.solr.servlet.SolrDispatchFilter.doFilter(SolrDispatchFilter.java:318)
   [junit4]   2> 	at org.apache.solr.servlet.SolrDispatchFilter.doFilter(SolrDispatchFilter.java:269)
   [junit4]   2> 	at org.eclipse.jetty.servlet.ServletHandler$CachedChain.doFilter(ServletHandler.java:1699)
   [junit4]   2> 	at org.apache.solr.client.solrj.embedded.JettySolrRunner$DebugFilter.doFilter(JettySolrRunner.java:110)
   [junit4]   2> 	at org.eclipse.jetty.servlet.ServletHandler$CachedChain.doFilter(ServletHandler.java:1699)
   [junit4]   2> 	at org.eclipse.jetty.servlet.ServletHandler.doHandle(ServletHandler.java:582)
   [junit4]   2> 	at org.eclipse.jetty.server.session.SessionHandler.doHandle(SessionHandler.java:224)
   [junit4]   2> 	at org.eclipse.jetty.server.handler.ContextHandler.doHandle(ContextHandler.java:1180)
   [junit4]   2> 	at org.eclipse.jetty.servlet.ServletHandler.doScope(ServletHandler.java:512)
   [junit4]   2> 	at org.eclipse.jetty.server.session.SessionHandler.doScope(SessionHandler.java:185)
   [junit4]   2> 	at org.eclipse.jetty

[...truncated too long message...]

at org.apache.hadoop.metrics2.util.MBeans.unregister(MBeans.java:81)
   [junit4]   2> 	at org.apache.hadoop.metrics2.impl.MetricsSourceAdapter.stopMBeans(MetricsSourceAdapter.java:226)
   [junit4]   2> 	at org.apache.hadoop.metrics2.impl.MetricsSourceAdapter.stop(MetricsSourceAdapter.java:211)
   [junit4]   2> 	at org.apache.hadoop.metrics2.impl.MetricsSystemImpl.stopSources(MetricsSystemImpl.java:463)
   [junit4]   2> 	at org.apache.hadoop.metrics2.impl.MetricsSystemImpl.stop(MetricsSystemImpl.java:213)
   [junit4]   2> 	at org.apache.hadoop.metrics2.impl.MetricsSystemImpl.shutdown(MetricsSystemImpl.java:594)
   [junit4]   2> 	at org.apache.hadoop.metrics2.lib.DefaultMetricsSystem.shutdownInstance(DefaultMetricsSystem.java:72)
   [junit4]   2> 	at org.apache.hadoop.metrics2.lib.DefaultMetricsSystem.shutdown(DefaultMetricsSystem.java:68)
   [junit4]   2> 	at org.apache.hadoop.hdfs.server.namenode.metrics.NameNodeMetrics.shutdown(NameNodeMetrics.java:171)
   [junit4]   2> 	at org.apache.hadoop.hdfs.server.namenode.NameNode.stop(NameNode.java:872)
   [junit4]   2> 	at org.apache.hadoop.hdfs.MiniDFSCluster.shutdown(MiniDFSCluster.java:1726)
   [junit4]   2> 	at org.apache.hadoop.hdfs.MiniDFSCluster.shutdown(MiniDFSCluster.java:1705)
   [junit4]   2> 	at org.apache.solr.cloud.hdfs.HdfsTestUtil.teardownClass(HdfsTestUtil.java:198)
   [junit4]   2> 	at org.apache.solr.cloud.hdfs.StressHdfsTest.teardownClass(StressHdfsTest.java:77)
   [junit4]   2> 	at sun.reflect.NativeMethodAccessorImpl.invoke0(Native Method)
   [junit4]   2> 	at sun.reflect.NativeMethodAccessorImpl.invoke(NativeMethodAccessorImpl.java:62)
   [junit4]   2> 	at sun.reflect.DelegatingMethodAccessorImpl.invoke(DelegatingMethodAccessorImpl.java:43)
   [junit4]   2> 	at java.lang.reflect.Method.invoke(Method.java:498)
   [junit4]   2> 	at com.carrotsearch.randomizedtesting.RandomizedRunner.invoke(RandomizedRunner.java:1713)
   [junit4]   2> 	at com.carrotsearch.randomizedtesting.RandomizedRunner$7.evaluate(RandomizedRunner.java:870)
   [junit4]   2> 	at com.carrotsearch.randomizedtesting.rules.StatementAdapter.evaluate(StatementAdapter.java:36)
   [junit4]   2> 	at com.carrotsearch.randomizedtesting.rules.SystemPropertiesRestoreRule$1.evaluate(SystemPropertiesRestoreRule.java:57)
   [junit4]   2> 	at org.apache.lucene.util.AbstractBeforeAfterRule$1.evaluate(AbstractBeforeAfterRule.java:45)
   [junit4]   2> 	at com.carrotsearch.randomizedtesting.rules.StatementAdapter.evaluate(StatementAdapter.java:36)
   [junit4]   2> 	at org.apache.lucene.util.TestRuleStoreClassName$1.evaluate(TestRuleStoreClassName.java:41)
   [junit4]   2> 	at com.carrotsearch.randomizedtesting.rules.NoShadowingOrOverridesOnMethodsRule$1.evaluate(NoShadowingOrOverridesOnMethodsRule.java:40)
   [junit4]   2> 	at com.carrotsearch.randomizedtesting.rules.NoShadowingOrOverridesOnMethodsRule$1.evaluate(NoShadowingOrOverridesOnMethodsRule.java:40)
   [junit4]   2> 	at com.carrotsearch.randomizedtesting.rules.StatementAdapter.evaluate(StatementAdapter.java:36)
   [junit4]   2> 	at com.carrotsearch.randomizedtesting.rules.StatementAdapter.evaluate(StatementAdapter.java:36)
   [junit4]   2> 	at com.carrotsearch.randomizedtesting.rules.StatementAdapter.evaluate(StatementAdapter.java:36)
   [junit4]   2> 	at org.apache.lucene.util.TestRuleAssertionsRequired$1.evaluate(TestRuleAssertionsRequired.java:53)
   [junit4]   2> 	at org.apache.lucene.util.TestRuleMarkFailure$1.evaluate(TestRuleMarkFailure.java:47)
   [junit4]   2> 	at org.apache.lucene.util.TestRuleIgnoreAfterMaxFailures$1.evaluate(TestRuleIgnoreAfterMaxFailures.java:64)
   [junit4]   2> 	at org.apache.lucene.util.TestRuleIgnoreTestSuites$1.evaluate(TestRuleIgnoreTestSuites.java:54)
   [junit4]   2> 	at com.carrotsearch.randomizedtesting.rules.StatementAdapter.evaluate(StatementAdapter.java:36)
   [junit4]   2> 	at com.carrotsearch.randomizedtesting.ThreadLeakControl$StatementRunner.run(ThreadLeakControl.java:367)
   [junit4]   2> 	at java.lang.Thread.run(Thread.java:745)
   [junit4]   2> Caused by: java.lang.NullPointerException
   [junit4]   2> 	at org.apache.hadoop.hdfs.server.blockmanagement.BlocksMap.size(BlocksMap.java:203)
   [junit4]   2> 	at org.apache.hadoop.hdfs.server.blockmanagement.BlockManager.getTotalBlocks(BlockManager.java:3370)
   [junit4]   2> 	at org.apache.hadoop.hdfs.server.namenode.FSNamesystem.getBlocksTotal(FSNamesystem.java:5729)
   [junit4]   2> 	... 54 more
   [junit4]   2> 4885146 INFO  (SUITE-StressHdfsTest-seed#[564FB800CB832D4C]-worker) [    ] o.a.s.SolrTestCaseJ4 ###deleteCore
   [junit4]   2> NOTE: leaving temporary files on disk at: /x1/jenkins/jenkins-slave/workspace/Lucene-Solr-NightlyTests-6.x/checkout/solr/build/solr-core/test/J2/temp/solr.cloud.hdfs.StressHdfsTest_564FB800CB832D4C-001
   [junit4]   2> Dec 16, 2016 8:01:31 PM com.carrotsearch.randomizedtesting.ThreadLeakControl checkThreadLeaks
   [junit4]   2> WARNING: Will linger awaiting termination of 35 leaked thread(s).
   [junit4]   2> NOTE: test params are: codec=CheapBastard, sim=RandomSimilarity(queryNorm=true,coord=no): {}, locale=en-ZA, timezone=America/Vancouver
   [junit4]   2> NOTE: Linux 3.13.0-85-generic amd64/Oracle Corporation 1.8.0_102 (64-bit)/cpus=4,threads=2,free=240884864,total=519045120
   [junit4]   2> NOTE: All tests run in this JVM: [SpellPossibilityIteratorTest, TestCustomDocTransformer, TestShortCircuitedRequests, TestPostingsSolrHighlighter, TestIntervalFaceting, TestReloadDeadlock, CollectionsAPISolrJTest, BadCopyFieldTest, TestConfig, FieldAnalysisRequestHandlerTest, AssignTest, TestDFRSimilarityFactory, TestReversedWildcardFilterFactory, CoreAdminHandlerTest, TestJmxMonitoredMap, DistributedFacetPivotSmallTest, TestRestManager, TestBulkSchemaConcurrent, TestGroupingSearch, SolrCloudExampleTest, AtomicUpdatesTest, RemoteQueryErrorTest, TestConfigSets, OverseerTest, TestRebalanceLeaders, LukeRequestHandlerTest, HLLSerializationTest, DocValuesMultiTest, TestDistribIDF, LeaderElectionTest, TestSolrJ, NoCacheHeaderTest, TestXIncludeConfig, PeerSyncWithIndexFingerprintCachingTest, TestMergePolicyConfig, TestSubQueryTransformerDistrib, TestSortByMinMaxFunction, SuggesterWFSTTest, TestCollectionAPI, CurrencyFieldXmlFileTest, TestLFUCache, ManagedSchemaRoundRobinCloudTest, HdfsBasicDistributedZk2Test, TestExtendedDismaxParser, TestCloudSchemaless, TestCloudPseudoReturnFields, CircularListTest, TestUtils, OpenExchangeRatesOrgProviderTest, TestFieldCacheWithThreads, BasicDistributedZk2Test, ConnectionManagerTest, TestAnalyzedSuggestions, TemplateUpdateProcessorTest, TestStressLiveNodes, DirectUpdateHandlerOptimizeTest, SolrCoreCheckLockOnStartupTest, BitVectorTest, UUIDUpdateProcessorFallbackTest, TestSolrConfigHandlerCloud, TestSolrXml, JSONWriterTest, SolrPluginUtilsTest, CdcrBootstrapTest, TestLeaderInitiatedRecoveryThread, DateRangeFieldTest, TestMaxScoreQueryParser, BlockCacheTest, TestCollationField, SuggesterTest, UtilsToolTest, DeleteReplicaTest, ShowFileRequestHandlerTest, TestSolrDeletionPolicy1, OverseerModifyCollectionTest, AnalysisErrorHandlingTest, TestSchemaResource, DeleteInactiveReplicaTest, RequestLoggingTest, TestSolrQueryParser, TestChildDocTransformer, TestFieldCache, TestShardHandlerFactory, TestIndexingPerformance, TestUseDocValuesAsStored, SuggesterTSTTest, TestSolrCloudWithKerberosAlt, PingRequestHandlerTest, TestConfigSetsAPIZkFailure, TestGraphMLResponseWriter, ConjunctionSolrSpellCheckerTest, DirectUpdateHandlerTest, TestDynamicFieldResource, AutoCommitTest, TestJsonFacets, TestRawResponseWriter, BlobRepositoryCloudTest, DistributedQueryComponentOptimizationTest, CoreSorterTest, TestRecovery, TestXmlQParser, LeaderFailoverAfterPartitionTest, UpdateParamsTest, CollectionStateFormat2Test, CdcrRequestHandlerTest, SyncSliceTest, LeaderElectionIntegrationTest, ShardRoutingTest, FullSolrCloudDistribCmdsTest, ZkSolrClientTest, TestZkChroot, ShardRoutingCustomTest, TestDistributedGrouping, TestHashPartitioner, DistributedSpellCheckComponentTest, TermVectorComponentDistributedTest, HardAutoCommitTest, TestCoreContainer, SimpleFacetsTest, StatsComponentTest, TestSort, DistributedQueryElevationComponentTest, SolrIndexSplitterTest, TestCoreDiscovery, AnalysisAfterCoreReloadTest, SignatureUpdateProcessorFactoryTest, SpellCheckCollatorTest, TestStressLucene, TestPseudoReturnFields, StatelessScriptUpdateProcessorFactoryTest, CacheHeaderTest, DisMaxRequestHandlerTest, DirectSolrSpellCheckerTest, DocumentAnalysisRequestHandlerTest, PrimitiveFieldTypeTest, TestOmitPositions, RequestHandlersTest, MoreLikeThisHandlerTest, IndexSchemaRuntimeFieldTest, IndexSchemaTest, UpdateRequestProcessorFactoryTest, QueryParsingTest, BinaryUpdateRequestHandlerTest, TestPHPSerializedResponseWriter, SOLR749Test, TestQuerySenderListener, AlternateDirectoryTest, CopyFieldTest, ResponseLogComponentTest, SolrIndexConfigTest, BadComponentTest, TestSolrDeletionPolicy2, SampleTest, TestDocSet, TestBinaryField, TestSearchPerf, MinimalSchemaTest, ExternalFileFieldSortTest, DirectSolrConnectionTest, TestPhraseSuggestions, EchoParamsTest, TestLMJelinekMercerSimilarityFactory, TestFastWriter, ResourceLoaderTest, ScriptEngineTest, PluginInfoTest, ChaosMonkeyNothingIsSafeTest, CleanupOldIndexTest, CollectionTooManyReplicasTest, ConfigSetsAPITest, DeleteLastCustomShardedReplicaTest, DeleteNodeTest, DeleteStatusTest, DistribCursorPagingTest, DistributedQueueTest, HttpPartitionTest, LeaderInitiatedRecoveryOnCommitTest, LeaderInitiatedRecoveryOnShardRestartTest, RestartWhileUpdatingTest, SaslZkACLProviderTest, ShardSplitTest, SharedFSAutoReplicaFailoverTest, TestCloudRecovery, TestLeaderElectionZkExpiry, TestMiniSolrCloudCluster, TestSizeLimitedDistributedMap, TriLevelCompositeIdRoutingTest, HdfsChaosMonkeySafeLeaderTest, HdfsRecoverLeaseTest, HdfsRecoveryZkTest, HdfsSyncSliceTest, HdfsWriteToMultipleCollectionsTest, StressHdfsTest]
   [junit4] Completed [541/662 (5!)] on J2 in 101.61s, 1 test, 1 failure <<< FAILURES!

[...truncated 62783 lines...]



Mime
View raw message