lucene-dev mailing list archives

Site index · List index
Message view « Date » · « Thread »
Top « Date » · « Thread »
From Policeman Jenkins Server <jenk...@thetaphi.de>
Subject [JENKINS-EA] Lucene-Solr-master-Linux (64bit/jdk-9-ea+147) - Build # 18538 - Unstable!
Date Fri, 16 Dec 2016 00:40:45 GMT
Build: https://jenkins.thetaphi.de/job/Lucene-Solr-master-Linux/18538/
Java: 64bit/jdk-9-ea+147 -XX:-UseCompressedOops -XX:+UseParallelGC

1 tests failed.
FAILED:  org.apache.solr.handler.component.SpellCheckComponentTest.test

Error Message:
List size mismatch @ spellcheck/suggestions

Stack Trace:
java.lang.RuntimeException: List size mismatch @ spellcheck/suggestions
	at __randomizedtesting.SeedInfo.seed([5DDC36407C02487C:D588099AD2FE2584]:0)
	at org.apache.solr.SolrTestCaseJ4.assertJQ(SolrTestCaseJ4.java:906)
	at org.apache.solr.SolrTestCaseJ4.assertJQ(SolrTestCaseJ4.java:853)
	at org.apache.solr.handler.component.SpellCheckComponentTest.test(SpellCheckComponentTest.java:147)
	at java.base/jdk.internal.reflect.NativeMethodAccessorImpl.invoke0(Native Method)
	at java.base/jdk.internal.reflect.NativeMethodAccessorImpl.invoke(NativeMethodAccessorImpl.java:62)
	at java.base/jdk.internal.reflect.DelegatingMethodAccessorImpl.invoke(DelegatingMethodAccessorImpl.java:43)
	at java.base/java.lang.reflect.Method.invoke(Method.java:538)
	at com.carrotsearch.randomizedtesting.RandomizedRunner.invoke(RandomizedRunner.java:1713)
	at com.carrotsearch.randomizedtesting.RandomizedRunner$8.evaluate(RandomizedRunner.java:907)
	at com.carrotsearch.randomizedtesting.RandomizedRunner$9.evaluate(RandomizedRunner.java:943)
	at com.carrotsearch.randomizedtesting.RandomizedRunner$10.evaluate(RandomizedRunner.java:957)
	at com.carrotsearch.randomizedtesting.rules.SystemPropertiesRestoreRule$1.evaluate(SystemPropertiesRestoreRule.java:57)
	at org.apache.lucene.util.TestRuleSetupTeardownChained$1.evaluate(TestRuleSetupTeardownChained.java:49)
	at org.apache.lucene.util.AbstractBeforeAfterRule$1.evaluate(AbstractBeforeAfterRule.java:45)
	at org.apache.lucene.util.TestRuleThreadAndTestName$1.evaluate(TestRuleThreadAndTestName.java:48)
	at org.apache.lucene.util.TestRuleIgnoreAfterMaxFailures$1.evaluate(TestRuleIgnoreAfterMaxFailures.java:64)
	at org.apache.lucene.util.TestRuleMarkFailure$1.evaluate(TestRuleMarkFailure.java:47)
	at com.carrotsearch.randomizedtesting.rules.StatementAdapter.evaluate(StatementAdapter.java:36)
	at com.carrotsearch.randomizedtesting.ThreadLeakControl$StatementRunner.run(ThreadLeakControl.java:367)
	at com.carrotsearch.randomizedtesting.ThreadLeakControl.forkTimeoutingTask(ThreadLeakControl.java:811)
	at com.carrotsearch.randomizedtesting.ThreadLeakControl$3.evaluate(ThreadLeakControl.java:462)
	at com.carrotsearch.randomizedtesting.RandomizedRunner.runSingleTest(RandomizedRunner.java:916)
	at com.carrotsearch.randomizedtesting.RandomizedRunner$5.evaluate(RandomizedRunner.java:802)
	at com.carrotsearch.randomizedtesting.RandomizedRunner$6.evaluate(RandomizedRunner.java:852)
	at com.carrotsearch.randomizedtesting.RandomizedRunner$7.evaluate(RandomizedRunner.java:863)
	at com.carrotsearch.randomizedtesting.rules.StatementAdapter.evaluate(StatementAdapter.java:36)
	at com.carrotsearch.randomizedtesting.rules.SystemPropertiesRestoreRule$1.evaluate(SystemPropertiesRestoreRule.java:57)
	at org.apache.lucene.util.AbstractBeforeAfterRule$1.evaluate(AbstractBeforeAfterRule.java:45)
	at com.carrotsearch.randomizedtesting.rules.StatementAdapter.evaluate(StatementAdapter.java:36)
	at org.apache.lucene.util.TestRuleStoreClassName$1.evaluate(TestRuleStoreClassName.java:41)
	at com.carrotsearch.randomizedtesting.rules.NoShadowingOrOverridesOnMethodsRule$1.evaluate(NoShadowingOrOverridesOnMethodsRule.java:40)
	at com.carrotsearch.randomizedtesting.rules.NoShadowingOrOverridesOnMethodsRule$1.evaluate(NoShadowingOrOverridesOnMethodsRule.java:40)
	at com.carrotsearch.randomizedtesting.rules.StatementAdapter.evaluate(StatementAdapter.java:36)
	at com.carrotsearch.randomizedtesting.rules.StatementAdapter.evaluate(StatementAdapter.java:36)
	at com.carrotsearch.randomizedtesting.rules.StatementAdapter.evaluate(StatementAdapter.java:36)
	at org.apache.lucene.util.TestRuleAssertionsRequired$1.evaluate(TestRuleAssertionsRequired.java:53)
	at org.apache.lucene.util.TestRuleMarkFailure$1.evaluate(TestRuleMarkFailure.java:47)
	at org.apache.lucene.util.TestRuleIgnoreAfterMaxFailures$1.evaluate(TestRuleIgnoreAfterMaxFailures.java:64)
	at org.apache.lucene.util.TestRuleIgnoreTestSuites$1.evaluate(TestRuleIgnoreTestSuites.java:54)
	at com.carrotsearch.randomizedtesting.rules.StatementAdapter.evaluate(StatementAdapter.java:36)
	at com.carrotsearch.randomizedtesting.ThreadLeakControl$StatementRunner.run(ThreadLeakControl.java:367)
	at java.base/java.lang.Thread.run(Thread.java:844)




Build Log:
[...truncated 11776 lines...]
   [junit4] Suite: org.apache.solr.handler.component.SpellCheckComponentTest
   [junit4]   2> Creating dataDir: /home/jenkins/workspace/Lucene-Solr-master-Linux/solr/build/solr-core/test/J1/temp/solr.handler.component.SpellCheckComponentTest_5DDC36407C02487C-001/init-core-data-001
   [junit4]   2> 1118141 INFO  (SUITE-SpellCheckComponentTest-seed#[5DDC36407C02487C]-worker) [    ] o.a.s.SolrTestCaseJ4 Randomized ssl (true) and clientAuth (true) via: @org.apache.solr.util.RandomizeSSL(reason="", ssl=0.0/0.0, value=0.0/0.0, clientAuth=0.0/0.0)
   [junit4]   2> 1118143 INFO  (SUITE-SpellCheckComponentTest-seed#[5DDC36407C02487C]-worker) [    ] o.a.s.SolrTestCaseJ4 ####initCore
   [junit4]   2> 1118143 INFO  (SUITE-SpellCheckComponentTest-seed#[5DDC36407C02487C]-worker) [    ] o.a.s.c.SolrResourceLoader [null] Added 2 libs to classloader, from paths: [/home/jenkins/workspace/Lucene-Solr-master-Linux/solr/core/src/test-files/solr/collection1/lib, /home/jenkins/workspace/Lucene-Solr-master-Linux/solr/core/src/test-files/solr/collection1/lib/classes]
   [junit4]   2> 1118192 WARN  (SUITE-SpellCheckComponentTest-seed#[5DDC36407C02487C]-worker) [    ] o.a.s.c.Config Beginning with Solr 5.5, <mergePolicy> is deprecated, use <mergePolicyFactory> instead.
   [junit4]   2> 1118192 INFO  (SUITE-SpellCheckComponentTest-seed#[5DDC36407C02487C]-worker) [    ] o.a.s.c.SolrConfig Using Lucene MatchVersion: 7.0.0
   [junit4]   2> 1118213 INFO  (SUITE-SpellCheckComponentTest-seed#[5DDC36407C02487C]-worker) [    ] o.a.s.s.IndexSchema [null] Schema name=test
   [junit4]   2> 1118304 WARN  (SUITE-SpellCheckComponentTest-seed#[5DDC36407C02487C]-worker) [    ] o.a.s.s.IndexSchema [null] default search field in schema is text. WARNING: Deprecated, please use 'df' on request instead.
   [junit4]   2> 1118307 INFO  (SUITE-SpellCheckComponentTest-seed#[5DDC36407C02487C]-worker) [    ] o.a.s.s.IndexSchema Loaded schema test/1.0 with uniqueid field id
   [junit4]   2> 1118323 INFO  (coreLoadExecutor-4752-thread-1) [    ] o.a.s.c.SolrResourceLoader [null] Added 2 libs to classloader, from paths: [/home/jenkins/workspace/Lucene-Solr-master-Linux/solr/core/src/test-files/solr/collection1/lib, /home/jenkins/workspace/Lucene-Solr-master-Linux/solr/core/src/test-files/solr/collection1/lib/classes]
   [junit4]   2> 1118367 WARN  (coreLoadExecutor-4752-thread-1) [    ] o.a.s.c.Config Beginning with Solr 5.5, <mergePolicy> is deprecated, use <mergePolicyFactory> instead.
   [junit4]   2> 1118368 INFO  (coreLoadExecutor-4752-thread-1) [    ] o.a.s.c.SolrConfig Using Lucene MatchVersion: 7.0.0
   [junit4]   2> 1118380 INFO  (coreLoadExecutor-4752-thread-1) [    ] o.a.s.s.IndexSchema [collection1] Schema name=test
   [junit4]   2> 1118468 WARN  (coreLoadExecutor-4752-thread-1) [    ] o.a.s.s.IndexSchema [collection1] default search field in schema is text. WARNING: Deprecated, please use 'df' on request instead.
   [junit4]   2> 1118470 INFO  (coreLoadExecutor-4752-thread-1) [    ] o.a.s.s.IndexSchema Loaded schema test/1.0 with uniqueid field id
   [junit4]   2> 1118483 INFO  (coreLoadExecutor-4752-thread-1) [    ] o.a.s.c.CoreContainer Creating SolrCore 'collection1' using configuration from instancedir /home/jenkins/workspace/Lucene-Solr-master-Linux/solr/core/src/test-files/solr/collection1
   [junit4]   2> 1118484 INFO  (coreLoadExecutor-4752-thread-1) [    ] o.a.s.c.SolrCore [[collection1] ] Opening new SolrCore at [/home/jenkins/workspace/Lucene-Solr-master-Linux/solr/core/src/test-files/solr/collection1], dataDir=[/home/jenkins/workspace/Lucene-Solr-master-Linux/solr/build/solr-core/test/J1/temp/solr.handler.component.SpellCheckComponentTest_5DDC36407C02487C-001/init-core-data-001/]
   [junit4]   2> 1118484 INFO  (coreLoadExecutor-4752-thread-1) [    ] o.a.s.u.RandomMergePolicy RandomMergePolicy wrapping class org.apache.lucene.index.LogDocMergePolicy: [LogDocMergePolicy: minMergeSize=1000, mergeFactor=43, maxMergeSize=9223372036854775807, maxMergeSizeForForcedMerge=9223372036854775807, calibrateSizeByDeletes=false, maxMergeDocs=2147483647, maxCFSSegmentSizeMB=8.796093022207999E12, noCFSRatio=0.10352240568181062]
   [junit4]   2> 1118488 INFO  (coreLoadExecutor-4752-thread-1) [    ] o.a.s.u.CommitTracker Hard AutoCommit: disabled
   [junit4]   2> 1118488 INFO  (coreLoadExecutor-4752-thread-1) [    ] o.a.s.u.CommitTracker Soft AutoCommit: disabled
   [junit4]   2> 1118488 INFO  (coreLoadExecutor-4752-thread-1) [    ] o.a.s.u.RandomMergePolicy RandomMergePolicy wrapping class org.apache.lucene.index.LogDocMergePolicy: [LogDocMergePolicy: minMergeSize=1000, mergeFactor=27, maxMergeSize=9223372036854775807, maxMergeSizeForForcedMerge=9223372036854775807, calibrateSizeByDeletes=true, maxMergeDocs=2147483647, maxCFSSegmentSizeMB=8.796093022207999E12, noCFSRatio=0.0]
   [junit4]   2> 1118489 INFO  (coreLoadExecutor-4752-thread-1) [    ] o.a.s.s.SolrIndexSearcher Opening [Searcher@1c203dac[collection1] main]
   [junit4]   2> 1118489 WARN  (coreLoadExecutor-4752-thread-1) [    ] o.a.s.r.ManagedResourceStorage Cannot write to config directory /home/jenkins/workspace/Lucene-Solr-master-Linux/solr/core/src/test-files/solr/collection1/conf; switching to use InMemory storage instead.
   [junit4]   2> 1118489 INFO  (coreLoadExecutor-4752-thread-1) [    ] o.a.s.h.c.SpellCheckComponent Initializing spell checkers
   [junit4]   2> 1118527 INFO  (coreLoadExecutor-4752-thread-1) [    ] o.a.s.h.c.SpellCheckComponent Registering newSearcher listener for spellchecker: default
   [junit4]   2> 1118552 INFO  (coreLoadExecutor-4752-thread-1) [    ] o.a.s.h.c.SpellCheckComponent Registering newSearcher listener for spellchecker: default_teststop
   [junit4]   2> 1118552 INFO  (coreLoadExecutor-4752-thread-1) [    ] o.a.s.s.DirectSolrSpellChecker init: {name=direct,classname=solr.DirectSolrSpellChecker,minQueryLength=3,maxQueryFrequency=100.0,field=teststop}
   [junit4]   2> 1118552 INFO  (coreLoadExecutor-4752-thread-1) [    ] o.a.s.s.DirectSolrSpellChecker init: {name=direct_lowerfilt,classname=solr.DirectSolrSpellChecker,minQueryLength=3,maxQueryFrequency=100.0,field=lowerfilt}
   [junit4]   2> 1118596 INFO  (coreLoadExecutor-4752-thread-1) [    ] o.a.s.h.c.SpellCheckComponent Registering newSearcher listener for spellchecker: threshold
   [junit4]   2> 1118596 INFO  (coreLoadExecutor-4752-thread-1) [    ] o.a.s.s.DirectSolrSpellChecker init: {name=threshold_direct,classname=solr.DirectSolrSpellChecker,field=lowerfilt,spellcheckIndexDir=spellcheckerThreshold,buildOnCommit=true,thresholdTokenFrequency=0.29}
   [junit4]   2> 1118596 INFO  (coreLoadExecutor-4752-thread-1) [    ] o.a.s.h.c.SpellCheckComponent Registering newSearcher listener for spellchecker: threshold_direct
   [junit4]   2> 1118640 INFO  (coreLoadExecutor-4752-thread-1) [    ] o.a.s.h.c.SpellCheckComponent Registering newSearcher listener for spellchecker: multipleFields
   [junit4]   2> 1118795 INFO  (coreLoadExecutor-4752-thread-1) [    ] o.a.s.h.c.SpellCheckComponent Registering newSearcher listener for spellchecker: freq
   [junit4]   2> 1118850 INFO  (coreLoadExecutor-4752-thread-1) [    ] o.a.s.h.c.SpellCheckComponent Registering newSearcher listener for spellchecker: fqcn
   [junit4]   2> 1118851 INFO  (coreLoadExecutor-4752-thread-1) [    ] o.a.s.h.ReplicationHandler Commits will be reserved for  10000
   [junit4]   2> 1118851 INFO  (searcherExecutor-4753-thread-1) [    ] o.a.s.h.c.SpellCheckComponent Loading spell index for spellchecker: default
   [junit4]   2> 1118852 INFO  (SUITE-SpellCheckComponentTest-seed#[5DDC36407C02487C]-worker) [    ] o.a.s.SolrTestCaseJ4 ####initCore end
   [junit4]   2> 1118852 INFO  (searcherExecutor-4753-thread-1) [    ] o.a.s.h.c.SpellCheckComponent Loading spell index for spellchecker: default_teststop
   [junit4]   2> 1118853 INFO  (TEST-SpellCheckComponentTest.test-seed#[5DDC36407C02487C]) [    ] o.a.s.SolrTestCaseJ4 ###Starting test
   [junit4]   2> 1118853 INFO  (searcherExecutor-4753-thread-1) [    ] o.a.s.h.c.SpellCheckComponent Loading spell index for spellchecker: direct
   [junit4]   2> 1118853 INFO  (searcherExecutor-4753-thread-1) [    ] o.a.s.h.c.SpellCheckComponent Loading spell index for spellchecker: direct_lowerfilt
   [junit4]   2> 1118853 INFO  (searcherExecutor-4753-thread-1) [    ] o.a.s.h.c.SpellCheckComponent Loading spell index for spellchecker: wordbreak
   [junit4]   2> 1118853 INFO  (searcherExecutor-4753-thread-1) [    ] o.a.s.h.c.SpellCheckComponent Loading spell index for spellchecker: threshold
   [junit4]   2> 1118854 INFO  (TEST-SpellCheckComponentTest.test-seed#[5DDC36407C02487C]) [    ] o.a.s.u.p.LogUpdateProcessorFactory [collection1]  webapp=null path=null params={}{add=[0]} 0 0
   [junit4]   2> 1118854 INFO  (searcherExecutor-4753-thread-1) [    ] o.a.s.h.c.SpellCheckComponent Loading spell index for spellchecker: threshold_direct
   [junit4]   2> 1118854 INFO  (searcherExecutor-4753-thread-1) [    ] o.a.s.h.c.SpellCheckComponent Loading spell index for spellchecker: multipleFields
   [junit4]   2> 1118855 INFO  (TEST-SpellCheckComponentTest.test-seed#[5DDC36407C02487C]) [    ] o.a.s.u.p.LogUpdateProcessorFactory [collection1]  webapp=null path=null params={}{add=[1]} 0 0
   [junit4]   2> 1118855 INFO  (TEST-SpellCheckComponentTest.test-seed#[5DDC36407C02487C]) [    ] o.a.s.u.p.LogUpdateProcessorFactory [collection1]  webapp=null path=null params={}{add=[2]} 0 0
   [junit4]   2> 1118855 INFO  (TEST-SpellCheckComponentTest.test-seed#[5DDC36407C02487C]) [    ] o.a.s.u.p.LogUpdateProcessorFactory [collection1]  webapp=null path=null params={}{add=[3]} 0 0
   [junit4]   2> 1118855 INFO  (TEST-SpellCheckComponentTest.test-seed#[5DDC36407C02487C]) [    ] o.a.s.u.p.LogUpdateProcessorFactory [collection1]  webapp=null path=null params={}{add=[4]} 0 0
   [junit4]   2> 1118855 INFO  (TEST-SpellCheckComponentTest.test-seed#[5DDC36407C02487C]) [    ] o.a.s.u.p.LogUpdateProcessorFactory [collection1]  webapp=null path=null params={}{add=[5]} 0 0
   [junit4]   2> 1118856 INFO  (TEST-SpellCheckComponentTest.test-seed#[5DDC36407C02487C]) [    ] o.a.s.u.p.LogUpdateProcessorFactory [collection1]  webapp=null path=null params={}{add=[6]} 0 0
   [junit4]   2> 1118856 INFO  (TEST-SpellCheckComponentTest.test-seed#[5DDC36407C02487C]) [    ] o.a.s.u.p.LogUpdateProcessorFactory [collection1]  webapp=null path=null params={}{add=[7]} 0 0
   [junit4]   2> 1118856 INFO  (searcherExecutor-4753-thread-1) [    ] o.a.s.h.c.SpellCheckComponent Loading spell index for spellchecker: jarowinkler
   [junit4]   2> 1118856 INFO  (TEST-SpellCheckComponentTest.test-seed#[5DDC36407C02487C]) [    ] o.a.s.u.p.LogUpdateProcessorFactory [collection1]  webapp=null path=null params={}{add=[8]} 0 0
   [junit4]   2> 1118856 INFO  (TEST-SpellCheckComponentTest.test-seed#[5DDC36407C02487C]) [    ] o.a.s.u.p.LogUpdateProcessorFactory [collection1]  webapp=null path=null params={}{add=[9]} 0 0
   [junit4]   2> 1118856 INFO  (TEST-SpellCheckComponentTest.test-seed#[5DDC36407C02487C]) [    ] o.a.s.u.DirectUpdateHandler2 start commit{,optimize=false,openSearcher=true,waitSearcher=true,expungeDeletes=false,softCommit=false,prepareCommit=false}
   [junit4]   2> 1118856 INFO  (TEST-SpellCheckComponentTest.test-seed#[5DDC36407C02487C]) [    ] o.a.s.u.SolrIndexWriter Calling setCommitData with IW:org.apache.solr.update.SolrIndexWriter@77af562d
   [junit4]   2> 1118857 INFO  (searcherExecutor-4753-thread-1) [    ] o.a.s.h.c.SpellCheckComponent Loading spell index for spellchecker: external
   [junit4]   2> 1118858 INFO  (searcherExecutor-4753-thread-1) [    ] o.a.s.h.c.SpellCheckComponent Loading spell index for spellchecker: freq
   [junit4]   2> 1118859 WARN  (TEST-SpellCheckComponentTest.test-seed#[5DDC36407C02487C]) [    ] o.a.s.c.SolrCore [collection1] PERFORMANCE WARNING: Overlapping onDeckSearchers=2
   [junit4]   2> 1118859 INFO  (TEST-SpellCheckComponentTest.test-seed#[5DDC36407C02487C]) [    ] o.a.s.s.SolrIndexSearcher Opening [Searcher@1d4174a[collection1] main]
   [junit4]   2> 1118859 INFO  (TEST-SpellCheckComponentTest.test-seed#[5DDC36407C02487C]) [    ] o.a.s.u.DirectUpdateHandler2 end_commit_flush
   [junit4]   2> 1118859 INFO  (searcherExecutor-4753-thread-1) [    ] o.a.s.h.c.SpellCheckComponent Loading spell index for spellchecker: fqcn
   [junit4]   2> 1118860 INFO  (searcherExecutor-4753-thread-1) [    ] o.a.s.h.c.SpellCheckComponent Loading spell index for spellchecker: perDict
   [junit4]   2> 1118860 INFO  (searcherExecutor-4753-thread-1) [    ] o.a.s.c.SolrCore [collection1] Registered new searcher Searcher@1c203dac[collection1] main{ExitableDirectoryReader(UninvertingDirectoryReader())}
   [junit4]   2> 1118860 INFO  (searcherExecutor-4753-thread-1) [    ] o.a.s.h.c.SpellCheckComponent Loading spell index for spellchecker: default
   [junit4]   2> 1118861 INFO  (searcherExecutor-4753-thread-1) [    ] o.a.s.h.c.SpellCheckComponent Loading spell index for spellchecker: default_teststop
   [junit4]   2> 1118862 INFO  (searcherExecutor-4753-thread-1) [    ] o.a.s.h.c.SpellCheckComponent Loading spell index for spellchecker: direct
   [junit4]   2> 1118862 INFO  (searcherExecutor-4753-thread-1) [    ] o.a.s.h.c.SpellCheckComponent Loading spell index for spellchecker: direct_lowerfilt
   [junit4]   2> 1118862 INFO  (searcherExecutor-4753-thread-1) [    ] o.a.s.h.c.SpellCheckComponent Loading spell index for spellchecker: wordbreak
   [junit4]   2> 1118862 INFO  (searcherExecutor-4753-thread-1) [    ] o.a.s.h.c.SpellCheckComponent Loading spell index for spellchecker: threshold
   [junit4]   2> 1118863 INFO  (searcherExecutor-4753-thread-1) [    ] o.a.s.h.c.SpellCheckComponent Loading spell index for spellchecker: threshold_direct
   [junit4]   2> 1118863 INFO  (searcherExecutor-4753-thread-1) [    ] o.a.s.h.c.SpellCheckComponent Loading spell index for spellchecker: multipleFields
   [junit4]   2> 1118864 INFO  (searcherExecutor-4753-thread-1) [    ] o.a.s.h.c.SpellCheckComponent Loading spell index for spellchecker: jarowinkler
   [junit4]   2> 1118865 INFO  (searcherExecutor-4753-thread-1) [    ] o.a.s.h.c.SpellCheckComponent Loading spell index for spellchecker: external
   [junit4]   2> 1118866 INFO  (searcherExecutor-4753-thread-1) [    ] o.a.s.h.c.SpellCheckComponent Loading spell index for spellchecker: freq
   [junit4]   2> 1118867 INFO  (searcherExecutor-4753-thread-1) [    ] o.a.s.h.c.SpellCheckComponent Loading spell index for spellchecker: fqcn
   [junit4]   2> 1118868 INFO  (searcherExecutor-4753-thread-1) [    ] o.a.s.h.c.SpellCheckComponent Loading spell index for spellchecker: perDict
   [junit4]   2> 1118868 INFO  (searcherExecutor-4753-thread-1) [    ] o.a.s.c.SolrCore [collection1] Registered new searcher Searcher@1d4174a[collection1] main{ExitableDirectoryReader(UninvertingDirectoryReader(Uninverting(_0(7.0.0):c10)))}
   [junit4]   2> 1118868 INFO  (TEST-SpellCheckComponentTest.test-seed#[5DDC36407C02487C]) [    ] o.a.s.u.p.LogUpdateProcessorFactory [collection1]  webapp=null path=null params={}{commit=} 0 11
   [junit4]   2> 1118869 INFO  (TEST-SpellCheckComponentTest.test-seed#[5DDC36407C02487C]) [    ] o.a.s.c.S.Request [collection1]  webapp=null path=null params={q=documemt&qt=spellCheckCompRH&spellcheck=true&wt=xml} hits=0 status=0 QTime=0
   [junit4]   2> 1118869 ERROR (TEST-SpellCheckComponentTest.test-seed#[5DDC36407C02487C]) [    ] o.a.s.SolrTestCaseJ4 query failed JSON validation. error=List size mismatch @ spellcheck/suggestions
   [junit4]   2>  expected =/spellcheck=={'suggestions':['documemt',{'numFound':1,'startOffset':0,'endOffset':8,'suggestion':['document']}]}
   [junit4]   2>  response = {
   [junit4]   2>   "responseHeader":{
   [junit4]   2>     "status":0,
   [junit4]   2>     "QTime":0},
   [junit4]   2>   "response":{"numFound":0,"start":0,"docs":[]
   [junit4]   2>   },
   [junit4]   2>   "spellcheck":{
   [junit4]   2>     "suggestions":[]}}
   [junit4]   2> 
   [junit4]   2>  request = q=documemt&qt=spellCheckCompRH&spellcheck=true&wt=xml
   [junit4]   2> 1118870 INFO  (TEST-SpellCheckComponentTest.test-seed#[5DDC36407C02487C]) [    ] o.a.s.SolrTestCaseJ4 ###Ending test
   [junit4]   2> 1118870 INFO  (TEST-SpellCheckComponentTest.test-seed#[5DDC36407C02487C]) [    ] o.a.s.u.DirectUpdateHandler2 [collection1] REMOVING ALL DOCUMENTS FROM INDEX
   [junit4]   2> 1118870 INFO  (TEST-SpellCheckComponentTest.test-seed#[5DDC36407C02487C]) [    ] o.a.s.u.p.LogUpdateProcessorFactory [collection1]  webapp=null path=null params={}{deleteByQuery=*:*} 0 0
   [junit4]   2> 1118870 INFO  (TEST-SpellCheckComponentTest.test-seed#[5DDC36407C02487C]) [    ] o.a.s.u.DirectUpdateHandler2 start commit{,optimize=false,openSearcher=true,waitSearcher=true,expungeDeletes=false,softCommit=false,prepareCommit=false}
   [junit4]   2> 1118870 INFO  (TEST-SpellCheckComponentTest.test-seed#[5DDC36407C02487C]) [    ] o.a.s.u.SolrIndexWriter Calling setCommitData with IW:org.apache.solr.update.SolrIndexWriter@77af562d
   [junit4]   2> 1118871 INFO  (TEST-SpellCheckComponentTest.test-seed#[5DDC36407C02487C]) [    ] o.a.s.s.SolrIndexSearcher Opening [Searcher@308cd0e4[collection1] main]
   [junit4]   2> 1118871 INFO  (TEST-SpellCheckComponentTest.test-seed#[5DDC36407C02487C]) [    ] o.a.s.u.DirectUpdateHandler2 end_commit_flush
   [junit4]   2> 1118871 INFO  (searcherExecutor-4753-thread-1) [    ] o.a.s.h.c.SpellCheckComponent Building spell index for spell checker: default
   [junit4]   2> 1118907 INFO  (searcherExecutor-4753-thread-1) [    ] o.a.s.h.c.SpellCheckComponent Building spell index for spell checker: default_teststop
   [junit4]   2> 1118966 INFO  (searcherExecutor-4753-thread-1) [    ] o.a.s.h.c.SpellCheckComponent Building spell index for spell checker: threshold
   [junit4]   2> 1118999 INFO  (searcherExecutor-4753-thread-1) [    ] o.a.s.h.c.SpellCheckComponent Building spell index for spell checker: threshold_direct
   [junit4]   2> 1118999 INFO  (searcherExecutor-4753-thread-1) [    ] o.a.s.h.c.SpellCheckComponent Building spell index for spell checker: multipleFields
   [junit4]   2> 1119029 INFO  (searcherExecutor-4753-thread-1) [    ] o.a.s.h.c.SpellCheckComponent Building spell index for spell checker: freq
   [junit4]   2> 1119083 INFO  (searcherExecutor-4753-thread-1) [    ] o.a.s.h.c.SpellCheckComponent Building spell index for spell checker: fqcn
   [junit4]   2> 1119114 INFO  (searcherExecutor-4753-thread-1) [    ] o.a.s.c.SolrCore [collection1] Registered new searcher Searcher@308cd0e4[collection1] main{ExitableDirectoryReader(UninvertingDirectoryReader())}
   [junit4]   2> 1119114 INFO  (TEST-SpellCheckComponentTest.test-seed#[5DDC36407C02487C]) [    ] o.a.s.u.p.LogUpdateProcessorFactory [collection1]  webapp=null path=null params={}{commit=} 0 243
   [junit4]   2> NOTE: reproduce with: ant test  -Dtestcase=SpellCheckComponentTest -Dtests.method=test -Dtests.seed=5DDC36407C02487C -Dtests.multiplier=3 -Dtests.slow=true -Dtests.locale=twq -Dtests.timezone=Asia/Kathmandu -Dtests.asserts=true -Dtests.file.encoding=ISO-8859-1
   [junit4] ERROR   0.26s J1 | SpellCheckComponentTest.test <<<
   [junit4]    > Throwable #1: java.lang.RuntimeException: List size mismatch @ spellcheck/suggestions
   [junit4]    > 	at __randomizedtesting.SeedInfo.seed([5DDC36407C02487C:D588099AD2FE2584]:0)
   [junit4]    > 	at org.apache.solr.SolrTestCaseJ4.assertJQ(SolrTestCaseJ4.java:906)
   [junit4]    > 	at org.apache.solr.SolrTestCaseJ4.assertJQ(SolrTestCaseJ4.java:853)
   [junit4]    > 	at org.apache.solr.handler.component.SpellCheckComponentTest.test(SpellCheckComponentTest.java:147)
   [junit4]    > 	at java.base/jdk.internal.reflect.NativeMethodAccessorImpl.invoke0(Native Method)
   [junit4]    > 	at java.base/jdk.internal.reflect.NativeMethodAccessorImpl.invoke(NativeMethodAccessorImpl.java:62)
   [junit4]    > 	at java.base/jdk.internal.reflect.DelegatingMethodAccessorImpl.invoke(DelegatingMethodAccessorImpl.java:43)
   [junit4]    > 	at java.base/java.lang.reflect.Method.invoke(Method.java:538)
   [junit4]    > 	at java.base/java.lang.Thread.run(Thread.java:844)
   [junit4]   2> 1119116 INFO  (TEST-SpellCheckComponentTest.testRebuildOnCommit-seed#[5DDC36407C02487C]) [    ] o.a.s.SolrTestCaseJ4 ###Starting testRebuildOnCommit
   [junit4]   2> 1119117 INFO  (TEST-SpellCheckComponentTest.testRebuildOnCommit-seed#[5DDC36407C02487C]) [    ] o.a.s.u.p.LogUpdateProcessorFactory [collection1]  webapp=null path=null params={}{add=[0]} 0 0
   [junit4]   2> 1119117 INFO  (TEST-SpellCheckComponentTest.testRebuildOnCommit-seed#[5DDC36407C02487C]) [    ] o.a.s.u.p.LogUpdateProcessorFactory [collection1]  webapp=null path=null params={}{add=[1]} 0 0
   [junit4]   2> 1119117 INFO  (TEST-SpellCheckComponentTest.testRebuildOnCommit-seed#[5DDC36407C02487C]) [    ] o.a.s.u.p.LogUpdateProcessorFactory [collection1]  webapp=null path=null params={}{add=[2]} 0 0
   [junit4]   2> 1119117 INFO  (TEST-SpellCheckComponentTest.testRebuildOnCommit-seed#[5DDC36407C02487C]) [    ] o.a.s.u.p.LogUpdateProcessorFactory [collection1]  webapp=null path=null params={}{add=[3]} 0 0
   [junit4]   2> 1119117 INFO  (TEST-SpellCheckComponentTest.testRebuildOnCommit-seed#[5DDC36407C02487C]) [    ] o.a.s.u.p.LogUpdateProcessorFactory [collection1]  webapp=null path=null params={}{add=[4]} 0 0
   [junit4]   2> 1119118 INFO  (TEST-SpellCheckComponentTest.testRebuildOnCommit-seed#[5DDC36407C02487C]) [    ] o.a.s.u.p.LogUpdateProcessorFactory [collection1]  webapp=null path=null params={}{add=[5]} 0 0
   [junit4]   2> 1119118 INFO  (TEST-SpellCheckComponentTest.testRebuildOnCommit-seed#[5DDC36407C02487C]) [    ] o.a.s.u.p.LogUpdateProcessorFactory [collection1]  webapp=null path=null params={}{add=[6]} 0 0
   [junit4]   2> 1119118 INFO  (TEST-SpellCheckComponentTest.testRebuildOnCommit-seed#[5DDC36407C02487C]) [    ] o.a.s.u.p.LogUpdateProcessorFactory [collection1]  webapp=null path=null params={}{add=[7]} 0 0
   [junit4]   2> 1119118 INFO  (TEST-SpellCheckComponentTest.testRebuildOnCommit-seed#[5DDC36407C02487C]) [    ] o.a.s.u.p.LogUpdateProcessorFactory [collection1]  webapp=null path=null params={}{add=[8]} 0 0
   [junit4]   2> 1119118 INFO  (TEST-SpellCheckComponentTest.testRebuildOnCommit-seed#[5DDC36407C02487C]) [    ] o.a.s.u.p.LogUpdateProcessorFactory [collection1]  webapp=null path=null params={}{add=[9]} 0 0
   [junit4]   2> 1119118 INFO  (TEST-SpellCheckComponentTest.testRebuildOnCommit-seed#[5DDC36407C02487C]) [    ] o.a.s.u.DirectUpdateHandler2 start commit{,optimize=false,openSearcher=true,waitSearcher=true,expungeDeletes=false,softCommit=false,prepareCommit=false}
   [junit4]   2> 1119119 INFO  (TEST-SpellCheckComponentTest.testRebuildOnCommit-seed#[5DDC36407C02487C]) [    ] o.a.s.u.SolrIndexWriter Calling setCommitData with IW:org.apache.solr.update.SolrIndexWriter@77af562d
   [junit4]   2> 1119120 INFO  (TEST-SpellCheckComponentTest.testRebuildOnCommit-seed#[5DDC36407C02487C]) [    ] o.a.s.s.SolrIndexSearcher Opening [Searcher@283cea27[collection1] main]
   [junit4]   2> 1119121 INFO  (TEST-SpellCheckComponentTest.testRebuildOnCommit-seed#[5DDC36407C02487C]) [    ] o.a.s.u.DirectUpdateHandler2 end_commit_flush
   [junit4]   2> 1119121 INFO  (searcherExecutor-4753-thread-1) [    ] o.a.s.h.c.SpellCheckComponent Building spell index for spell checker: default
   [junit4]   2> 1119260 INFO  (searcherExecutor-4753-thread-1) [    ] o.a.s.h.c.SpellCheckComponent Building spell index for spell checker: default_teststop
   [junit4]   2> 1119330 INFO  (searcherExecutor-4753-thread-1) [    ] o.a.s.h.c.SpellCheckComponent Building spell index for spell checker: threshold
   [junit4]   2> 1119528 INFO  (searcherExecutor-4753-thread-1) [    ] o.a.s.h.c.SpellCheckComponent Building spell index for spell checker: threshold_direct
   [junit4]   2> 1119528 INFO  (searcherExecutor-4753-thread-1) [    ] o.a.s.h.c.SpellCheckComponent Building spell index for spell checker: multipleFields
   [junit4]   2> 1119723 INFO  (searcherExecutor-4753-thread-1) [    ] o.a.s.h.c.SpellCheckComponent Building spell index for spell checker: freq
   [junit4]   2> 1119962 INFO  (searcherExecutor-4753-thread-1) [    ] o.a.s.h.c.SpellCheckComponent Building spell index for spell checker: fqcn
   [junit4]   2> 1120171 INFO  (searcherExecutor-4753-thread-1) [    ] o.a.s.c.SolrCore [collection1] Registered new searcher Searcher@283cea27[collection1] main{ExitableDirectoryReader(UninvertingDirectoryReader(Uninverting(_1(7.0.0):c10)))}
   [junit4]   2> 1120171 INFO  (TEST-SpellCheckComponentTest.testRebuildOnCommit-seed#[5DDC36407C02487C]) [    ] o.a.s.u.p.LogUpdateProcessorFactory [collection1]  webapp=null path=null params={}{commit=} 0 1052
   [junit4]   2> 1120172 INFO  (TEST-SpellCheckComponentTest.testRebuildOnCommit-seed#[5DDC36407C02487C]) [    ] o.a.s.c.S.Request [collection1]  webapp=null path=null params={q=lowerfilt:lucenejavt&qt=spellCheckCompRH&spellcheck=true&wt=xml} hits=0 status=0 QTime=0
   [junit4]   2> 1120172 INFO  (TEST-SpellCheckComponentTest.testRebuildOnCommit-seed#[5DDC36407C02487C]) [    ] o.a.s.u.p.LogUpdateProcessorFactory [collection1]  webapp=null path=null params={}{add=[11231]} 0 0
   [junit4]   2> 1120172 INFO  (TEST-SpellCheckComponentTest.testRebuildOnCommit-seed#[5DDC36407C02487C]) [    ] o.a.s.u.DirectUpdateHandler2 start commit{,optimize=false,openSearcher=true,waitSearcher=true,expungeDeletes=false,softCommit=false,prepareCommit=false}
   [junit4]   2> 1120172 INFO  (TEST-SpellCheckComponentTest.testRebuildOnCommit-seed#[5DDC36407C02487C]) [    ] o.a.s.u.SolrIndexWriter Calling setCommitData with IW:org.apache.solr.update.SolrIndexWriter@77af562d
   [junit4]   2> 1120175 INFO  (TEST-SpellCheckComponentTest.testRebuildOnCommit-seed#[5DDC36407C02487C]) [    ] o.a.s.s.SolrIndexSearcher Opening [Searcher@585e4801[collection1] main]
   [junit4]   2> 1120175 INFO  (TEST-SpellCheckComponentTest.testRebuildOnCommit-seed#[5DDC36407C02487C]) [    ] o.a.s.u.DirectUpdateHandler2 end_commit_flush
   [junit4]   2> 1120175 INFO  (searcherExecutor-4753-thread-1) [    ] o.a.s.h.c.SpellCheckComponent Building spell index for spell checker: default
   [junit4]   2> 1120409 INFO  (searcherExecutor-4753-thread-1) [    ] o.a.s.h.c.SpellCheckComponent Building spell index for spell checker: default_teststop
   [junit4]   2> 1120463 INFO  (searcherExecutor-4753-thread-1) [    ] o.a.s.h.c.SpellCheckComponent Building spell index for spell checker: threshold
   [junit4]   2> 1120588 INFO  (searcherExecutor-4753-thread-1) [    ] o.a.s.h.c.SpellCheckComponent Building spell index for spell checker: threshold_direct
   [junit4]   2> 1120588 INFO  (searcherExecutor-4753-thread-1) [    ] o.a.s.h.c.SpellCheckComponent Building spell index for spell checker: multipleFields
   [junit4]   2> 1120774 INFO  (searcherExecutor-4753-thread-1) [    ] o.a.s.h.c.SpellCheckComponent Building spell index for spell checker: freq
   [junit4]   2> 1121012 INFO  (searcherExecutor-4753-thread-1) [    ] o.a.s.h.c.SpellCheckComponent Building spell index for spell checker: fqcn
   [junit4]   2> 1121210 INFO  (searcherExecutor-4753-thread-1) [    ] o.a.s.c.SolrCore [collection1] Registered new searcher Searcher@585e4801[collection1] main{ExitableDirectoryReader(UninvertingDirectoryReader(Uninverting(_1(7.0.0):c10) Uninverting(_2(7.0.0):c1)))}
   [junit4]   2> 1121210 INFO  (TEST-SpellCheckComponentTest.testRebuildOnCommit-seed#[5DDC36407C02487C]) [    ] o.a.s.u.p.LogUpdateProcessorFactory [collection1]  webapp=null path=null params={}{commit=} 0 1038
   [junit4]   2> 1121212 INFO  (TEST-SpellCheckComponentTest.testRebuildOnCommit-seed#[5DDC36407C02487C]) [    ] o.a.s.c.S.Request [collection1]  webapp=null path=null params={q=lowerfilt:lucenejavt&qt=spellCheckCompRH&spellcheck=true&wt=xml} hits=0 status=0 QTime=1041
   [junit4]   2> 1121212 INFO  (TEST-SpellCheckComponentTest.testRebuildOnCommit-seed#[5DDC36407C02487C]) [    ] o.a.s.SolrTestCaseJ4 ###Ending testRebuildOnCommit
   [junit4]   2> 1121213 INFO  (TEST-SpellCheckComponentTest.testRebuildOnCommit-seed#[5DDC36407C02487C]) [    ] o.a.s.u.DirectUpdateHandler2 [collection1] REMOVING ALL DOCUMENTS FROM INDEX
   [junit4]   2> 1121213 INFO  (TEST-SpellCheckComponentTest.testRebuildOnCommit-seed#[5DDC36407C02487C]) [    ] o.a.s.u.p.LogUpdateProcessorFactory [collection1]  webapp=null path=null params={}{deleteByQuery=*:*} 0 0
   [junit4]   2> 1121213 INFO  (TEST-SpellCheckComponentTest.testRebuildOnCommit-seed#[5DDC36407C02487C]) [    ] o.a.s.u.DirectUpdateHandler2 start commit{,optimize=false,openSearcher=true,waitSearcher=true,expungeDeletes=false,softCommit=false,prepareCommit=false}
   [junit4]   2> 1121213 INFO  (TEST-SpellCheckComponentTest.testRebuildOnCommit-seed#[5DDC36407C02487C]) [    ] o.a.s.u.SolrIndexWriter Calling setCommitData with IW:org.apache.solr.update.SolrIndexWriter@77af562d
   [junit4]   2> 1121213 INFO  (TEST-SpellCheckComponentTest.testRebuildOnCommit-seed#[5DDC36407C02487C]) [    ] o.a.s.s.SolrIndexSearcher Opening [Searcher@4c30f7f6[collection1] main]
   [junit4]   2> 1121213 INFO  (TEST-SpellCheckComponentTest.testRebuildOnCommit-seed#[5DDC36407C02487C]) [    ] o.a.s.u.DirectUpdateHandler2 end_commit_flush
   [junit4]   2> 1121213 INFO  (searcherExecutor-4753-thread-1) [    ] o.a.s.h.c.SpellCheckComponent Building spell index for spell checker: default
   [junit4]   2> 1121292 INFO  (searcherExecutor-4753-thread-1) [    ] o.a.s.h.c.SpellCheckComponent Building spell index for spell checker: default_teststop
   [junit4]   2> 1121360 INFO  (searcherExecutor-4753-thread-1) [    ] o.a.s.h.c.SpellCheckComponent Building spell index for spell checker: threshold
   [junit4]   2> 1121435 INFO  (searcherExecutor-4753-thread-1) [    ] o.a.s.h.c.SpellCheckComponent Building spell index for spell checker: threshold_direct
   [junit4]   2> 1121435 INFO  (searcherExecutor-4753-thread-1) [    ] o.a.s.h.c.SpellCheckComponent Building spell index for spell checker: multipleFields
   [junit4]   2> 1121487 INFO  (searcherExecutor-4753-thread-1) [    ] o.a.s.h.c.SpellCheckComponent Building spell index for spell checker: freq
   [junit4]   2> 1121531 INFO  (searcherExecutor-4753-thread-1) [    ] o.a.s.h.c.SpellCheckComponent Building spell index for spell checker: fqcn
   [junit4]   2> 1121588 INFO  (searcherExecutor-4753-thread-1) [    ] o.a.s.c.SolrCore [collection1] Registered new searcher Searcher@4c30f7f6[collection1] main{ExitableDirectoryReader(UninvertingDirectoryReader())}
   [junit4]   2> 1121588 INFO  (TEST-SpellCheckComponentTest.testRebuildOnCommit-seed#[5DDC36407C02487C]) [    ] o.a.s.u.p.LogUpdateProcessorFactory [collection1]  webapp=null path=null params={}{commit=} 0 375
   [junit4]   2> 1121590 INFO  (TEST-SpellCheckComponentTest.testThresholdTokenFrequency-seed#[5DDC36407C02487C]) [    ] o.a.s.SolrTestCaseJ4 ###Starting testThresholdTokenFrequency
   [junit4]   2> 1121590 INFO  (TEST-SpellCheckComponentTest.testThresholdTokenFrequency-seed#[5DDC36407C02487C]) [    ] o.a.s.u.p.LogUpdateProcessorFactory [collection1]  webapp=null path=null params={}{add=[0]} 0 0
   [junit4]   2> 1121590 INFO  (TEST-SpellCheckComponentTest.testThresholdTokenFrequency-seed#[5DDC36407C02487C]) [    ] o.a.s.u.p.LogUpdateProcessorFactory [collection1]  webapp=null path=null params={}{add=[1]} 0 0
   [junit4]   2> 1121590 INFO  (TEST-SpellCheckComponentTest.testThresholdTokenFrequency-seed#[5DDC36407C02487C]) [    ] o.a.s.u.p.LogUpdateProcessorFactory [collection1]  webapp=null path=null params={}{add=[2]} 0 0
   [junit4]   2> 1121591 INFO  (TEST-SpellCheckComponentTest.testThresholdTokenFrequency-seed#[5DDC36407C02487C]) [    ] o.a.s.u.p.LogUpdateProcessorFactory [collection1]  webapp=null path=null params={}{add=[3]} 0 0
   [junit4]   2> 1121591 INFO  (TEST-SpellCheckComponentTest.testThresholdTokenFrequency-seed#[5DDC36407C02487C]) [    ] o.a.s.u.p.LogUpdateProcessorFactory [collection1]  webapp=null path=null params={}{add=[4]} 0 0
   [junit4]   2> 1121591 INFO  (TEST-SpellCheckComponentTest.testThresholdTokenFrequency-seed#[5DDC36407C02487C]) [    ] o.a.s.u.p.LogUpdateProcessorFactory [collection1]  webapp=null path=null params={}{add=[5]} 0 0
   [junit4]   2> 1121591 INFO  (TEST-SpellCheckComponentTest.testThresholdTokenFrequency-seed#[5DDC36407C02487C]) [    ] o.a.s.u.p.LogUpdateProcessorFactory [collection1]  webapp=null path=null params={}{add=[6]} 0 0
   [junit4]   2> 1121591 INFO  (TEST-SpellCheckComponentTest.testThresholdTokenFrequency-seed#[5DDC36407C02487C]) [    ] o.a.s.u.p.LogUpdateProcessorFactory [collection1]  webapp=null path=null params={}{add=[7]} 0 0
   [junit4]   2> 1121592 INFO  (TEST-SpellCheckComponentTest.testThresholdTokenFrequency-seed#[5DDC36407C02487C]) [    ] o.a.s.u.p.LogUpdateProcessorFactory [collection1]  webapp=null path=null params={}{add=[8]} 0 0
   [junit4]   2> 1121592 INFO  (TEST-SpellCheckComponentTest.testThresholdTokenFrequency-seed#[5DDC36407C02487C]) [    ] o.a.s.u.p.LogUpdateProcessorFactory [collection1]  webapp=null path=null params={}{add=[9]} 0 0
   [junit4]   2> 1121592 INFO  (TEST-SpellCheckComponentTest.testThresholdTokenFrequency-seed#[5DDC36407C02487C]) [    ] o.a.s.u.DirectUpdateHandler2 start commit{,optimize=false,openSearcher=true,waitSearcher=true,expungeDeletes=false,softCommit=false,prepareCommit=false}
   [junit4]   2> 1121592 INFO  (TEST-SpellCheckComponentTest.testThresholdTokenFrequency-seed#[5DDC36407C02487C]) [    ] o.a.s.u.SolrIndexWriter Calling setCommitData with IW:org.apache.solr.update.SolrIndexWriter@77af562d
   [junit4]   2> 1121595 INFO  (TEST-SpellCheckComponentTest.testThresholdTokenFrequency-seed#[5DDC36407C02487C]) [    ] o.a.s.s.SolrIndexSearcher Opening [Searcher@5a68dcb[collection1] main]
   [junit4]   2> 1121595 INFO  (TEST-SpellCheckComponentTest.testThresholdTokenFrequency-seed#[5DDC36407C02487C]) [    ] o.a.s.u.DirectUpdateHandler2 end_commit_flush
   [junit4]   2> 1121595 INFO  (searcherExecutor-4753-thread-1) [    ] o.a.s.h.c.SpellCheckComponent Building spell index for spell checker: default
   [junit4]   2> 1121739 INFO  (searcherExecutor-4753-thread-1) [    ] o.a.s.h.c.SpellCheckComponent Building spell index for spell checker: default_teststop
   [junit4]   2> 1121808 INFO  (searcherExecutor-4753-thread-1) [    ] o.a.s.h.c.SpellCheckComponent Building spell index for spell checker: threshold
   [junit4]   2> 1122019 INFO  (searcherExecutor-4753-thread-1) [    ] o.a.s.h.c.SpellCheckComponent Building spell index for spell checker: threshold_direct
   [junit4]   2> 1122019 INFO  (searcherExecutor-4753-thread-1) [    ] o.a.s.h.c.SpellCheckComponent Building spell index for spell checker: multipleFields
   [junit4]   2> 1122203 INFO  (searcherExecutor-4753-thread-1) [    ] o.a.s.h.c.SpellCheckComponent Building spell index for spell checker: freq
   [junit4]   2> 1122405 INFO  (searcherExecutor-4753-thread-1) [    ] o.a.s.h.c.SpellCheckComponent Building spell index for spell checker: fqcn
   [junit4]   2> 1122585 INFO  (searcherExecutor-4753-thread-1) [    ] o.a.s.c.SolrCore [collection1] Registered new searcher Searcher@5a68dcb[collection1] main{ExitableDirectoryReader(UninvertingDirectoryReader(Uninverting(_3(7.0.0):c10)))}
   [junit4]   2> 1122585 INFO  (TEST-SpellCheckComponentTest.testThresholdTokenFrequency-seed#[5DDC36407C02487C]) [    ] o.a.s.u.p.LogUpdateProcessorFactory [collection1]  webapp=null path=null params={}{commit=} 0 993
   [junit4]   2> 1122587 INFO  (TEST-SpellCheckComponentTest.testThresholdTokenFrequency-seed#[5DDC36407C02487C]) [    ] o.a.s.c.S.Request [collection1]  webapp=null path=null params={q=documenq&qt=spellCheckCompRH&spellcheck.dictionary=threshold&spellcheck=true&spellcheck.count=5&wt=xml&spellcheck.extendedResults=true} hits=0 status=0 QTime=0
   [junit4]   2> 1122591 INFO  (TEST-SpellCheckComponentTest.testThresholdTokenFrequency-seed#[5DDC36407C02487C]) [    ] o.a.s.c.S.Request [collection1]  webapp=null path=null params={q=documenq&qt=spellCheckCompRH&spellcheck.dictionary=threshold_direct&spellcheck=true&spellcheck.count=5&wt=xml&spellcheck.extendedResults=true} hits=0 status=0 QTime=3
   [junit4]   2> 1122594 INFO  (TEST-SpellCheckComponentTest.testThresholdTokenFrequency-seed#[5DDC36407C02487C]) [    ] o.a.s.SolrTestCaseJ4 ###Ending testThresholdTokenFrequency
   [junit4]   2> 1122594 INFO  (TEST-SpellCheckComponentTest.testThresholdTokenFrequency-seed#[5DDC36407C02487C]) [    ] o.a.s.u.DirectUpdateHandler2 [collection1] REMOVING ALL DOCUMENTS FROM INDEX
   [junit4]   2> 1122594 INFO  (TEST-SpellCheckComponentTest.testThresholdTokenFrequency-seed#[5DDC36407C02487C]) [    ] o.a.s.u.p.LogUpdateProcessorFactory [collection1]  webapp=null path=null params={}{deleteByQuery=*:*} 0 0
   [junit4]   2> 1122594 INFO  (TEST-SpellCheckComponentTest.testThresholdTokenFrequency-seed#[5DDC36407C02487C]) [    ] o.a.s.u.DirectUpdateHandler2 start commit{,optimize=false,openSearcher=true,waitSearcher=true,expungeDeletes=false,softCommit=false,prepareCommit=false}
   [junit4]   2> 1122595 INFO  (TEST-SpellCheckComponentTest.testThresholdTokenFrequency-seed#[5DDC36407C02487C]) [    ] o.a.s.u.SolrIndexWriter Calling setCommitData with IW:org.apache.solr.update.SolrIndexWriter@77af562d
   [junit4]   2> 1122595 INFO  (TEST-SpellCheckComponentTest.testThresholdTokenFrequency-seed#[5DDC36407C02487C]) [    ] o.a.s.s.SolrIndexSearcher Opening [Searcher@59d0890c[collection1] main]
   [junit4]   2> 1122595 INFO  (TEST-SpellCheckComponentTest.testThresholdTokenFrequency-seed#[5DDC36407C02487C]) [    ] o.a.s.u.DirectUpdateHandler2 end_commit_flush
   [junit4]   2> 1122595 INFO  (searcherExecutor-4753-thread-1) [    ] o.a.s.h.c.SpellCheckComponent Building spell index for spell checker: default
   [junit4]   2> 1122710 INFO  (searcherExecutor-4753-thread-1) [    ] o.a.s.h.c.SpellCheckComponent Building spell index for spell checker: default_teststop
   [junit4]   2> 1122780 INFO  (searcherExecutor-4753-thread-1) [    ] o.a.s.h.c.SpellCheckComponent Building spell index for spell checker: threshold
   [junit4]   2> 1122817 INFO  (searcherExecutor-4753-thread-1) [    ] o.a.s.h.c.SpellCheckComponent Building spell index for spell checker: threshold_direct
   [junit4]   2> 1122817 INFO  (searcherExecutor-4753-thread-1) [    ] o.a.s.h.c.SpellCheckComponent Building spell index for spell checker: multipleFields
   [junit4]   2> 1122855 INFO  (searcherExecutor-4753-thread-1) [    ] o.a.s.h.c.SpellCheckComponent Building spell index for spell checker: freq
   [junit4]   2> 1122894 INFO  (searcherExecutor-4753-thread-1) [    ] o.a.s.h.c.SpellCheckComponent Building spell index for spell checker: fqcn
   [junit4]   2> 1122939 INFO  (searcherExecutor-4753-thread-1) [    ] o.a.s.c.SolrCore [collection1] Registered new searcher Searcher@59d0890c[collection1] main{ExitableDirectoryReader(UninvertingDirectoryReader())}
   [junit4]   2> 1122939 INFO  (TEST-SpellCheckComponentTest.testThresholdTokenFrequency-seed#[5DDC36407C02487C]) [    ] o.a.s.u.p.LogUpdateProcessorFactory [collection1]  webapp=null path=null params={}{commit=} 0 344
   [junit4]   2> 1122940 INFO  (TEST-SpellCheckComponentTest.testReloadOnStart-seed#[5DDC36407C02487C]) [    ] o.a.s.SolrTestCaseJ4 ###Starting testReloadOnStart
   [junit4]   2> 1122941 INFO  (TEST-SpellCheckComponentTest.testReloadOnStart-seed#[5DDC36407C02487C]) [    ] o.a.s.u.p.LogUpdateProcessorFactory [collection1]  webapp=null path=null params={}{add=[0]} 0 0
   [junit4]   2> 1122941 INFO  (TEST-SpellCheckComponentTest.testReloadOnStart-seed#[5DDC36407C02487C]) [    ] o.a.s.u.p.LogUpdateProcessorFactory [collection1]  webapp=null path=null params={}{add=[1]} 0 0
   [junit4]   2> 1122942 INFO  (TEST-SpellCheckComponentTest.testReloadOnStart-seed#[5DDC36407C02487C]) [    ] o.a.s.u.p.LogUpdateProcessorFactory [collection1]  webapp=null path=null params={}{add=[2]} 0 0
   [junit4]   2> 1122942 INFO  (TEST-SpellCheckComponentTest.testReloadOnStart-seed#[5DDC36407C02487C]) [    ] o.a.s.u.p.LogUpdateProcessorFactory [collection1]  webapp=null path=null params={}{add=[3]} 0 0
   [junit4]   2> 1122942 INFO  (TEST-SpellCheckComponentTest.testReloadOnStart-seed#[5DDC36407C02487C]) [    ] o.a.s.u.p.LogUpdateProcessorFactory [collection1]  webapp=null path=null params={}{add=[4]} 0 0
   [junit4]   2> 1122942 INFO  (TEST-SpellCheckComponentTest.testReloadOnStart-seed#[5DDC36407C02487C]) [    ] o.a.s.u.p.LogUpdateProcessorFactory [collection1]  webapp=null path=null params={}{add=[5]} 0 0
   [junit4]   2> 1122943 INFO  (TEST-SpellCheckComponentTest.testReloadOnStart-seed#[5DDC36407C02487C]) [    ] o.a.s.u.p.LogUpdateProcessorFactory [collection1]  webapp=null path=null params={}{add=[6]} 0 0
   [junit4]   2> 1122943 INFO  (TEST-SpellCheckComponentTest.testReloadOnStart-seed#[5DDC36407C02487C]) [    ] o.a.s.u.p.LogUpdateProcessorFactory [collection1]  webapp=null path=null params={}{add=[7]} 0 0
   [junit4]   2> 1122943 INFO  (TEST-SpellCheckComponentTest.testReloadOnStart-seed#[5DDC36407C02487C]) [    ] o.a.s.u.p.LogUpdateProcessorFactory [collection1]  webapp=null path=null params={}{add=[8]} 0 0
   [junit4]   2> 1122943 INFO  (TEST-SpellCheckComponentTest.testReloadOnStart-seed#[5DDC36407C02487C]) [    ] o.a.s.u.p.LogUpdateProcessorFactory [collection1]  webapp=null path=null params={}{add=[9]} 0 0
   [junit4]   2> 1122943 INFO  (TEST-SpellCheckComponentTest.testReloadOnStart-seed#[5DDC36407C02487C]) [    ] o.a.s.u.DirectUpdateHandler2 start commit{,optimize=false,openSearcher=true,waitSearcher=true,expungeDeletes=false,softCommit=false,prepareCommit=false}
   [junit4]   2> 1122943 INFO  (TEST-SpellCheckComponentTest.testReloadOnStart-seed#[5DDC36407C02487C]) [    ] o.a.s.u.SolrIndexWriter Calling setCommitData with IW:org.apache.solr.update.SolrIndexWriter@77af562d
   [junit4]   2> 1122946 INFO  (TEST-SpellCheckComponentTest.testReloadOnStart-seed#[5DDC36407C02487C]) [    ] o.a.s.s.SolrIndexSearcher Opening [Searcher@139323a7[collection1] main]
   [junit4]   2> 1122946 INFO  (TEST-SpellCheckComponentTest.testReloadOnStart-seed#[5DDC36407C02487C]) [    ] o.a.s.u.DirectUpdateHandler2 end_commit_flush
   [junit4]   2> 1122946 INFO  (searcherExecutor-4753-thread-1) [    ] o.a.s.h.c.SpellCheckComponent Building spell index for spell checker: default
   [junit4]   2> 1123074 INFO  (searcherExecutor-4753-thread-1) [    ] o.a.s.h.c.SpellCheckComponent Building spell index for spell checker: default_teststop
   [junit4]   2> 1123121 INFO  (searcherExecutor-4753-thread-1) [    ] o.a.s.h.c.SpellCheckComponent Building spell index for spell checker: threshold
   [junit4]   2> 1123283 INFO  (searcherExecutor-4753-thread-1) [    ] o.a.s.h.c.SpellCheckComponent Building spell index for spell checker: threshold_direct
   [junit4]   2> 1123283 INFO  (searcherExecutor-4753-thread-1) [    ] o.a.s.h.c.SpellCheckComponent Building spell index for spell checker: multipleFields
   [junit4]   2> 1123490 INFO  (searcherExecutor-4753-thread-1) [    ] o.a.s.h.c.SpellCheckComponent Building spell index for spell checker: freq
   [junit4]   2> 1123664 INFO  (searcherExecutor-4753-thread-1) [    ] o.a.s.h.c.SpellCheckComponent Building spell index for spell checker: fqcn
   [junit4]   2> 1123859 INFO  (searcherExecutor-4753-thread-1) [    ] o.a.s.c.SolrCore [collection1] Registered new searcher Searcher@139323a7[collection1] main{ExitableDirectoryReader(UninvertingDirectoryReader(Uninverting(_4(7.0.0):c10)))}
   [junit4]   2> 1123859 INFO  (TEST-SpellCheckComponentTest.testReloadOnStart-seed#[5DDC36407C02487C]) [    ] o.a.s.u.p.LogUpdateProcessorFactory [collection1]  webapp=null path=null params={}{commit=} 0 916
   [junit4]   2> 1123860 INFO  (TEST-SpellCheckComponentTest.testReloadOnStart-seed#[5DDC36407C02487C]) [    ] o.a.s.u.p.LogUpdateProcessorFactory [collection1]  webapp=null path=null params={}{add=[0]} 0 0
   [junit4]   2> 1123860 INFO  (TEST-SpellCheckComponentTest.testReloadOnStart-seed#[5DDC36407C02487C]) [    ] o.a.s.u.DirectUpdateHandler2 start commit{,optimize=false,openSearcher=true,waitSearcher=true,expungeDeletes=false,softCommit=false,prepareCommit=false}
   [junit4]   2> 1123860 INFO  (TEST-SpellCheckComponentTest.testReloadOnStart-seed#[5DDC36407C02487C]) [    ] o.a.s.u.SolrIndexWriter Calling setCommitData with IW:org.apache.solr.update.SolrIndexWriter@77af562d
   [junit4]   2> 1123862 INFO  (TEST-SpellCheckComponentTest.testReloadOnStart-seed#[5DDC36407C02487C]) [    ] o.a.s.s.SolrIndexSearcher Opening [Searcher@6978a09b[collection1] main]
   [junit4]   2> 1123863 INFO  (TEST-SpellCheckComponentTest.testReloadOnStart-seed#[5DDC36407C02487C]) [    ] o.a.s.u.DirectUpdateHandler2 end_commit_flush
   [junit4]   2> 1123863 INFO  (searcherExecutor-4753-thread-1) [    ] o.a.s.h.c.SpellCheckComponent Building spell index for spell checker: default
   [junit4]   2> 1124048 INFO  (searcherExecutor-4753-thread-1) [    ] o.a.s.h.c.SpellCheckComponent Building spell index for spell checker: default_teststop
   [junit4]   2> 1124106 INFO  (searcherExecutor-4753-thread-1) [    ] o.a.s.h.c.SpellCheckComponent Building spell index for spell checker: threshold
   [junit4]   2> 1124343 INFO  (searcherExecutor-4753-thread-1) [    ] o.a.s.h.c.SpellCheckComponent Building spell index for spell checker: threshold_direct
   [junit4]   2> 1124343 INFO  (searcherExecutor-4753-thread-1) [    ] o.a.s.h.c.SpellCheckComponent Building spell index for spell checker: multipleFields
   [junit4]   2> 1124469 INFO  (searcherExecutor-4753-thread-1) [    ] o.a.s.h.c.SpellCheckComponent Building spell index for spell checker: freq
   [junit4]   2> 1124657 INFO  (searcherExecutor-4753-thread-1) [    ] o.a.s.h.c.SpellCheckComponent Building spell index for spell checker: fqcn
   [junit4]   2> 1124770 INFO  (searcherExecutor-4753-thread-1) [    ] o.a.s.c.SolrCore [collection1] Registered new searcher Searcher@6978a09b[collection1] main{ExitableDirectoryReader(UninvertingDirectoryReader(Uninverting(_4(7.0.0):c10/1:delGen=1) Uninverting(_5(7.0.0):c1)))}
   [junit4]   2> 1124771 INFO  (TEST-SpellCheckComponentTest.testReloadOnStart-seed#[5DDC36407C02487C]) [    ] o.a.s.u.p.LogUpdateProcessorFactory [collection1]  webapp=null path=null params={}{commit=} 0 910
   [junit4]   2> 1124920 INFO  (TEST-SpellCheckComponentTest.testReloadOnStart-seed#[5DDC36407C02487C]) [    ] o.a.s.c.S.Request [collection1]  webapp=null path=null params={q=*:*&spellcheck.q=ttle&qt=spellCheckCompRH&spellcheck.dictionary=default&spellcheck=true&wt=xml&spellcheck.build=true} hits=10 status=0 QTime=148
   [junit4]   2> 1124920 INFO  (TEST-SpellCheckComponentTest.testReloadOnStart-seed#[5DDC36407C02487C]) [    ] o.a.s.h.c.SpellCheckComponent Initializing spell checkers
   [junit4]   2> 1124927 INFO  (TEST-SpellCheckComponentTest.testReloadOnStart-seed#[5DDC36407C02487C]) [    ] o.a.s.SolrTestCaseJ4 ###Ending testReloadOnStart
   [junit4]   2> 1124927 INFO  (TEST-SpellCheckComponentTest.testReloadOnStart-seed#[5DDC36407C02487C]) [    ] o.a.s.u.DirectUpdateHandler2 [collection1] REMOVING ALL DOCUMENTS FROM INDEX
   [junit4]   2> 1124927 INFO  (TEST-SpellCheckComponentTest.testReloadOnStart-seed#[5DDC36407C02487C]) [    ] o.a.s.u.p.LogUpdateProcessorFactory [collection1]  webapp=null path=null params={}{deleteByQuery=*:*} 0 0
   [junit4]   2> 1124928 INFO  (TEST-SpellCheckComponentTest.testReloadOnStart-seed#[5DDC36407C02487C]) [    ] o.a.s.u.DirectUpdateHandler2 start commit{,optimize=false,openSearcher=true,waitSearcher=true,expungeDeletes=false,softCommit=false,prepareCommit=false}
   [junit4]   2> 1124928 INFO  (TEST-SpellCheckComponentTest.testReloadOnStart-seed#[5DDC36407C02487C]) [    ] o.a.s.u.SolrIndexWriter Calling setCommitData with IW:org.apache.solr.update.SolrIndexWriter@77af562d
   [junit4]   2> 1124928 INFO  (TEST-SpellCheckComponentTest.testReloadOnStart-seed#[5DDC36407C02487C]) [    ] o.a.s.s.SolrIndexSearcher Opening [Searcher@295d7fa4[collection1] main]
   [junit4]   2> 1124928 INFO  (TEST-SpellCheckComponentTest.testReloadOnStart-seed#[5DDC36407C02487C]) [    ] o.a.s.u.DirectUpdateHandler2 end_commit_flush
   [junit4]   2> 1124928 INFO  (searcherExecutor-4753-thread-1) [    ] o.a.s.h.c.SpellCheckComponent Building spell index for spell checker: default
   [junit4]   2> 1125016 INFO  (searcherExecutor-4753-thread-1) [    ] o.a.s.h.c.SpellCheckComponent Building spell index for spell checker: default_teststop
   [junit4]   2> 1125069 INFO  (searcherExecutor-4753-thread-1) [    ] o.a.s.h.c.SpellCheckComponent Building spell index for spell checker: threshold
   [junit4]   2> 1125121 INFO  (searcherExecutor-4753-thread-1) [    ] o.a.s.h.c.SpellCheckComponent Building spell index for spell checker: threshold_direct
   [junit4]   2> 1125121 INFO  (searcherExecutor-4753-thread-1) [    ] o.a.s.h.c.SpellCheckComponent Building spell index for spell checker: multipleFields
   [junit4]   2> 1125153 INFO  (searcherExecutor-4753-thread-1) [    ] o.a.s.h.c.SpellCheckComponent Building spell index for spell checker: freq
   [junit4]   2> 1125203 INFO  (searcherExecutor-4753-thread-1) [    ] o.a.s.h.c.SpellCheckComponent Building spell index for spell checker: fqcn
   [junit4]   2> 1125265 INFO  (searcherExecutor-4753-thread-1) [    ] o.a.s.c.SolrCore [collection1] Registered new searcher Searcher@295d7fa4[collection1] main{ExitableDirectoryReader(UninvertingDirectoryReader())}
   [junit4]   2> 1125265 INFO  (TEST-SpellCheckComponentTest.testReloadOnStart-seed#[5DDC36407C02487C]) [    ] o.a.s.u.p.LogUpdateProcessorFactory [collection1]  webapp=null path=null params={}{commit=} 0 337
   [junit4]   2> 1125267 INFO  (TEST-SpellCheckComponentTest.testPerDictionary-seed#[5DDC36407C02487C]) [    ] o.a.s.SolrTestCaseJ4 ###Starting testPerDictionary
   [junit4]   2> 1125268 INFO  (TEST-SpellCheckComponentTest.testPerDictionary-seed#[5DDC36407C02487C]) [    ] o.a.s.u.p.LogUpdateProcessorFactory [collection1]  webapp=null path=null params={}{add=[0]} 0 0
   [junit4]   2> 1125268 INFO  (TEST-SpellCheckComponentTest.testPerDictionary-seed#[5DDC36407C02487C]) [    ] o.a.s.u.p.LogUpdateProcessorFactory [collection1]  webapp=null path=null params={}{add=[1]} 0 0
   [junit4]   2> 1125269 INFO  (TEST-SpellCheckComponentTest.testPerDictionary-seed#[5DDC36407C02487C]) [    ] o.a.s.u.p.LogUpdateProcessorFactory [collection1]  webapp=null path=null params={}{add=[2]} 0 0
   [junit4]   2> 1125269 INFO  (TEST-SpellCheckComponentTest.testPerDictionary-seed#[5DDC36407C02487C]) [    ] o.a.s.u.p.LogUpdateProcessorFactory [collection1]  webapp=null path=null params={}{add=[3]} 0 0
   [junit4]   2> 1125269 INFO  (TEST-SpellCheckComponentTest.testPerDictionary-seed#[5DDC36407C02487C]) [    ] o.a.s.u.p.LogUpdateProcessorFactory [collection1]  webapp=null path=null params={}{add=[4]} 0 0
   [junit4]   2> 1125270 INFO  (TEST-SpellCheckComponentTest.testPerDictionary-seed#[5DDC36407C02487C]) [    ] o.a.s.u.p.LogUpdateProcessorFactory [collection1]  webapp=null path=null params={}{add=[5]} 0 0
   [junit4]   2> 1125270 INFO  (TEST-SpellCheckComponentTest.testPerDictionary-seed#[5DDC36407C02487C]) [    ] o.a.s.u.p.LogUpdateProcessorFactory [collection1]  webapp=null path=null params={}{add=[6]} 0 0
   [junit4]   2> 1125270 INFO  (TEST-SpellCheckComponentTest.testPerDictionary-seed#[5DDC36407C02487C]) [    ] o.a.s.u.p.LogUpdateProcessorFactory [collection1]  webapp=null path=null params={}{add=[7]} 0 0
   [junit4]   2> 1125271 INFO  (TEST-SpellCheckComponentTest.testPerDictionary-seed#[5DDC36407C02487C]) [    ] o.a.s.u.p.LogUpdateProcessorFactory [collection1]  webapp=null path=null params={}{add=[8]} 0 0
   [junit4]   2> 1125271 INFO  (TEST-SpellCheckComponentTest.testPerDictionary-seed#[5DDC36407C02487C]) [    ] o.a.s.u.p.LogUpdateProcessorFactory [collection1]  webapp=null path=null params={}{add=[9]} 0 0
   [junit4]   2> 1125271 INFO  (TEST-SpellCheckComponentTest.testPerDictionary-seed#[5DDC36407C02487C]) [    ] o.a.s.u.DirectUpdateHandler2 start commit{,optimize=false,openSearcher=true,waitSearcher=true,expungeDeletes=false,softCommit=false,prepareCommit=false}
   [junit4]   2> 1125271 INFO  (TEST-SpellCheckComponentTest.testPerDictionary-seed#[5DDC36407C02487C]) [    ] o.a.s.u.SolrIndexWriter Calling setCommitData with IW:org.apache.solr.update.SolrIndexWriter@77af562d
   [junit4]   2> 1125274 INFO  (TEST-SpellCheckComponentTest.testPerDictionary-seed#[5DDC36407C02487C]) [    ] o.a.s.s.SolrIndexSearcher Opening [Searcher@46678fad[collection1] main]
   [junit4]   2> 1125275 INFO  (TEST-SpellCheckComponentTest.testPerDictionary-seed#[5DDC36407C02487C]) [    ] o.a.s.u.DirectUpdateHandler2 end_commit_flush
   [junit4]   2> 1125275 INFO  (searcherExecutor-4753-thread-1) [    ] o.a.s.h.c.SpellCheckComponent Building spell index for spell checker: default
   [junit4]   2> 1125453 INFO  (searcherExecutor-4753-thread-1) [    ] o.a.s.h.c.SpellCheckComponent Building spell index for spell checker: default_teststop
   [junit4]   2> 1125514 INFO  (searcherExecutor-4753-thread-1) [    ] o.a.s.h.c.SpellCheckComponent Building spell index for spell checker: threshold
   [junit4]   2> 1125669 INFO  (searcherExecutor-4753-thread-1) [    ] o.a.s.h.c.SpellCheckComponent Building spell index for spell checker: threshold_direct
   [junit4]   2> 1125669 INFO  (searcherExecutor-4753-thread-1) [    ] o.a.s.h.c.SpellCheckComponent Building spell index for spell checker: multipleFields
   [junit4]   2> 1125823 INFO  (searcherExecutor-4753-thread-1) [    ] o.a.s.h.c.SpellCheckComponent Building spell index for spell checker: freq
   [junit4]   2> 1126008 INFO  (searcherExecutor-4753-thread-1) [    ] o.a.s.h.c.SpellCheckComponent Building spell index for spell checker: fqcn
   [junit4]   2> 1126171 INFO  (searcherExecutor-4753-thread-1) [    ] o.a.s.c.SolrCore [collection1] Registered new searcher Searcher@46678fad[collection1] main{ExitableDirectoryReader(UninvertingDirectoryReader(Uninverting(_6(7.0.0):c10)))}
   [junit4]   2> 1126171 INFO  (TEST-SpellCheckComponentTest.testPerDictionary-seed#[5DDC36407C02487C]) [    ] o.a.s.u.p.LogUpdateProcessorFactory [collection1]  webapp=null path=null params={}{commit=} 0 899
   [junit4]   2> 1126172 INFO  (TEST-SpellCheckComponentTest.testPerDictionary-seed#[5DDC36407C02487C]) [    ] o.a.s.c.S.Request [collection1]  webapp=null path=null params={q=documemt&qt=spellCheckCompRH&spellcheck.dictionary=perDict&json.nl=map&spellcheck..perDict.foo=bar&spellcheck=true&spellcheck..perDict.bar=foo&wt=xml&spellcheck.build=true} hits=0 status=0 QTime=0
   [junit4]   2> 1126172 INFO  (TEST-SpellCheckComponentTest.testPerDictionary-seed#[5DDC36407C02487C]) [    ] o.a.s.SolrTestCaseJ4 ###Ending testPerDictionary
   [junit4]   2> 1126172 INFO  (TEST-SpellCheckComponentTest.testPerDictionary-seed#[5DDC36407C02487C]) [    ] o.a.s.u.DirectUpdateHandler2 [collection1] REMOVING ALL DOCUMENTS FROM INDEX
   [junit4]   2> 1126172 INFO  (TEST-SpellCheckComponentTest.testPerDictionary-seed#[5DDC36407C02487C]) [    ] o.a.s.u.p.LogUpdateProcessorFactory [collection1]  webapp=null path=null params={}{deleteByQuery=*:*} 0 0
   [junit4]   2> 1126172 INFO  (TEST-SpellCheckComponentTest.testPerDictionary-seed#[5DDC36407C02487C]) [    ] o.a.s.u.DirectUpdateHandler2 start commit{,optimize=false,openSearcher=true,waitSearcher=true,expungeDeletes=false,softCommit=false,prepareCommit=false}
   [junit4]   2> 1126172 INFO  (TEST-SpellCheckComponentTest.testPerDictionary-seed#[5DDC36407C02487C]) [    ] o.a.s.u.SolrIndexWriter Calling setCommitData with IW:org.apache.solr.update.SolrIndexWriter@77af562d
   [junit4]   2> 1126173 INFO  (TEST-SpellCheckComponentTest.testPerDictionary-seed#[5DDC36407C02487C]) [    ] o.a.s.s.SolrIndexSearcher Opening [Searcher@19bfda8[collection1] main]
   [junit4]   2> 1126173 INFO  (TEST-SpellCheckComponentTest.testPerDictionary-seed#[5DDC36407C02487C]) [    ] o.a.s.u.DirectUpdateHandler2 end_commit_flush
   [junit4]   2> 1126173 INFO  (searcherExecutor-4753-thread-1) [    ] o.a.s.h.c.SpellCheckComponent Building spell index for spell checker: default
   [junit4]   2> 1126240 INFO  (searcherExecutor-4753-thread-1) [    ] o.a.s.h.c.SpellCheckComponent Building spell index for spell checker: default_teststop
   [junit4]   2> 1126295 INFO  (searcherExecutor-4753-thread-1) [    ] o.a.s.h.c.SpellCheckComponent Building spell index for spell checker: threshold
   [junit4]   2> 1126344 INFO  (searcherExecutor-4753-thread-1) [    ] o.a.s.h.c.SpellCheckComponent Building spell index for spell checker: threshold_direct
   [junit4]   2> 1126344 INFO  (searcherExecutor-4753-thread-1) [    ] o.a.s.h.c.SpellCheckComponent Building spell index for spell checker: multipleFields
   [junit4]   2> 1126400 INFO  (searcherExecutor-4753-thread-1) [    ] o.a.s.h.c.SpellCheckComponent Building spell index for spell checker: freq
   [junit4]   2> 1126473 INFO  (searcherExecutor-4753-thread-1) [    ] o.a.s.h.c.SpellCheckComponent Building spell index for spell checker: fqcn
   [junit4]   2> 1126521 INFO  (searcherExecutor-4753-thread-1) [    ] o.a.s.c.SolrCore [collection1] Registered new searcher Searcher@19bfda8[collection1] main{ExitableDirectoryReader(UninvertingDirectoryReader())}
   [junit4]   2> 1126521 INFO  (TEST-SpellCheckComponentTest.testPerDictionary-seed#[5DDC36407C02487C]) [    ] o.a.s.u.p.LogUpdateProcessorFactory [collection1]  webapp=null path=null params={}{commit=} 0 348
   [junit4]   2> 1126523 INFO  (TEST-SpellCheckComponentTest.testRelativeIndexDirLocation-seed#[5DDC36407C02487C]) [    ] o.a.s.SolrTestCaseJ4 ###Starting testRelativeIndexDirLocation
   [junit4]   2> 1126523 INFO  (TEST-SpellCheckComponentTest.testRelativeIndexDirLocation-seed#[5DDC36407C02487C]) [    ] o.a.s.u.p.LogUpdateProcessorFactory [collection1]  webapp=null path=null params={}{add=[0]} 0 0
   [junit4]   2> 1126524 INFO  (TEST-SpellCheckComponentTest.testRelativeIndexDirLocation-seed#[5DDC36407C02487C]) [    ] o.a.s.u.p.LogUpdateProcessorFactory [collection1]  webapp=null path=null params={}{add=[1]} 0 0
   [junit4]   2> 1126524 INFO  (TEST-SpellCheckComponentTest.testRelativeIndexDirLocation-seed#[5DDC36407C02487C]) [    ] o.a.s.u.p.LogUpdateProcessorFactory [collection1]  webapp=null path=null params={}{add=[2]} 0 0
   [junit4]   2> 1126524 INFO  (TEST-SpellCheckComponentTest.testRelativeIndexDirLocation-seed#[5DDC36407C02487C]) [    ] o.a.s.u.p.LogUpdateProcessorFactory [collection1]  webapp=null path=null params={}{add=[3]} 0 0
   [junit4]   2> 1126525 INFO  (TEST-SpellCheckComponentTest.testRelativeIndexDirLocation-seed#[5DDC36407C02487C]) [    ] o.a.s.u.p.LogUpdateProcessorFactory [collection1]  webapp=null path=null params={}{add=[4]} 0 0
   [junit4]   2> 1126525 INFO  (TEST-SpellCheckComponentTest.testRelativeIndexDirLocation-seed#[5DDC36407C02487C]) [    ] o.a.s.u.p.LogUpdateProcessorFactory [collection1]  webapp=null path=null params={}{add=[5]} 0 0
   [junit4]   2> 1126525 INFO  (TEST-SpellCheckComponentTest.testRelativeIndexDirLocation-seed#[5DDC36407C02487C]) [    ] o.a.s.u.p.LogUpdateProcessorFactory [collection1]  webapp=null path=null params={}{add=[6]} 0 0
   [junit4]   2> 1126525 INFO  (TEST-SpellCheckComponentTest.testRelativeIndexDirLocation-seed#[5DDC36407C02487C]) [    ] o.a.s.u.p.LogUpdateProcessorFactory [collection1]  webapp=null path=null params={}{add=[7]} 0 0
   [junit4]   2> 1126526 INFO  (TEST-SpellCheckComponentTest.testRelativeIndexDirLocation-seed#[5DDC36407C02487C]) [    ] o.a.s.u.p.LogUpdateProcessorFactory [collection1]  webapp=null path=null params={}{add=[8]} 0 0
   [junit4]   2> 1126526 INFO  (TEST-SpellCheckComponentTest.testRelativeIndexDirLocation-seed#[5DDC36407C02487C]) [    ] o.a.s.u.p.LogUpdateProcessorFactory [collection1]  webapp=null path=null params={}{add=[9]} 0 0
   [junit4]   2> 1126526 INFO  (TEST-SpellCheckComponentTest.testRelativeIndexDirLocation-seed#[5DDC36407C02487C]) [    ] o.a.s.u.DirectUpdateHandler2 start commit{,optimize=false,openSearcher=true,waitSearcher=true,expungeDeletes=false,softCommit=false,prepareCommit=false}
   [junit4]   2> 1126526 INFO  (TEST-SpellCheckComponentTest.testRelativeIndexDirLocation-seed#[5DDC36407C02487C]) [    ] o.a.s.u.SolrIndexWriter Calling setCommitData with IW:org.apache.solr.update.SolrIndexWriter@77af562d
   [junit4]   2> 1126530 INFO  (TEST-SpellCheckComponentTest.testRelativeIndexDirLocation-seed#[5DDC36407C02487C]) [    ] o.a.s.s.SolrIndexSearcher Opening [Searcher@1cdbe61e[collection1] main]
   [junit4]   2> 1126530 INFO  (TEST-SpellCheckComponentTest.testRelativeIndexDirLocation-seed#[5DDC36407C02487C]) [    ] o.a.s.u.DirectUpdateHandler2 end_commit_flush
   [junit4]   2> 1126530 INFO  (searcherExecutor-4753-thread-1) [    ] o.a.s.h.c.SpellCheckComponent Building spell index for spell checker: default
   [junit4]   2> 1126726 INFO  (searcherExecutor-4753-thread-1) [    ] o.a.s.h.c.SpellCheckComponent Building spell index for spell checker: default_teststop
   [junit4]   2> 1126770 INFO  (searcherExecutor-4753-thread-1) [    ] o.a.s.h.c.SpellCheckComponent Building spell index for spell checker: threshold
   [junit4]   2> 1126909 INFO  (searcherExecutor-4753-thread-1) [    ] o.a.s.h.c.SpellCheckComponent Building spell index for spell checker: threshold_direct
   [junit4]   2> 1126909 INFO  (searcherExecutor-4753-thread-1) [    ] o.a.s.h.c.SpellCheckComponent Building spell index for spell checker: multipleFields
   [junit4]   2> 1127063 INFO  (searcherExecutor-4753-thread-1) [    ] o.a.s.h.c.SpellCheckComponent Building spell index for spell checker: freq
   [junit4]   2> 1127227 INFO  (searcherExecutor-4753-thread-1) [    ] o.a.s.h.c.SpellCheckComponent Building spell index for spell checker: fqcn
   [junit4]   2> 1127345 INFO  (searcherExecutor-4753-thread-1) [    ] o.a.s.c.SolrCore [collection1] Registered new searcher Searcher@1cdbe61e[collection1] main{ExitableDirectoryReader(UninvertingDirectoryReader(Uninverting(_7(7.0.0):c10)))}
   [junit4]   2> 1127345 INFO  (TEST-SpellCheckComponentTest.testRelativeIndexDirLocation-seed#[5DDC36407C02487C]) [    ] o.a.s.u.p.LogUpdateProcessorFactory [collection1]  webapp=null path=null params={}{commit=} 0 818
   [junit4]   2> 1127346 INFO  (TEST-SpellCheckComponentTest.testRelativeIndexDirLocation-seed#[5DDC36407C02487C]) [    ] o.a.s.SolrTestCaseJ4 ###Ending testRelativeIndexDirLocation
   [junit4]   2> 1127346 INFO  (TEST-SpellCheckComponentTest.testRelativeIndexDirLocation-seed#[5DDC36407C02487C]) [    ] o.a.s.u.DirectUpdateHandler2 [collection1] REMOVING ALL DOCUMENTS FROM INDEX
   [junit4]   2> 1127346 INFO  (TEST-SpellCheckComponentTest.testRelativeIndexDirLocation-seed#[5DDC36407C02487C]) [    ] o.a.s.u.p.LogUpdateProcessorFactory [collection1]  webapp=null path=null params={}{deleteByQuery=*:*} 0 0
   [junit4]   2> 1127347 INFO  (TEST-SpellCheckComponentTest.testRelativeIndexDirLocation-seed#[5DDC36407C02487C]) [    ] o.a.s.u.DirectUpdateHandler2 start commit{,optimize=false,openSearcher=true,waitSearcher=true,expungeDeletes=false,softCommit=false,prepareCommit=false}
   [junit4]   2> 1127347 INFO  (TEST-SpellCheckComponentTest.testRelativeIndexDirLocation-seed#[5DDC36407C02487C]) [    ] o.a.s.u.SolrIndexWriter Calling setCommitData with IW:org.apache.solr.update.SolrIndexWriter@77af562d
   [junit4]   2> 1127347 INFO  (TEST-SpellCheckComponentTest.testRelativeIndexDirLocation-seed#[5DDC36407C02487C]) [    ] o.a.s.s.SolrIndexSearcher Opening [Searcher@6a0a73[collection1] main]
   [junit4]   2> 1127347 INFO  (searcherExecutor-4753-thread-1) [    ] o.a.s.h.c.SpellCheckComponent Building spell index for spell checker: default
   [junit4]   2> 1127347 INFO  (TEST-SpellCheckComponentTest.testRelativeIndexDirLocation-seed#[5DDC36407C02487C]) [    ] o.a.s.u.DirectUpdateHandler2 end_commit_flush
   [junit4]   2> 1127385 INFO  (searcherExecutor-4753-thread-1) [    ] o.a.s.h.c.SpellCheckComponent Building spell index for spell checker: default_teststop
   [junit4]   2> 1127434 INFO  (searcherExecutor-4753-thread-1) [    ] o.a.s.h.c.SpellCheckComponent Building spell index for spell checker: threshold
   [junit4]   2> 1127476 INFO  (searcherExecutor-4753-thread-1) [    ] o.a.s.h.c.SpellCheckComponent Building spell index for spell checker: threshold_direct
   [junit4]   2> 1127476 INFO  (searcherExecutor-4753-thread-1) [    ] o.a.s.h.c.SpellCheckComponent Building spell index for spell checker: multipleFields
   [junit4]   2> 1127551 INFO  (searcherExecutor-4753-thread-1) [    ] o.a.s.h.c.SpellCheckComponent Building spell index for spell checker: freq
   [junit4]   2> 1127582 INFO  (searcherExecutor-4753-thread-1) [    ] o.a.s.h.c.SpellCheckComponent Building spell index for spell checker: fqcn
   [junit4]   2> 1127641 INFO  (searcherExecutor-4753-thread-1) [    ] o.a.s.c.SolrCore [collection1] Registered new searcher Searcher@6a0a73[collection1] main{ExitableDirectoryReader(UninvertingDirectoryReader())}
   [junit4]   2> 1127641 INFO  (TEST-SpellCheckComponentTest.testRelativeIndexDirLocation-seed#[5DDC36407C02487C]) [    ] o.a.s.u.p.LogUpdateProcessorFactory [collection1]  webapp=null path=null params={}{commit=} 0 294
   [junit4]   2> 1127643 INFO  (TEST-SpellCheckComponentTest.testCorrectSpelling-seed#[5DDC36407C02487C]) [    ] o.a.s.SolrTestCaseJ4 ###Starting testCorrectSpelling
   [junit4]   2> 1127643 INFO  (TEST-SpellCheckComponentTest.testCorrectSpelling-seed#[5DDC36407C02487C]) [    ] o.a.s.u.p.LogUpdateProcessorFactory [collection1]  webapp=null path=null params={}{add=[0]} 0 0
   [junit4]   2> 1127644 INFO  (TEST-SpellCheckComponentTest.testCorrectSpelling-seed#[5DDC36407C02487C]) [    ] o.a.s.u.p.LogUpdateProcessorFactory [collection1]  webapp=null path=null params={}{add=[1]} 0 0
   [junit4]   2> 1127644 INFO  (TEST-SpellCheckComponentTest.testCorrectSpelling-seed#[5DDC36407C02487C]) [    ] o.a.s.u.p.LogUpdateProcessorFactory [collection1]  webapp=null path=null params={}{add=[2]} 0 0
   [junit4]   2> 1127644 INFO  (TEST-SpellCheckComponentTest.testCorrectSpelling-seed#[5DDC36407C02487C]) [    ] o.a.s.u.p.LogUpdateProcessorFactory [collection1]  webapp=null path=null params={}{add=[3]} 0 0
   [junit4]   2> 1127645 INFO  (TEST-SpellCheckComponentTest.testCorrectSpelling-seed#[5DDC36407C02487C]) [    ] o.a.s.u.p.LogUpdateProcessorFactory [collection1]  webapp=null path=null params={}{add=[4]} 0 0
   [junit4]   2> 1127645 INFO  (TEST-SpellCheckComponentTest.testCorrectSpelling-seed#[5DDC36407C02487C]) [    ] o.a.s.u.p.LogUpdateProcessorFactory [collection1]  webapp=null path=null params={}{add=[5]} 0 0
   [junit4]   2> 1127645 INFO  (TEST-SpellCheckComponentTest.testCorrectSpelling-seed#[5DDC36407C02487C]) [    ] o.a.s.u.p.LogUpdateProcessorFactory [collection1]  webapp=null path=null params={}{add=[6]} 0 0
   [junit4]   2> 1127645 INFO  (TEST-SpellCheckComponentTest.testCorrectSpelling-seed#[5DDC36407C02487C]) [    ] o.a.s.u.p.LogUpdateProcessorFactory [collection1]  webapp=null path=null params={}{add=[7]} 0 0
   [junit4]   2> 1127646 INFO  (TEST-SpellCheckComponentTest.testCorrectSpelling-seed#[5DDC36407C02487C]) [    ] o.a.s.u.p.LogUpdateProcessorFactory [collection1]  webapp=null path=null params={}{add=[8]} 0 0
   [junit4]   2> 1127646 INFO  (TEST-SpellCheckComponentTest.testCorrectSpelling-seed#[5DDC36407C02487C]) [    ] o.a.s.u.p.LogUpdateProcessorFactory [collection1]  webapp=null path=null params={}{add=[9]} 0 0
   [junit4]   2> 1127646 INFO  (TEST-SpellCheckComponentTest.testCorrectSpelling-seed#[5DDC36407C02487C]) [    ] o.a.s.u.DirectUpdateHandler2 start commit{,optimize=false,openSearcher=true,waitSearcher=true,expungeDeletes=false,softCommit=false,prepareCommit=false}
   [junit4]   2> 1127646 INFO  (TEST-SpellCheckComponentTest.testCorrectSpelling-seed#[5DDC36407C02487C]) [    ] o.a.s.u.SolrIndexWriter Calling setCommitData with IW:org.apache.solr.update.SolrIndexWriter@77af562d
   [junit4]   2> 1127649 INFO  (TEST-SpellCheckComponentTest.testCorrectSpelling-seed#[5DDC36407C02487C]) [    ] o.a.s.s.SolrIndexSearcher Opening [Searcher@6c62288e[collection1] main]
   [junit4]   2> 1127649 INFO  (TEST-SpellCheckComponentTest.testCorrectSpelling-seed#[5DDC36407C02487C]) [    ] o.a.s.u.DirectUpdateHandler2 end_commit_flush
   [junit4]   2> 1127649 INFO  (searcherExecutor-4753-thread-1) [    ] o.a.s.h.c.SpellCheckComponent Building spell index for spell checker: default
   [junit4]   2> 1127776 INFO  (searcherExecutor-4753-thread-1) [    ] o.a.s.h.c.SpellCheckComponent Building spell index for spell checker: default_teststop
   [junit4]   2> 1127816 INFO  (searcherExecutor-4753-thread-1) [    ] o.a.s.h.c.SpellCheckComponent Building spell index for spell checker: threshold
   [junit4]   2> 1127979 INFO  (searcherExecutor-4753-thread-1) [    ] o.a.s.h.c.SpellCheckComponent Building spell index for spell checker: threshold_direct
   [junit4]   2> 1127979 INFO  (searcherExecutor-4753-thread-1) [    ] o.a.s.h.c.SpellCheckComponent Building spell index for spell checker: multipleFields
   [junit4]   2> 1128163 INFO  (searcherExecutor-4753-thread-1) [    ] o.a.s.h.c.SpellCheckComponent Building spell index for spell checker: freq
   [junit4]   2> 1128346 INFO  (searcherExecutor-4753-thread-1) [    ] o.a.s.h.c.SpellCheckComponent Building spell index for spell checker: fqcn
   [junit4]   2> 1128508 INFO  (searcherExecutor-4753-thread-1) [    ] o.a.s.c.SolrCore [collection1] Registered new searcher Searcher@6c62288e[collection1] main{ExitableDirectoryReader(UninvertingDirectoryReader(Uninverting(_8(7.0.0):c10)))}
   [junit4]   2> 1128508 INFO  (TEST-SpellCheckComponentTest.testCorrectSpelling-seed#[5DDC36407C02487C]) [    ] o.a.s.u.p.LogUpdateProcessorFactory [collection1]  webapp=null path=null params={}{commit=} 0 861
   [junit4]   2> 1128509 INFO  (TEST-SpellCheckComponentTest.testCorrectSpelling-seed#[5DDC36407C02487C]) [    ] o.a.s.c.S.Request [collection1]  webapp=null path=null params={q=lowerfilt:lazy+lowerfilt:brown&qt=spellCheckCompRH&json.nl=map&spellcheck=true&wt=xml&spellcheck.extendedResults=true} hits=1 status=0 QTime=0
   [junit4]   2> 1128510 INFO  (TEST-SpellCheckComponentTest.testCorrectSpelling-seed#[5DDC36407C02487C]) [    ] o.a.s.c.S.Request [collection1]  webapp=null path=null params={q=lowerfilt:lazy+lowerfilt:brown&qt=spellCheckCompRH&spellcheck.dictionary=direct_lowerfilt&json.nl=map&spellcheck=true&wt=xml&spellcheck.extendedResults=true} hits=1 status=0 QTime=0
   [junit4]   2> 1128511 INFO  (TEST-SpellCheckComponentTest.testCorrectSpelling-seed#[5DDC36407C02487C]) [    ] o.a.s.c.S.Request [collection1]  webapp=null path=null params={q=lakkle&qt=spellCheckCompRH&spellcheck.dictionary=direct_lowerfilt&json.nl=map&spellcheck=true&wt=xml&spellcheck.extendedResults=true} hits=0 status=0 QTime=1
   [junit4]   2> 1128511 INFO  (TEST-SpellCheckComponentTest.testCorrectSpelling-seed#[5DDC36407C02487C]) [    ] o.a.s.SolrTestCaseJ4 ###Ending testCorrectSpelling
   [junit4]   2> 1128511 INFO  (TEST-SpellCheckComponentTest.testCorrectSpelling-seed#[5DDC36407C02487C]) [    ] o.a.s.u.DirectUpdateHandler2 [collection1] REMOVING ALL DOCUMENTS FROM INDEX
   [junit4]   2> 1128511 INFO  (TEST-SpellCheckComponentTest.testCorrectSpelling-seed#[5DDC36407C02487C]) [    ] o.a.s.u.p.LogUpdateProcessorFactory [collection1]  webapp=null path=null params={}{deleteByQuery=*:*} 0 0
   [junit4]   2> 1128512 INFO  (TEST-SpellCheckComponentTest.testCorrectSpelling-seed#[5DDC36407C02487C]) [    ] o.a.s.u.DirectUpdateHandler2 start commit{,optimize=false,openSearcher=true,waitSearcher=true,expungeDeletes=false,softCommit=false,prepareCommit=false}
   [junit4]   2> 1128512 INFO  (TEST-SpellCheckComponentTest.testCorrectSpelling-seed#[5DDC36407C02487C]) [    ] o.a.s.u.SolrIndexWriter Calling setCommitData with IW:org.apache.solr.update.SolrIndexWriter@77af562d
   [junit4]   2> 1128512 INFO  (TEST-SpellCheckComponentTest.testCorrectSpelling-seed#[5DDC36407C02487C]) [    ] o.a.s.s.SolrIndexSearcher Opening [Searcher@2f692c2c[collection1] main]
   [junit4]   2> 1128512 INFO  (TEST-SpellCheckComponentTest.testCorrectSpelling-seed#[5DDC36407C02487C]) [    ] o.a.s.u.DirectUpdateHandler2 end_commit_flush
   [junit4]   2> 1128512 INFO  (searcherExecutor-4753-thread-1) [    ] o.a.s.h.c.SpellCheckComponent Building spell index for spell checker: default
   [junit4]   2> 1128568 INFO  (searcherExecutor-4753-thread-1) [    ] o.a.s.h.c.SpellCheckComponent Building spell index for spell checker: default_teststop
   [junit4]   2> 1128611 INFO  (searcherExecutor-4753-thread-1) [    ] o.a.s.h.c.SpellCheckComponent Building spell index for spell checker: threshold
   [junit4]   2> 1128677 INFO  (searcherExecutor-4753-thread-1) [    ] o.a.s.h.c.SpellCheckComponent Building spell index for spell checker: threshold_direct
   [junit4]   2> 1128678 INFO  (searcherExecutor-4753-thread-1) [    ] o.a.s.h.c.SpellCheckComponent Building spell index for spell checker: multipleFields
   [junit4]   2> 1128753 INFO  (searcherExecutor-4753-thread-1) [    ] o.a.s.h.c.SpellCheckComponent Building spell index for spell checker: freq
   [junit4]   2> 1128859 INFO  (searcherExecutor-4753-thread-1) [    ] o.a.s.h.c.SpellCheckComponent Building spell index for spell checker: fqcn
   [junit4]   2> 1128949 INFO  (searcherExecutor-4753-thread-1) [    ] o.a.s.c.SolrCore [collection1] Registered new searcher Searcher@2f692c2c[collection1] main{ExitableDirectoryReader(UninvertingDirectoryReader())}
   [junit4]   2> 1128949 INFO  (TEST-SpellCheckComponentTest.testCorrectSpelling-seed#[5DDC36407C02487C]) [    ] o.a.s.u.p.LogUpdateProcessorFactory [collection1]  webapp=null path=null params={}{commit=} 0 437
   [junit4]   2> 1128950 INFO  (TEST-SpellCheckComponentTest.testNumericQuery-seed#[5DDC36407C02487C]) [    ] o.a.s.SolrTestCaseJ4 ###Starting testNumericQuery
   [junit4]   2> 1128951 INFO  (TEST-SpellCheckComponentTest.testNumericQuery-seed#[5DDC36407C02487C]) [    ] o.a.s.u.p.LogUpdateProcessorFactory [collection1]  webapp=null path=null params={}{add=[0]} 0 0
   [junit4]   2> 1128951 INFO  (TEST-SpellCheckComponentTest.testNumericQuery-seed#[5DDC36407C02487C]) [    ] o.a.s.u.p.LogUpdateProcessorFactory [collection1]  webapp=null path=null params={}{add=[1]} 0 0
   [junit4]   2> 1128951 INFO  (TEST-SpellCheckComponentTest.testNumericQuery-seed#[5DDC36407C02487C]) [    ] o.a.s.u.p.LogUpdateProcessorFactory [collection1]  webapp=null path=null params={}{add=[2]} 0 0
   [junit4]   2> 1128952 INFO  (TEST-SpellCheckComponentTest.testNumericQuery-seed#[5DDC36407C02487C]) [    ] o.a.s.u.p.LogUpdateProcessorFactory [collection1]  webapp=null path=null params={}{add=[3]} 0 0
   [junit4]   2> 1128952 INFO  (TEST-SpellCheckComponentTest.testNumericQuery-seed#[5DDC36407C02487C]) [    ] o.a.s.u.p.LogUpdateProcessorFactory [collection1]  webapp=null path=null params={}{add=[4]} 0 0
   [junit4]   2> 1128952 INFO  (TEST-SpellCheckComponentTest.testNumericQuery-seed#[5DDC36407C02487C]) [    ] o.a.s.u.p.LogUpdateProcessorFactory [collection1]  webapp=null path=null params={}{add=[5]} 0 0
   [junit4]   2> 1128952 INFO  (TEST-SpellCheckComponentTest.testNumericQuery-seed#[5DDC36407C02487C]) [    ] o.a.s.u.p.LogUpdateProcessorFactory [collection1]  webapp=null path=null params={}{add=[6]} 0 0
   [junit4]   2> 1128952 INFO  (TEST-SpellCheckComponentTest.testNumericQuery-seed#[5DDC36407C02487C]) [    ] o.a.s.u.p.LogUpdateProcessorFactory [collection1]  webapp=null path=null params={}{add=[7]} 0 0
   [junit4]   2> 1128953 INFO  (TEST-SpellCheckComponentTest.testNumericQuery-seed#[5DDC36407C02487C]) [    ] o.a.s.u.p.LogUpdateProcessorFactory [collection1]  webapp=null path=null params={}{add=[8]} 0 0
   [junit4]   2> 1128953 INFO  (TEST-SpellCheckComponentTest.testNumericQuery-seed#[5DDC36407C02487C]) [    ] o.a.s.u.p.LogUpdateProcessorFactory [collection1]  webapp=null path=null params={}{add=[9]} 0 0
   [junit4]   2> 1128953 INFO  (TEST-SpellCheckComponentTest.testNumericQuery-seed#[5DDC36407C02487C]) [    ] o.a.s.u.DirectUpdateHandler2 start commit{,optimize=false,openSearcher=true,waitSearcher=true,expungeDeletes=false,softCommit=false,prepareCommit=false}
   [junit4]   2> 1128953 INFO  (TEST-SpellCheckComponentTest.testNumericQuery-seed#[5DDC36407C02487C]) [    ] o.a.s.u.SolrIndexWriter Calling setCommitData with IW:org.apache.solr.update.SolrIndexWriter@77af562d
   [junit4]   2> 1128955 INFO  (TEST-SpellCheckComponentTest.testNumericQuery-seed#[5DDC36407C02487C]) [    ] o.a.s.s.SolrIndexSearcher Opening [Searcher@7eb314a[collection1] main]
   [junit4]   2> 1128955 INFO  (TEST-SpellCheckComponentTest.testNumericQuery-seed#[5DDC36407C02487C]) [    ] o.a.s.u.DirectUpdateHandler2 end_commit_flush
   [junit4]   2> 1128955 INFO  (searcherExecutor-4753-thread-1) [    ] o.a.s.h.c.SpellCheckComponent Building spell index for spell checker: default
   [junit4]   2> 1129231 INFO  (searcherExecutor-4753-thread-1) [    ] o.a.s.h.c.SpellCheckComponent Building spell index for spell checker: default_teststop
   [junit4]   2> 1129323 INFO  (searcherExecutor-4753-thread-1) [    ] o.a.s.h.c.SpellCheckComponent Building spell index for spell checker: threshold
   [junit4]   2> 1129554 INFO  (searcherExecutor-4753-thread-1) [    ] o.a.s.h.c.SpellCheckComponent Building spell index for spell checker: threshold_direct
   [junit4]   2> 1129554 INFO  (searcherExecutor-4753-thread-1) [    ] o.a.s.h.c.SpellCheckComponent Building spell index for spell checker: multipleFields
   [junit4]   2> 1129719 INFO  (searcherExecutor-4753-thread-1) [    ] o.a.s.h.c.SpellCheckComponent Building spell index for spell checker: freq
   [junit4]   2> 1129843 INFO  (searcherExecutor-4753-thread-1) [    ] o.a.s.h.c.SpellCheckComponent Building spell index for spell checker: fqcn
   [junit4]   2> 1130040 INFO  (searcherExecutor-4753-thread-1) [    ] o.a.s.c.SolrCore [collection1] Registered new searcher Searcher@7eb314a[collection1] main{ExitableDirectoryReader(UninvertingDirectoryReader(Uninverting(_9(7.0.0):c10)))}
   [junit4]   2> 1130040 INFO  (TEST-SpellCheckComponentTest.testNumericQuery-seed#[5DDC36407C02487C]) [    ] o.a.s.u.p.LogUpdateProcessorFactory [collection1]  webapp=null path=null params={}{commit=} 0 1086
   [junit4]   2> 1130041 INFO  (TEST-SpellCheckComponentTest.testNumericQuery-seed#[5DDC36407C02487C]) [    ] o.a.s.c.S.Request [collection1]  webapp=null path=null params={q=12346&qt=spellCheckCompRH&spellcheck=true&wt=xml} hits=0 status=0 QTime=1
   [junit4]   2> 1130042 INFO  (TEST-SpellCheckComponentTest.testNumericQuery-seed#[5DDC36407C02487C]) [    ] o.a.s.SolrTestCaseJ4 ###Ending testNumericQuery
   [junit4]   2> 1130042 INFO  (TEST-SpellCheckComponentTest.testNumericQuery-seed#[5DDC36407C02487C]) [    ] o.a.s.u.DirectUpdateHandler2 [collection1] REMOVING ALL DOCUMENTS FROM INDEX
   [junit4]   2> 1130042 INFO  (TEST-SpellCheckComponentTest.testNumericQuery-seed#[5DDC36407C02487C]) [    ] o.a.s.u.p.LogUpdateProcessorFactory [collection1]  webapp=null path=null params={}{deleteByQuery=*:*} 0 0
   [junit4]   2> 1130043 INFO  (TEST-SpellCheckComponentTest.testNumericQuery-seed#[5DDC36407C02487C]) [    ] o.a.s.u.DirectUpdateHandler2 start commit{,optimize=false,openSearcher=true,waitSearcher=true,expungeDeletes=false,softCommit=false,prepareCommit=false}
   [junit4]   2> 1130043 INFO  (TEST-SpellCheckComponentTest.testNumericQuery-seed#[5DDC36407C02487C]) [    ] o.a.s.u.SolrIndexWriter Calling setCommitData with IW:org.apache.solr.update.SolrIndexWriter@77af562d
   [junit4]   2> 1130043 INFO  (TEST-SpellCheckComponentTest.testNumericQuery-seed#[5DDC36407C02487C]) [    ] o.a.s.s.SolrIndexSearcher Opening [Searcher@5c71c033[collection1] main]
   [junit4]   2> 1130043 INFO  (TEST-SpellCheckComponentTest.testNumericQuery-seed#[5DDC36407C02487C]) [    ] o.a.s.u.DirectUpdateHandler2 end_commit_flush
   [junit4]   2> 1130043 INFO  (searcherExecutor-4753-thread-1) [    ] o.a.s.h.c.SpellCheckComponent Building spell index for spell checker: default
   [junit4]   2> 1130097 INFO  (searcherExecutor-4753-thread-1) [    ] o.a.s.h.c.SpellCheckComponent Building spell index for spell checker: default_teststop
   [junit4]   2> 1130170 INFO  (searcherExecutor-4753-thread-1) [    ] o.a.s.h.c.SpellCheckComponent Building spell index for spell checker: threshold
   [junit4]   2> 1130234 INFO  (searcherExecutor-4753-thread-1) [    ] o.a.s.h.c.SpellCheckComponent Building spell index for spell checker: threshold_direct
   [junit4]   2> 1130234 INFO  (searcherExecutor-4753-thread-1) [    ] o.a.s.h.c.SpellCheckComponent Building spell index for spell checker: multipleFields
   [junit4]   2> 1130299 INFO  (searcherExecutor-4753-thread-1) [    ] o.a.s.h.c.SpellCheckComponent Building spell index for spell checker: freq
   [junit4]   2> 1130398 INFO  (searcherExecutor-4753-thread-1) [    ] o.a.s.h.c.SpellCheckComponent Building spell index for spell checker: fqcn
   [junit4]   2> 1130481 INFO  (searcherExecutor-4753-thread-1) [    ] o.a.s.c.SolrCore [collection1] Registered new searcher Searcher@5c71c033[collection1] main{ExitableDirectoryReader(UninvertingDirectoryReader())}
   [junit4]   2> 1130481 INFO  (TEST-SpellCheckComponentTest.testNumericQuery-seed#[5DDC36407C02487C]) [    ] o.a.s.u.p.LogUpdateProcessorFactory [collection1]  webapp=null path=null params={}{commit=} 0 438
   [junit4]   2> 1130483 INFO  (TEST-SpellCheckComponentTest.testMaximumResultsForSuggest-seed#[5DDC36407C02487C]) [    ] o.a.s.SolrTestCaseJ4 ###Starting testMaximumResultsForSuggest
   [junit4]   2> 1130483 INFO  (TEST-SpellCheckComponentTest.testMaximumResultsForSuggest-seed#[5DDC36407C02487C]) [    ] o.a.s.u.p.LogUpdateProcessorFactory [collection1]  webapp=null path=null params={}{add=[0]} 0 0
   [junit4]   2> 1130484 INFO  (TEST-SpellCheckComponentTest.testMaximumResultsForSuggest-seed#[5DDC36407C02487C]) [    ] o.a.s.u.p.LogUpdateProcessorFactory [collection1]  webapp=null path=null params={}{add=[1]} 0 0
   [junit4]   2> 1130484 INFO  (TEST-SpellCheckComponentTest.testMaximumResultsForSuggest-seed#[5DDC36407C02487C]) [    ] o.a.s.u.p.LogUpdateProcessorFactory [collection1]  webapp=null path=null params={}{add=[2]} 0 0
   [junit4]   2> 1130485 INFO  (TEST-SpellCheckComponentTest.testMaximumResultsForSuggest-seed#[5DDC36407C02487C]) [    ] o.a.s.u.p.LogUpdateProcessorFactory [collection1]  webapp=null path=null params={}{add=[3]} 0 0
   [junit4]   2> 1130485 INFO  (TEST-SpellCheckComponentTest.testMaximumResultsForSuggest-seed#[5DDC36407C02487C]) [    ] o.a.s.u.p.LogUpdateProcessorFactory [collection1]  webapp=null path=null params={}{add=[4]} 0 0
   [junit4]   2> 1130486 INFO  (TEST-SpellCheckComponentTest.testMaximumResultsForSuggest-seed#[5DDC36407C02487C]) [    ] o.a.s.u.p.LogUpdateProcessorFactory [collection1]  webapp=null path=null params={}{add=[5]} 0 0
   [junit4]   2> 1130486 INFO  (TEST-SpellCheckComponentTest.testMaximumResultsForSuggest-seed#[5DDC36407C02487C]) [    ] o.a.s.u.p.LogUpdateProcessorFactory [collection1]  webapp=null path=null params={}{add=[6]} 0 0
   [junit4]   2> 1130486 INFO  (TEST-SpellCheckComponentTest.testMaximumResultsForSuggest-seed#[5DDC36407C02487C]) [    ] o.a.s.u.p.LogUpdateProcessorFactory [collection1]  webapp=null path=null params={}{add=[7]} 0 0
   [junit4]   2> 1130487 INFO  (TEST-SpellCheckComponentTest.testMaximumResultsForSuggest-seed#[5DDC36407C02487C]) [    ] o.a.s.u.p.LogUpdateProcessorFactory [collection1]  webapp=null path=null params={}{add=[8]} 0 0
   [junit4]   2> 1130487 INFO  (TEST-SpellCheckComponentTest.testMaximumResultsForSuggest-seed#[5DDC36407C02487C]) [    ] o.a.s.u.p.LogUpdateProcessorFactory [collection1]  webapp=null path=null params={}{add=[9]} 0 0
   [junit4]   2> 1130487 INFO  (TEST-SpellCheckComponentTest.testMaximumResultsForSuggest-seed#[5DDC36407C02487C]) [    ] o.a.s.u.DirectUpdateHandler2 start commit{,optimize=false,openSearcher=true,waitSearcher=true,expungeDeletes=false,softCommit=false,prepareCommit=false}
   [junit4]   2> 1130487 INFO  (TEST-SpellCheckComponentTest.testMaximumResultsForSuggest-seed#[5DDC36407C02487C]) [    ] o.a.s.u.SolrIndexWriter Calling setCommitData with IW:org.apache.solr.update.SolrIndexWriter@77af562d
   [junit4]   2> 1130490 INFO  (TEST-SpellCheckComponentTest.testMaximumResultsForSuggest-seed#[5DDC36407C02487C]) [    ] o.a.s.s.SolrIndexSearcher Opening [Searcher@1ec4fe87[collection1] main]
   [junit4]   2> 1130491 INFO  (TEST-SpellCheckComponentTest.testMaximumResultsForSuggest-seed#[5DDC36407C02487C]) [    ] o.a.s.u.DirectUpdateHandler2 end_commit_flush
   [junit4]   2> 1130491 INFO  (searcherExecutor-4753-thread-1) [    ] o.a.s.h.c.SpellCheckComponent Building spell index for spell checker: default
   [junit4]   2> 1130720 INFO  (searcherExecutor-4753-thread-1) [    ] o.a.s.h.c.SpellCheckComponent Building spell index for spell checker: default_teststop
   [junit4]   2> 1130785 INFO  (searcherExecutor-4753-thread-1) [    ] o.a.s.h.c.SpellCheckComponent Building spell index for spell checker: threshold
   [junit4]   2> 1130954 INFO  (searcherExecutor-4753-thread-1) [    ] o.a.s.h.c.SpellCheckComponent Building spell index for spell checker: threshold_direct
   [junit4]   2> 1130954 INFO  (searcherExecutor-4753-thread-1) [    ] o.a.s.h.c.SpellCheckComponent Building spell index for spell checker: multipleFields
   [junit4]   2> 1131126 INFO  (searcherExecutor-4753-thread-1) [    ] o.a.s.h.c.SpellCheckComponent Buildi

[...truncated too long message...]

nt Building spell index for spell checker: threshold
   [junit4]   2> 1134482 INFO  (searcherExecutor-4753-thread-1) [    ] o.a.s.h.c.SpellCheckComponent Building spell index for spell checker: threshold_direct
   [junit4]   2> 1134482 INFO  (searcherExecutor-4753-thread-1) [    ] o.a.s.h.c.SpellCheckComponent Building spell index for spell checker: multipleFields
   [junit4]   2> 1134640 INFO  (searcherExecutor-4753-thread-1) [    ] o.a.s.h.c.SpellCheckComponent Building spell index for spell checker: freq
   [junit4]   2> 1134774 INFO  (searcherExecutor-4753-thread-1) [    ] o.a.s.h.c.SpellCheckComponent Building spell index for spell checker: fqcn
   [junit4]   2> 1134938 INFO  (searcherExecutor-4753-thread-1) [    ] o.a.s.c.SolrCore [collection1] Registered new searcher Searcher@4934b572[collection1] main{ExitableDirectoryReader(UninvertingDirectoryReader(Uninverting(_c(7.0.0):c10)))}
   [junit4]   2> 1134938 INFO  (TEST-SpellCheckComponentTest.testExtendedResultsCount-seed#[5DDC36407C02487C]) [    ] o.a.s.u.p.LogUpdateProcessorFactory [collection1]  webapp=null path=null params={}{commit=} 0 760
   [junit4]   2> 1135096 INFO  (TEST-SpellCheckComponentTest.testExtendedResultsCount-seed#[5DDC36407C02487C]) [    ] o.a.s.c.S.Request [collection1]  webapp=null path=null params={q=bluo&qt=spellCheckCompRH&spellcheck=true&spellcheck.count=5&wt=xml&spellcheck.build=true&spellcheck.extendedResults=false} hits=0 status=0 QTime=157
   [junit4]   2> 1135097 INFO  (TEST-SpellCheckComponentTest.testExtendedResultsCount-seed#[5DDC36407C02487C]) [    ] o.a.s.c.S.Request [collection1]  webapp=null path=null params={q=bluo&qt=spellCheckCompRH&spellcheck=true&spellcheck.count=3&wt=xml&spellcheck.extendedResults=true} hits=0 status=0 QTime=0
   [junit4]   2> 1135097 INFO  (TEST-SpellCheckComponentTest.testExtendedResultsCount-seed#[5DDC36407C02487C]) [    ] o.a.s.SolrTestCaseJ4 ###Ending testExtendedResultsCount
   [junit4]   2> 1135098 INFO  (TEST-SpellCheckComponentTest.testExtendedResultsCount-seed#[5DDC36407C02487C]) [    ] o.a.s.u.DirectUpdateHandler2 [collection1] REMOVING ALL DOCUMENTS FROM INDEX
   [junit4]   2> 1135098 INFO  (TEST-SpellCheckComponentTest.testExtendedResultsCount-seed#[5DDC36407C02487C]) [    ] o.a.s.u.p.LogUpdateProcessorFactory [collection1]  webapp=null path=null params={}{deleteByQuery=*:*} 0 0
   [junit4]   2> 1135098 INFO  (TEST-SpellCheckComponentTest.testExtendedResultsCount-seed#[5DDC36407C02487C]) [    ] o.a.s.u.DirectUpdateHandler2 start commit{,optimize=false,openSearcher=true,waitSearcher=true,expungeDeletes=false,softCommit=false,prepareCommit=false}
   [junit4]   2> 1135098 INFO  (TEST-SpellCheckComponentTest.testExtendedResultsCount-seed#[5DDC36407C02487C]) [    ] o.a.s.u.SolrIndexWriter Calling setCommitData with IW:org.apache.solr.update.SolrIndexWriter@77af562d
   [junit4]   2> 1135098 INFO  (TEST-SpellCheckComponentTest.testExtendedResultsCount-seed#[5DDC36407C02487C]) [    ] o.a.s.s.SolrIndexSearcher Opening [Searcher@34f4db6f[collection1] main]
   [junit4]   2> 1135098 INFO  (TEST-SpellCheckComponentTest.testExtendedResultsCount-seed#[5DDC36407C02487C]) [    ] o.a.s.u.DirectUpdateHandler2 end_commit_flush
   [junit4]   2> 1135098 INFO  (searcherExecutor-4753-thread-1) [    ] o.a.s.h.c.SpellCheckComponent Building spell index for spell checker: default
   [junit4]   2> 1135132 INFO  (searcherExecutor-4753-thread-1) [    ] o.a.s.h.c.SpellCheckComponent Building spell index for spell checker: default_teststop
   [junit4]   2> 1135227 INFO  (searcherExecutor-4753-thread-1) [    ] o.a.s.h.c.SpellCheckComponent Building spell index for spell checker: threshold
   [junit4]   2> 1135257 INFO  (searcherExecutor-4753-thread-1) [    ] o.a.s.h.c.SpellCheckComponent Building spell index for spell checker: threshold_direct
   [junit4]   2> 1135257 INFO  (searcherExecutor-4753-thread-1) [    ] o.a.s.h.c.SpellCheckComponent Building spell index for spell checker: multipleFields
   [junit4]   2> 1135315 INFO  (searcherExecutor-4753-thread-1) [    ] o.a.s.h.c.SpellCheckComponent Building spell index for spell checker: freq
   [junit4]   2> 1135366 INFO  (searcherExecutor-4753-thread-1) [    ] o.a.s.h.c.SpellCheckComponent Building spell index for spell checker: fqcn
   [junit4]   2> 1135407 INFO  (searcherExecutor-4753-thread-1) [    ] o.a.s.c.SolrCore [collection1] Registered new searcher Searcher@34f4db6f[collection1] main{ExitableDirectoryReader(UninvertingDirectoryReader())}
   [junit4]   2> 1135407 INFO  (TEST-SpellCheckComponentTest.testExtendedResultsCount-seed#[5DDC36407C02487C]) [    ] o.a.s.u.p.LogUpdateProcessorFactory [collection1]  webapp=null path=null params={}{commit=} 0 309
   [junit4]   2> 1135408 INFO  (SUITE-SpellCheckComponentTest-seed#[5DDC36407C02487C]-worker) [    ] o.a.s.SolrTestCaseJ4 ###deleteCore
   [junit4]   2> 1135408 INFO  (SUITE-SpellCheckComponentTest-seed#[5DDC36407C02487C]-worker) [    ] o.a.s.c.CoreContainer Shutting down CoreContainer instance=58354291
   [junit4]   2> 1135408 INFO  (coreCloseExecutor-4757-thread-1) [    ] o.a.s.c.SolrCore [collection1]  CLOSING SolrCore org.apache.solr.core.SolrCore@4feebcec
   [junit4]   2> NOTE: leaving temporary files on disk at: /home/jenkins/workspace/Lucene-Solr-master-Linux/solr/build/solr-core/test/J1/temp/solr.handler.component.SpellCheckComponentTest_5DDC36407C02487C-001
   [junit4]   2> NOTE: test params are: codec=Asserting(Lucene70): {start1=PostingsFormat(name=Memory), range_facet_l_dv=PostingsFormat(name=Memory), multiDefault=PostingsFormat(name=LuceneVarGapDocFreqInterval), intDefault=PostingsFormat(name=Memory), range_facet_l=PostingsFormat(name=LuceneVarGapDocFreqInterval), lowerfilt1and2=PostingsFormat(name=LuceneVarGapDocFreqInterval), end4=PostingsFormat(name=LuceneFixedGap), end3=PostingsFormat(name=Memory), end2=PostingsFormat(name=Memory), end1=PostingsFormat(name=LuceneVarGapDocFreqInterval), lowerfilt=PostingsFormat(name=LuceneVarGapDocFreqInterval), gram1=PostingsFormat(name=LuceneVarGapDocFreqInterval), id=PostingsFormat(name=Memory), range_facet_i_dv=PostingsFormat(name=LuceneVarGapDocFreqInterval), gram2=PostingsFormat(name=Memory), gram3=PostingsFormat(name=Memory), start3=PostingsFormat(name=LuceneFixedGap), gram4=PostingsFormat(name=LuceneFixedGap), start2=PostingsFormat(name=LuceneVarGapDocFreqInterval), word=PostingsFormat(name=LuceneVarGapDocFreqInterval), timestamp=PostingsFormat(name=LuceneVarGapDocFreqInterval), start4=PostingsFormat(name=Memory)}, docValues:{range_facet_l_dv=DocValuesFormat(name=Lucene70), range_facet_i_dv=DocValuesFormat(name=Direct), timestamp=DocValuesFormat(name=Direct)}, maxPointsInLeafNode=1827, maxMBSortInHeap=6.782128388459405, sim=RandomSimilarity(queryNorm=false): {}, locale=twq, timezone=Asia/Kathmandu
   [junit4]   2> NOTE: Linux 4.4.0-53-generic amd64/Oracle Corporation 9-ea (64-bit)/cpus=12,threads=1,free=162680456,total=526385152
   [junit4]   2> NOTE: All tests run in this JVM: [SpatialHeatmapFacetsTest, DocValuesTest, BlockJoinFacetDistribTest, SortByFunctionTest, TestStressCloudBlindAtomicUpdates, TestSolrIndexConfig, DistributedQueryComponentCustomSortTest, AnalyticsQueryTest, TestPartialUpdateDeduplication, SpellingQueryConverterTest, OverseerCollectionConfigSetProcessorTest, TestFieldCacheVsDocValues, CollectionsAPIAsyncDistributedZkTest, SpellCheckCollatorTest, DirectSolrSpellCheckerTest, TestObjectReleaseTracker, UpdateRequestProcessorFactoryTest, DocExpirationUpdateProcessorFactoryTest, ZkCLITest, ZkControllerTest, FacetPivotSmallTest, TestConfigSetProperties, TestExceedMaxTermLength, TestSurroundQueryParser, TestManagedSchemaAPI, FileUtilsTest, TestExclusionRuleCollectionAccess, OpenExchangeRatesOrgProviderTest, TestCustomDocTransformer, BufferStoreTest, BigEndianAscendingWordSerializerTest, DistributedTermsComponentTest, BasicFunctionalityTest, ShardRoutingTest, ClassificationUpdateProcessorIntegrationTest, TestReqParamsAPI, TolerantUpdateProcessorTest, TestSearchPerf, JsonLoaderTest, DistributedFacetExistsSmallTest, ConvertedLegacyTest, TestRequestForwarding, ResponseHeaderTest, BaseCdcrDistributedZkTest, OpenCloseCoreStressTest, ExitableDirectoryReaderTest, TestFuzzyAnalyzedSuggestions, TestCopyFieldCollectionResource, SuggesterFSTTest, TestConfigReload, TermsComponentTest, TestPerFieldSimilarityWithDefaultOverride, TestClassicSimilarityFactory, SimplePostToolTest, PreAnalyzedUpdateProcessorTest, TestCloudSchemaless, TestTrie, QueryParsingTest, TestLRUStatsCache, TestSystemIdResolver, TestSubQueryTransformerDistrib, TestDistributedGrouping, HdfsChaosMonkeyNothingIsSafeTest, DeleteNodeTest, InfoHandlerTest, SchemaVersionSpecificBehaviorTest, ZkStateWriterTest, TestPerFieldSimilarity, TestCoreContainer, TestSerializedLuceneMatchVersion, TestInfoStreamLogging, TestSimpleQParserPlugin, TestSweetSpotSimilarityFactory, TestDeleteCollectionOnDownNodes, MultiThreadedOCPTest, SSLMigrationTest, ConfigSetsAPITest, SolrCLIZkUtilsTest, TestTrackingShardHandlerFactory, LoggingHandlerTest, AddBlockUpdateTest, CustomCollectionTest, LeaderElectionContextKeyTest, StressHdfsTest, TestRecoveryHdfs, ReplicationFactorTest, TestSolrFieldCacheMBean, TestGraphMLResponseWriter, JSONWriterTest, TestFieldTypeCollectionResource, SolrCmdDistributorTest, TestClusterProperties, TestConfigSetsAPIExclusivity, TestSolrDynamicMBean, TestLeaderElectionZkExpiry, HdfsNNFailoverTest, TestSQLHandlerNonCloud, TestCustomStream, TestBlendedInfixSuggestions, TestStressRecovery, RulesTest, TestSolrCoreSnapshots, TestUnifiedSolrHighlighter, TestHashPartitioner, TestSegmentSorting, TestJsonRequest, BasicDistributedZkTest, ChaosMonkeySafeLeaderTest, BasicDistributedZk2Test, BasicZkTest, FullSolrCloudDistribCmdsTest, TestZkChroot, TestRandomDVFaceting, TestRealTimeGet, TestJoin, TestStressVersions, HardAutoCommitTest, TestSolr4Spatial, SolrCoreTest, SpellCheckComponentTest]
   [junit4] Completed [351/660 (1!)] on J1 in 17.29s, 11 tests, 1 error <<< FAILURES!

[...truncated 52433 lines...]


Mime
View raw message