lucene-dev mailing list archives

Site index · List index
Message view « Date » · « Thread »
Top « Date » · « Thread »
From Policeman Jenkins Server <jenk...@thetaphi.de>
Subject [JENKINS-EA] Lucene-Solr-6.x-Linux (32bit/jdk-9-ea+147) - Build # 2541 - Unstable!
Date Thu, 29 Dec 2016 17:44:06 GMT
Build: https://jenkins.thetaphi.de/job/Lucene-Solr-6.x-Linux/2541/
Java: 32bit/jdk-9-ea+147 -client -XX:+UseG1GC

11 tests failed.
FAILED:  org.apache.lucene.codecs.asserting.TestAssertingNormsFormat.testRamBytesUsed

Error Message:
Actual RAM usage 344, but got 6857, -1893.3139534883721% error

Stack Trace:
java.lang.AssertionError: Actual RAM usage 344, but got 6857, -1893.3139534883721% error
	at __randomizedtesting.SeedInfo.seed([18F35E00A2FC613F:EA504C4068837E69]:0)
	at org.junit.Assert.fail(Assert.java:93)
	at org.junit.Assert.assertTrue(Assert.java:43)
	at org.apache.lucene.index.BaseIndexFileFormatTestCase.testRamBytesUsed(BaseIndexFileFormatTestCase.java:279)
	at org.apache.lucene.index.BaseNormsFormatTestCase.testRamBytesUsed(BaseNormsFormatTestCase.java:46)
	at java.base/jdk.internal.reflect.NativeMethodAccessorImpl.invoke0(Native Method)
	at java.base/jdk.internal.reflect.NativeMethodAccessorImpl.invoke(NativeMethodAccessorImpl.java:62)
	at java.base/jdk.internal.reflect.DelegatingMethodAccessorImpl.invoke(DelegatingMethodAccessorImpl.java:43)
	at java.base/java.lang.reflect.Method.invoke(Method.java:538)
	at com.carrotsearch.randomizedtesting.RandomizedRunner.invoke(RandomizedRunner.java:1713)
	at com.carrotsearch.randomizedtesting.RandomizedRunner$8.evaluate(RandomizedRunner.java:907)
	at com.carrotsearch.randomizedtesting.RandomizedRunner$9.evaluate(RandomizedRunner.java:943)
	at com.carrotsearch.randomizedtesting.RandomizedRunner$10.evaluate(RandomizedRunner.java:957)
	at org.apache.lucene.util.TestRuleSetupTeardownChained$1.evaluate(TestRuleSetupTeardownChained.java:49)
	at org.apache.lucene.util.AbstractBeforeAfterRule$1.evaluate(AbstractBeforeAfterRule.java:45)
	at org.apache.lucene.util.TestRuleThreadAndTestName$1.evaluate(TestRuleThreadAndTestName.java:48)
	at org.apache.lucene.util.TestRuleIgnoreAfterMaxFailures$1.evaluate(TestRuleIgnoreAfterMaxFailures.java:64)
	at org.apache.lucene.util.TestRuleMarkFailure$1.evaluate(TestRuleMarkFailure.java:47)
	at com.carrotsearch.randomizedtesting.rules.StatementAdapter.evaluate(StatementAdapter.java:36)
	at com.carrotsearch.randomizedtesting.ThreadLeakControl$StatementRunner.run(ThreadLeakControl.java:367)
	at com.carrotsearch.randomizedtesting.ThreadLeakControl.forkTimeoutingTask(ThreadLeakControl.java:811)
	at com.carrotsearch.randomizedtesting.ThreadLeakControl$3.evaluate(ThreadLeakControl.java:462)
	at com.carrotsearch.randomizedtesting.RandomizedRunner.runSingleTest(RandomizedRunner.java:916)
	at com.carrotsearch.randomizedtesting.RandomizedRunner$5.evaluate(RandomizedRunner.java:802)
	at com.carrotsearch.randomizedtesting.RandomizedRunner$6.evaluate(RandomizedRunner.java:852)
	at com.carrotsearch.randomizedtesting.RandomizedRunner$7.evaluate(RandomizedRunner.java:863)
	at org.apache.lucene.util.AbstractBeforeAfterRule$1.evaluate(AbstractBeforeAfterRule.java:45)
	at com.carrotsearch.randomizedtesting.rules.StatementAdapter.evaluate(StatementAdapter.java:36)
	at org.apache.lucene.util.TestRuleStoreClassName$1.evaluate(TestRuleStoreClassName.java:41)
	at com.carrotsearch.randomizedtesting.rules.NoShadowingOrOverridesOnMethodsRule$1.evaluate(NoShadowingOrOverridesOnMethodsRule.java:40)
	at com.carrotsearch.randomizedtesting.rules.NoShadowingOrOverridesOnMethodsRule$1.evaluate(NoShadowingOrOverridesOnMethodsRule.java:40)
	at com.carrotsearch.randomizedtesting.rules.StatementAdapter.evaluate(StatementAdapter.java:36)
	at com.carrotsearch.randomizedtesting.rules.StatementAdapter.evaluate(StatementAdapter.java:36)
	at org.apache.lucene.util.TestRuleAssertionsRequired$1.evaluate(TestRuleAssertionsRequired.java:53)
	at org.apache.lucene.util.TestRuleMarkFailure$1.evaluate(TestRuleMarkFailure.java:47)
	at org.apache.lucene.util.TestRuleIgnoreAfterMaxFailures$1.evaluate(TestRuleIgnoreAfterMaxFailures.java:64)
	at org.apache.lucene.util.TestRuleIgnoreTestSuites$1.evaluate(TestRuleIgnoreTestSuites.java:54)
	at com.carrotsearch.randomizedtesting.rules.StatementAdapter.evaluate(StatementAdapter.java:36)
	at com.carrotsearch.randomizedtesting.ThreadLeakControl$StatementRunner.run(ThreadLeakControl.java:367)
	at java.base/java.lang.Thread.run(Thread.java:844)


FAILED:  org.apache.lucene.codecs.blocktreeords.TestOrdsBlockTree.testRamBytesUsed

Error Message:
Actual RAM usage 376, but got 2063, -448.67021276595744% error

Stack Trace:
java.lang.AssertionError: Actual RAM usage 376, but got 2063, -448.67021276595744% error
	at __randomizedtesting.SeedInfo.seed([DE9F86D6A81BE32F:2C3C94966264FC79]:0)
	at org.junit.Assert.fail(Assert.java:93)
	at org.junit.Assert.assertTrue(Assert.java:43)
	at org.apache.lucene.index.BaseIndexFileFormatTestCase.testRamBytesUsed(BaseIndexFileFormatTestCase.java:279)
	at org.apache.lucene.index.BasePostingsFormatTestCase.testRamBytesUsed(BasePostingsFormatTestCase.java:85)
	at java.base/jdk.internal.reflect.NativeMethodAccessorImpl.invoke0(Native Method)
	at java.base/jdk.internal.reflect.NativeMethodAccessorImpl.invoke(NativeMethodAccessorImpl.java:62)
	at java.base/jdk.internal.reflect.DelegatingMethodAccessorImpl.invoke(DelegatingMethodAccessorImpl.java:43)
	at java.base/java.lang.reflect.Method.invoke(Method.java:538)
	at com.carrotsearch.randomizedtesting.RandomizedRunner.invoke(RandomizedRunner.java:1713)
	at com.carrotsearch.randomizedtesting.RandomizedRunner$8.evaluate(RandomizedRunner.java:907)
	at com.carrotsearch.randomizedtesting.RandomizedRunner$9.evaluate(RandomizedRunner.java:943)
	at com.carrotsearch.randomizedtesting.RandomizedRunner$10.evaluate(RandomizedRunner.java:957)
	at org.apache.lucene.util.TestRuleSetupTeardownChained$1.evaluate(TestRuleSetupTeardownChained.java:49)
	at org.apache.lucene.util.AbstractBeforeAfterRule$1.evaluate(AbstractBeforeAfterRule.java:45)
	at org.apache.lucene.util.TestRuleThreadAndTestName$1.evaluate(TestRuleThreadAndTestName.java:48)
	at org.apache.lucene.util.TestRuleIgnoreAfterMaxFailures$1.evaluate(TestRuleIgnoreAfterMaxFailures.java:64)
	at org.apache.lucene.util.TestRuleMarkFailure$1.evaluate(TestRuleMarkFailure.java:47)
	at com.carrotsearch.randomizedtesting.rules.StatementAdapter.evaluate(StatementAdapter.java:36)
	at com.carrotsearch.randomizedtesting.ThreadLeakControl$StatementRunner.run(ThreadLeakControl.java:367)
	at com.carrotsearch.randomizedtesting.ThreadLeakControl.forkTimeoutingTask(ThreadLeakControl.java:811)
	at com.carrotsearch.randomizedtesting.ThreadLeakControl$3.evaluate(ThreadLeakControl.java:462)
	at com.carrotsearch.randomizedtesting.RandomizedRunner.runSingleTest(RandomizedRunner.java:916)
	at com.carrotsearch.randomizedtesting.RandomizedRunner$5.evaluate(RandomizedRunner.java:802)
	at com.carrotsearch.randomizedtesting.RandomizedRunner$6.evaluate(RandomizedRunner.java:852)
	at com.carrotsearch.randomizedtesting.RandomizedRunner$7.evaluate(RandomizedRunner.java:863)
	at org.apache.lucene.util.AbstractBeforeAfterRule$1.evaluate(AbstractBeforeAfterRule.java:45)
	at com.carrotsearch.randomizedtesting.rules.StatementAdapter.evaluate(StatementAdapter.java:36)
	at org.apache.lucene.util.TestRuleStoreClassName$1.evaluate(TestRuleStoreClassName.java:41)
	at com.carrotsearch.randomizedtesting.rules.NoShadowingOrOverridesOnMethodsRule$1.evaluate(NoShadowingOrOverridesOnMethodsRule.java:40)
	at com.carrotsearch.randomizedtesting.rules.NoShadowingOrOverridesOnMethodsRule$1.evaluate(NoShadowingOrOverridesOnMethodsRule.java:40)
	at com.carrotsearch.randomizedtesting.rules.StatementAdapter.evaluate(StatementAdapter.java:36)
	at com.carrotsearch.randomizedtesting.rules.StatementAdapter.evaluate(StatementAdapter.java:36)
	at org.apache.lucene.util.TestRuleAssertionsRequired$1.evaluate(TestRuleAssertionsRequired.java:53)
	at org.apache.lucene.util.TestRuleMarkFailure$1.evaluate(TestRuleMarkFailure.java:47)
	at org.apache.lucene.util.TestRuleIgnoreAfterMaxFailures$1.evaluate(TestRuleIgnoreAfterMaxFailures.java:64)
	at org.apache.lucene.util.TestRuleIgnoreTestSuites$1.evaluate(TestRuleIgnoreTestSuites.java:54)
	at com.carrotsearch.randomizedtesting.rules.StatementAdapter.evaluate(StatementAdapter.java:36)
	at com.carrotsearch.randomizedtesting.ThreadLeakControl$StatementRunner.run(ThreadLeakControl.java:367)
	at java.base/java.lang.Thread.run(Thread.java:844)


FAILED:  org.apache.lucene.codecs.lucene50.TestLucene50NormsFormat.testRamBytesUsed

Error Message:
Actual RAM usage 6000, but got 13049, -117.48333333333333% error

Stack Trace:
java.lang.AssertionError: Actual RAM usage 6000, but got 13049, -117.48333333333333% error
	at __randomizedtesting.SeedInfo.seed([93FC1A8FFBD3CA85:615F08CF31ACD5D3]:0)
	at org.junit.Assert.fail(Assert.java:93)
	at org.junit.Assert.assertTrue(Assert.java:43)
	at org.apache.lucene.index.BaseIndexFileFormatTestCase.testRamBytesUsed(BaseIndexFileFormatTestCase.java:279)
	at org.apache.lucene.index.BaseNormsFormatTestCase.testRamBytesUsed(BaseNormsFormatTestCase.java:46)
	at java.base/jdk.internal.reflect.NativeMethodAccessorImpl.invoke0(Native Method)
	at java.base/jdk.internal.reflect.NativeMethodAccessorImpl.invoke(NativeMethodAccessorImpl.java:62)
	at java.base/jdk.internal.reflect.DelegatingMethodAccessorImpl.invoke(DelegatingMethodAccessorImpl.java:43)
	at java.base/java.lang.reflect.Method.invoke(Method.java:538)
	at com.carrotsearch.randomizedtesting.RandomizedRunner.invoke(RandomizedRunner.java:1713)
	at com.carrotsearch.randomizedtesting.RandomizedRunner$8.evaluate(RandomizedRunner.java:907)
	at com.carrotsearch.randomizedtesting.RandomizedRunner$9.evaluate(RandomizedRunner.java:943)
	at com.carrotsearch.randomizedtesting.RandomizedRunner$10.evaluate(RandomizedRunner.java:957)
	at org.apache.lucene.util.TestRuleSetupTeardownChained$1.evaluate(TestRuleSetupTeardownChained.java:49)
	at org.apache.lucene.util.AbstractBeforeAfterRule$1.evaluate(AbstractBeforeAfterRule.java:45)
	at org.apache.lucene.util.TestRuleThreadAndTestName$1.evaluate(TestRuleThreadAndTestName.java:48)
	at org.apache.lucene.util.TestRuleIgnoreAfterMaxFailures$1.evaluate(TestRuleIgnoreAfterMaxFailures.java:64)
	at org.apache.lucene.util.TestRuleMarkFailure$1.evaluate(TestRuleMarkFailure.java:47)
	at com.carrotsearch.randomizedtesting.rules.StatementAdapter.evaluate(StatementAdapter.java:36)
	at com.carrotsearch.randomizedtesting.ThreadLeakControl$StatementRunner.run(ThreadLeakControl.java:367)
	at com.carrotsearch.randomizedtesting.ThreadLeakControl.forkTimeoutingTask(ThreadLeakControl.java:811)
	at com.carrotsearch.randomizedtesting.ThreadLeakControl$3.evaluate(ThreadLeakControl.java:462)
	at com.carrotsearch.randomizedtesting.RandomizedRunner.runSingleTest(RandomizedRunner.java:916)
	at com.carrotsearch.randomizedtesting.RandomizedRunner$5.evaluate(RandomizedRunner.java:802)
	at com.carrotsearch.randomizedtesting.RandomizedRunner$6.evaluate(RandomizedRunner.java:852)
	at com.carrotsearch.randomizedtesting.RandomizedRunner$7.evaluate(RandomizedRunner.java:863)
	at org.apache.lucene.util.AbstractBeforeAfterRule$1.evaluate(AbstractBeforeAfterRule.java:45)
	at com.carrotsearch.randomizedtesting.rules.StatementAdapter.evaluate(StatementAdapter.java:36)
	at org.apache.lucene.util.TestRuleStoreClassName$1.evaluate(TestRuleStoreClassName.java:41)
	at com.carrotsearch.randomizedtesting.rules.NoShadowingOrOverridesOnMethodsRule$1.evaluate(NoShadowingOrOverridesOnMethodsRule.java:40)
	at com.carrotsearch.randomizedtesting.rules.NoShadowingOrOverridesOnMethodsRule$1.evaluate(NoShadowingOrOverridesOnMethodsRule.java:40)
	at com.carrotsearch.randomizedtesting.rules.StatementAdapter.evaluate(StatementAdapter.java:36)
	at com.carrotsearch.randomizedtesting.rules.StatementAdapter.evaluate(StatementAdapter.java:36)
	at org.apache.lucene.util.TestRuleAssertionsRequired$1.evaluate(TestRuleAssertionsRequired.java:53)
	at org.apache.lucene.util.TestRuleMarkFailure$1.evaluate(TestRuleMarkFailure.java:47)
	at org.apache.lucene.util.TestRuleIgnoreAfterMaxFailures$1.evaluate(TestRuleIgnoreAfterMaxFailures.java:64)
	at org.apache.lucene.util.TestRuleIgnoreTestSuites$1.evaluate(TestRuleIgnoreTestSuites.java:54)
	at com.carrotsearch.randomizedtesting.rules.StatementAdapter.evaluate(StatementAdapter.java:36)
	at com.carrotsearch.randomizedtesting.ThreadLeakControl$StatementRunner.run(ThreadLeakControl.java:367)
	at java.base/java.lang.Thread.run(Thread.java:844)


FAILED:  org.apache.lucene.codecs.lucene53.TestLucene53NormsFormat.testRamBytesUsed

Error Message:
Actual RAM usage 456, but got 5947, -1204.1666666666665% error

Stack Trace:
java.lang.AssertionError: Actual RAM usage 456, but got 5947, -1204.1666666666665% error
	at __randomizedtesting.SeedInfo.seed([3275556E719265E7:C0D6472EBBED7AB1]:0)
	at org.junit.Assert.fail(Assert.java:93)
	at org.junit.Assert.assertTrue(Assert.java:43)
	at org.apache.lucene.index.BaseIndexFileFormatTestCase.testRamBytesUsed(BaseIndexFileFormatTestCase.java:279)
	at org.apache.lucene.index.BaseNormsFormatTestCase.testRamBytesUsed(BaseNormsFormatTestCase.java:46)
	at java.base/jdk.internal.reflect.NativeMethodAccessorImpl.invoke0(Native Method)
	at java.base/jdk.internal.reflect.NativeMethodAccessorImpl.invoke(NativeMethodAccessorImpl.java:62)
	at java.base/jdk.internal.reflect.DelegatingMethodAccessorImpl.invoke(DelegatingMethodAccessorImpl.java:43)
	at java.base/java.lang.reflect.Method.invoke(Method.java:538)
	at com.carrotsearch.randomizedtesting.RandomizedRunner.invoke(RandomizedRunner.java:1713)
	at com.carrotsearch.randomizedtesting.RandomizedRunner$8.evaluate(RandomizedRunner.java:907)
	at com.carrotsearch.randomizedtesting.RandomizedRunner$9.evaluate(RandomizedRunner.java:943)
	at com.carrotsearch.randomizedtesting.RandomizedRunner$10.evaluate(RandomizedRunner.java:957)
	at org.apache.lucene.util.TestRuleSetupTeardownChained$1.evaluate(TestRuleSetupTeardownChained.java:49)
	at org.apache.lucene.util.AbstractBeforeAfterRule$1.evaluate(AbstractBeforeAfterRule.java:45)
	at org.apache.lucene.util.TestRuleThreadAndTestName$1.evaluate(TestRuleThreadAndTestName.java:48)
	at org.apache.lucene.util.TestRuleIgnoreAfterMaxFailures$1.evaluate(TestRuleIgnoreAfterMaxFailures.java:64)
	at org.apache.lucene.util.TestRuleMarkFailure$1.evaluate(TestRuleMarkFailure.java:47)
	at com.carrotsearch.randomizedtesting.rules.StatementAdapter.evaluate(StatementAdapter.java:36)
	at com.carrotsearch.randomizedtesting.ThreadLeakControl$StatementRunner.run(ThreadLeakControl.java:367)
	at com.carrotsearch.randomizedtesting.ThreadLeakControl.forkTimeoutingTask(ThreadLeakControl.java:811)
	at com.carrotsearch.randomizedtesting.ThreadLeakControl$3.evaluate(ThreadLeakControl.java:462)
	at com.carrotsearch.randomizedtesting.RandomizedRunner.runSingleTest(RandomizedRunner.java:916)
	at com.carrotsearch.randomizedtesting.RandomizedRunner$5.evaluate(RandomizedRunner.java:802)
	at com.carrotsearch.randomizedtesting.RandomizedRunner$6.evaluate(RandomizedRunner.java:852)
	at com.carrotsearch.randomizedtesting.RandomizedRunner$7.evaluate(RandomizedRunner.java:863)
	at org.apache.lucene.util.AbstractBeforeAfterRule$1.evaluate(AbstractBeforeAfterRule.java:45)
	at com.carrotsearch.randomizedtesting.rules.StatementAdapter.evaluate(StatementAdapter.java:36)
	at org.apache.lucene.util.TestRuleStoreClassName$1.evaluate(TestRuleStoreClassName.java:41)
	at com.carrotsearch.randomizedtesting.rules.NoShadowingOrOverridesOnMethodsRule$1.evaluate(NoShadowingOrOverridesOnMethodsRule.java:40)
	at com.carrotsearch.randomizedtesting.rules.NoShadowingOrOverridesOnMethodsRule$1.evaluate(NoShadowingOrOverridesOnMethodsRule.java:40)
	at com.carrotsearch.randomizedtesting.rules.StatementAdapter.evaluate(StatementAdapter.java:36)
	at com.carrotsearch.randomizedtesting.rules.StatementAdapter.evaluate(StatementAdapter.java:36)
	at org.apache.lucene.util.TestRuleAssertionsRequired$1.evaluate(TestRuleAssertionsRequired.java:53)
	at org.apache.lucene.util.TestRuleMarkFailure$1.evaluate(TestRuleMarkFailure.java:47)
	at org.apache.lucene.util.TestRuleIgnoreAfterMaxFailures$1.evaluate(TestRuleIgnoreAfterMaxFailures.java:64)
	at org.apache.lucene.util.TestRuleIgnoreTestSuites$1.evaluate(TestRuleIgnoreTestSuites.java:54)
	at com.carrotsearch.randomizedtesting.rules.StatementAdapter.evaluate(StatementAdapter.java:36)
	at com.carrotsearch.randomizedtesting.ThreadLeakControl$StatementRunner.run(ThreadLeakControl.java:367)
	at java.base/java.lang.Thread.run(Thread.java:844)


FAILED:  org.apache.lucene.codecs.memory.TestDirectPostingsFormat.testRamBytesUsed

Error Message:
Actual RAM usage 376, but got 4085640, -1086506.3829787234% error

Stack Trace:
java.lang.AssertionError: Actual RAM usage 376, but got 4085640, -1086506.3829787234% error
	at __randomizedtesting.SeedInfo.seed([DE9F86D6A81BE32F:2C3C94966264FC79]:0)
	at org.junit.Assert.fail(Assert.java:93)
	at org.junit.Assert.assertTrue(Assert.java:43)
	at org.apache.lucene.index.BaseIndexFileFormatTestCase.testRamBytesUsed(BaseIndexFileFormatTestCase.java:279)
	at org.apache.lucene.index.BasePostingsFormatTestCase.testRamBytesUsed(BasePostingsFormatTestCase.java:85)
	at java.base/jdk.internal.reflect.NativeMethodAccessorImpl.invoke0(Native Method)
	at java.base/jdk.internal.reflect.NativeMethodAccessorImpl.invoke(NativeMethodAccessorImpl.java:62)
	at java.base/jdk.internal.reflect.DelegatingMethodAccessorImpl.invoke(DelegatingMethodAccessorImpl.java:43)
	at java.base/java.lang.reflect.Method.invoke(Method.java:538)
	at com.carrotsearch.randomizedtesting.RandomizedRunner.invoke(RandomizedRunner.java:1713)
	at com.carrotsearch.randomizedtesting.RandomizedRunner$8.evaluate(RandomizedRunner.java:907)
	at com.carrotsearch.randomizedtesting.RandomizedRunner$9.evaluate(RandomizedRunner.java:943)
	at com.carrotsearch.randomizedtesting.RandomizedRunner$10.evaluate(RandomizedRunner.java:957)
	at org.apache.lucene.util.TestRuleSetupTeardownChained$1.evaluate(TestRuleSetupTeardownChained.java:49)
	at org.apache.lucene.util.AbstractBeforeAfterRule$1.evaluate(AbstractBeforeAfterRule.java:45)
	at org.apache.lucene.util.TestRuleThreadAndTestName$1.evaluate(TestRuleThreadAndTestName.java:48)
	at org.apache.lucene.util.TestRuleIgnoreAfterMaxFailures$1.evaluate(TestRuleIgnoreAfterMaxFailures.java:64)
	at org.apache.lucene.util.TestRuleMarkFailure$1.evaluate(TestRuleMarkFailure.java:47)
	at com.carrotsearch.randomizedtesting.rules.StatementAdapter.evaluate(StatementAdapter.java:36)
	at com.carrotsearch.randomizedtesting.ThreadLeakControl$StatementRunner.run(ThreadLeakControl.java:367)
	at com.carrotsearch.randomizedtesting.ThreadLeakControl.forkTimeoutingTask(ThreadLeakControl.java:811)
	at com.carrotsearch.randomizedtesting.ThreadLeakControl$3.evaluate(ThreadLeakControl.java:462)
	at com.carrotsearch.randomizedtesting.RandomizedRunner.runSingleTest(RandomizedRunner.java:916)
	at com.carrotsearch.randomizedtesting.RandomizedRunner$5.evaluate(RandomizedRunner.java:802)
	at com.carrotsearch.randomizedtesting.RandomizedRunner$6.evaluate(RandomizedRunner.java:852)
	at com.carrotsearch.randomizedtesting.RandomizedRunner$7.evaluate(RandomizedRunner.java:863)
	at org.apache.lucene.util.AbstractBeforeAfterRule$1.evaluate(AbstractBeforeAfterRule.java:45)
	at com.carrotsearch.randomizedtesting.rules.StatementAdapter.evaluate(StatementAdapter.java:36)
	at org.apache.lucene.util.TestRuleStoreClassName$1.evaluate(TestRuleStoreClassName.java:41)
	at com.carrotsearch.randomizedtesting.rules.NoShadowingOrOverridesOnMethodsRule$1.evaluate(NoShadowingOrOverridesOnMethodsRule.java:40)
	at com.carrotsearch.randomizedtesting.rules.NoShadowingOrOverridesOnMethodsRule$1.evaluate(NoShadowingOrOverridesOnMethodsRule.java:40)
	at com.carrotsearch.randomizedtesting.rules.StatementAdapter.evaluate(StatementAdapter.java:36)
	at com.carrotsearch.randomizedtesting.rules.StatementAdapter.evaluate(StatementAdapter.java:36)
	at org.apache.lucene.util.TestRuleAssertionsRequired$1.evaluate(TestRuleAssertionsRequired.java:53)
	at org.apache.lucene.util.TestRuleMarkFailure$1.evaluate(TestRuleMarkFailure.java:47)
	at org.apache.lucene.util.TestRuleIgnoreAfterMaxFailures$1.evaluate(TestRuleIgnoreAfterMaxFailures.java:64)
	at org.apache.lucene.util.TestRuleIgnoreTestSuites$1.evaluate(TestRuleIgnoreTestSuites.java:54)
	at com.carrotsearch.randomizedtesting.rules.StatementAdapter.evaluate(StatementAdapter.java:36)
	at com.carrotsearch.randomizedtesting.ThreadLeakControl$StatementRunner.run(ThreadLeakControl.java:367)
	at java.base/java.lang.Thread.run(Thread.java:844)


FAILED:  org.apache.lucene.codecs.memory.TestFSTOrdPostingsFormat.testRamBytesUsed

Error Message:
Actual RAM usage 376, but got 21360, -5580.851063829788% error

Stack Trace:
java.lang.AssertionError: Actual RAM usage 376, but got 21360, -5580.851063829788% error
	at __randomizedtesting.SeedInfo.seed([DE9F86D6A81BE32F:2C3C94966264FC79]:0)
	at org.junit.Assert.fail(Assert.java:93)
	at org.junit.Assert.assertTrue(Assert.java:43)
	at org.apache.lucene.index.BaseIndexFileFormatTestCase.testRamBytesUsed(BaseIndexFileFormatTestCase.java:279)
	at org.apache.lucene.index.BasePostingsFormatTestCase.testRamBytesUsed(BasePostingsFormatTestCase.java:85)
	at java.base/jdk.internal.reflect.NativeMethodAccessorImpl.invoke0(Native Method)
	at java.base/jdk.internal.reflect.NativeMethodAccessorImpl.invoke(NativeMethodAccessorImpl.java:62)
	at java.base/jdk.internal.reflect.DelegatingMethodAccessorImpl.invoke(DelegatingMethodAccessorImpl.java:43)
	at java.base/java.lang.reflect.Method.invoke(Method.java:538)
	at com.carrotsearch.randomizedtesting.RandomizedRunner.invoke(RandomizedRunner.java:1713)
	at com.carrotsearch.randomizedtesting.RandomizedRunner$8.evaluate(RandomizedRunner.java:907)
	at com.carrotsearch.randomizedtesting.RandomizedRunner$9.evaluate(RandomizedRunner.java:943)
	at com.carrotsearch.randomizedtesting.RandomizedRunner$10.evaluate(RandomizedRunner.java:957)
	at org.apache.lucene.util.TestRuleSetupTeardownChained$1.evaluate(TestRuleSetupTeardownChained.java:49)
	at org.apache.lucene.util.AbstractBeforeAfterRule$1.evaluate(AbstractBeforeAfterRule.java:45)
	at org.apache.lucene.util.TestRuleThreadAndTestName$1.evaluate(TestRuleThreadAndTestName.java:48)
	at org.apache.lucene.util.TestRuleIgnoreAfterMaxFailures$1.evaluate(TestRuleIgnoreAfterMaxFailures.java:64)
	at org.apache.lucene.util.TestRuleMarkFailure$1.evaluate(TestRuleMarkFailure.java:47)
	at com.carrotsearch.randomizedtesting.rules.StatementAdapter.evaluate(StatementAdapter.java:36)
	at com.carrotsearch.randomizedtesting.ThreadLeakControl$StatementRunner.run(ThreadLeakControl.java:367)
	at com.carrotsearch.randomizedtesting.ThreadLeakControl.forkTimeoutingTask(ThreadLeakControl.java:811)
	at com.carrotsearch.randomizedtesting.ThreadLeakControl$3.evaluate(ThreadLeakControl.java:462)
	at com.carrotsearch.randomizedtesting.RandomizedRunner.runSingleTest(RandomizedRunner.java:916)
	at com.carrotsearch.randomizedtesting.RandomizedRunner$5.evaluate(RandomizedRunner.java:802)
	at com.carrotsearch.randomizedtesting.RandomizedRunner$6.evaluate(RandomizedRunner.java:852)
	at com.carrotsearch.randomizedtesting.RandomizedRunner$7.evaluate(RandomizedRunner.java:863)
	at org.apache.lucene.util.AbstractBeforeAfterRule$1.evaluate(AbstractBeforeAfterRule.java:45)
	at com.carrotsearch.randomizedtesting.rules.StatementAdapter.evaluate(StatementAdapter.java:36)
	at org.apache.lucene.util.TestRuleStoreClassName$1.evaluate(TestRuleStoreClassName.java:41)
	at com.carrotsearch.randomizedtesting.rules.NoShadowingOrOverridesOnMethodsRule$1.evaluate(NoShadowingOrOverridesOnMethodsRule.java:40)
	at com.carrotsearch.randomizedtesting.rules.NoShadowingOrOverridesOnMethodsRule$1.evaluate(NoShadowingOrOverridesOnMethodsRule.java:40)
	at com.carrotsearch.randomizedtesting.rules.StatementAdapter.evaluate(StatementAdapter.java:36)
	at com.carrotsearch.randomizedtesting.rules.StatementAdapter.evaluate(StatementAdapter.java:36)
	at org.apache.lucene.util.TestRuleAssertionsRequired$1.evaluate(TestRuleAssertionsRequired.java:53)
	at org.apache.lucene.util.TestRuleMarkFailure$1.evaluate(TestRuleMarkFailure.java:47)
	at org.apache.lucene.util.TestRuleIgnoreAfterMaxFailures$1.evaluate(TestRuleIgnoreAfterMaxFailures.java:64)
	at org.apache.lucene.util.TestRuleIgnoreTestSuites$1.evaluate(TestRuleIgnoreTestSuites.java:54)
	at com.carrotsearch.randomizedtesting.rules.StatementAdapter.evaluate(StatementAdapter.java:36)
	at com.carrotsearch.randomizedtesting.ThreadLeakControl$StatementRunner.run(ThreadLeakControl.java:367)
	at java.base/java.lang.Thread.run(Thread.java:844)


FAILED:  org.apache.lucene.codecs.memory.TestFSTPostingsFormat.testRamBytesUsed

Error Message:
Actual RAM usage 376, but got 20700, -5405.31914893617% error

Stack Trace:
java.lang.AssertionError: Actual RAM usage 376, but got 20700, -5405.31914893617% error
	at __randomizedtesting.SeedInfo.seed([DE9F86D6A81BE32F:2C3C94966264FC79]:0)
	at org.junit.Assert.fail(Assert.java:93)
	at org.junit.Assert.assertTrue(Assert.java:43)
	at org.apache.lucene.index.BaseIndexFileFormatTestCase.testRamBytesUsed(BaseIndexFileFormatTestCase.java:279)
	at org.apache.lucene.index.BasePostingsFormatTestCase.testRamBytesUsed(BasePostingsFormatTestCase.java:85)
	at java.base/jdk.internal.reflect.NativeMethodAccessorImpl.invoke0(Native Method)
	at java.base/jdk.internal.reflect.NativeMethodAccessorImpl.invoke(NativeMethodAccessorImpl.java:62)
	at java.base/jdk.internal.reflect.DelegatingMethodAccessorImpl.invoke(DelegatingMethodAccessorImpl.java:43)
	at java.base/java.lang.reflect.Method.invoke(Method.java:538)
	at com.carrotsearch.randomizedtesting.RandomizedRunner.invoke(RandomizedRunner.java:1713)
	at com.carrotsearch.randomizedtesting.RandomizedRunner$8.evaluate(RandomizedRunner.java:907)
	at com.carrotsearch.randomizedtesting.RandomizedRunner$9.evaluate(RandomizedRunner.java:943)
	at com.carrotsearch.randomizedtesting.RandomizedRunner$10.evaluate(RandomizedRunner.java:957)
	at org.apache.lucene.util.TestRuleSetupTeardownChained$1.evaluate(TestRuleSetupTeardownChained.java:49)
	at org.apache.lucene.util.AbstractBeforeAfterRule$1.evaluate(AbstractBeforeAfterRule.java:45)
	at org.apache.lucene.util.TestRuleThreadAndTestName$1.evaluate(TestRuleThreadAndTestName.java:48)
	at org.apache.lucene.util.TestRuleIgnoreAfterMaxFailures$1.evaluate(TestRuleIgnoreAfterMaxFailures.java:64)
	at org.apache.lucene.util.TestRuleMarkFailure$1.evaluate(TestRuleMarkFailure.java:47)
	at com.carrotsearch.randomizedtesting.rules.StatementAdapter.evaluate(StatementAdapter.java:36)
	at com.carrotsearch.randomizedtesting.ThreadLeakControl$StatementRunner.run(ThreadLeakControl.java:367)
	at com.carrotsearch.randomizedtesting.ThreadLeakControl.forkTimeoutingTask(ThreadLeakControl.java:811)
	at com.carrotsearch.randomizedtesting.ThreadLeakControl$3.evaluate(ThreadLeakControl.java:462)
	at com.carrotsearch.randomizedtesting.RandomizedRunner.runSingleTest(RandomizedRunner.java:916)
	at com.carrotsearch.randomizedtesting.RandomizedRunner$5.evaluate(RandomizedRunner.java:802)
	at com.carrotsearch.randomizedtesting.RandomizedRunner$6.evaluate(RandomizedRunner.java:852)
	at com.carrotsearch.randomizedtesting.RandomizedRunner$7.evaluate(RandomizedRunner.java:863)
	at org.apache.lucene.util.AbstractBeforeAfterRule$1.evaluate(AbstractBeforeAfterRule.java:45)
	at com.carrotsearch.randomizedtesting.rules.StatementAdapter.evaluate(StatementAdapter.java:36)
	at org.apache.lucene.util.TestRuleStoreClassName$1.evaluate(TestRuleStoreClassName.java:41)
	at com.carrotsearch.randomizedtesting.rules.NoShadowingOrOverridesOnMethodsRule$1.evaluate(NoShadowingOrOverridesOnMethodsRule.java:40)
	at com.carrotsearch.randomizedtesting.rules.NoShadowingOrOverridesOnMethodsRule$1.evaluate(NoShadowingOrOverridesOnMethodsRule.java:40)
	at com.carrotsearch.randomizedtesting.rules.StatementAdapter.evaluate(StatementAdapter.java:36)
	at com.carrotsearch.randomizedtesting.rules.StatementAdapter.evaluate(StatementAdapter.java:36)
	at org.apache.lucene.util.TestRuleAssertionsRequired$1.evaluate(TestRuleAssertionsRequired.java:53)
	at org.apache.lucene.util.TestRuleMarkFailure$1.evaluate(TestRuleMarkFailure.java:47)
	at org.apache.lucene.util.TestRuleIgnoreAfterMaxFailures$1.evaluate(TestRuleIgnoreAfterMaxFailures.java:64)
	at org.apache.lucene.util.TestRuleIgnoreTestSuites$1.evaluate(TestRuleIgnoreTestSuites.java:54)
	at com.carrotsearch.randomizedtesting.rules.StatementAdapter.evaluate(StatementAdapter.java:36)
	at com.carrotsearch.randomizedtesting.ThreadLeakControl$StatementRunner.run(ThreadLeakControl.java:367)
	at java.base/java.lang.Thread.run(Thread.java:844)


FAILED:  org.apache.lucene.codecs.memory.TestMemoryPostingsFormat.testRamBytesUsed

Error Message:
Actual RAM usage 376, but got 590940, -157064.89361702127% error

Stack Trace:
java.lang.AssertionError: Actual RAM usage 376, but got 590940, -157064.89361702127% error
	at __randomizedtesting.SeedInfo.seed([DE9F86D6A81BE32F:2C3C94966264FC79]:0)
	at org.junit.Assert.fail(Assert.java:93)
	at org.junit.Assert.assertTrue(Assert.java:43)
	at org.apache.lucene.index.BaseIndexFileFormatTestCase.testRamBytesUsed(BaseIndexFileFormatTestCase.java:279)
	at org.apache.lucene.index.BasePostingsFormatTestCase.testRamBytesUsed(BasePostingsFormatTestCase.java:85)
	at java.base/jdk.internal.reflect.NativeMethodAccessorImpl.invoke0(Native Method)
	at java.base/jdk.internal.reflect.NativeMethodAccessorImpl.invoke(NativeMethodAccessorImpl.java:62)
	at java.base/jdk.internal.reflect.DelegatingMethodAccessorImpl.invoke(DelegatingMethodAccessorImpl.java:43)
	at java.base/java.lang.reflect.Method.invoke(Method.java:538)
	at com.carrotsearch.randomizedtesting.RandomizedRunner.invoke(RandomizedRunner.java:1713)
	at com.carrotsearch.randomizedtesting.RandomizedRunner$8.evaluate(RandomizedRunner.java:907)
	at com.carrotsearch.randomizedtesting.RandomizedRunner$9.evaluate(RandomizedRunner.java:943)
	at com.carrotsearch.randomizedtesting.RandomizedRunner$10.evaluate(RandomizedRunner.java:957)
	at org.apache.lucene.util.TestRuleSetupTeardownChained$1.evaluate(TestRuleSetupTeardownChained.java:49)
	at org.apache.lucene.util.AbstractBeforeAfterRule$1.evaluate(AbstractBeforeAfterRule.java:45)
	at org.apache.lucene.util.TestRuleThreadAndTestName$1.evaluate(TestRuleThreadAndTestName.java:48)
	at org.apache.lucene.util.TestRuleIgnoreAfterMaxFailures$1.evaluate(TestRuleIgnoreAfterMaxFailures.java:64)
	at org.apache.lucene.util.TestRuleMarkFailure$1.evaluate(TestRuleMarkFailure.java:47)
	at com.carrotsearch.randomizedtesting.rules.StatementAdapter.evaluate(StatementAdapter.java:36)
	at com.carrotsearch.randomizedtesting.ThreadLeakControl$StatementRunner.run(ThreadLeakControl.java:367)
	at com.carrotsearch.randomizedtesting.ThreadLeakControl.forkTimeoutingTask(ThreadLeakControl.java:811)
	at com.carrotsearch.randomizedtesting.ThreadLeakControl$3.evaluate(ThreadLeakControl.java:462)
	at com.carrotsearch.randomizedtesting.RandomizedRunner.runSingleTest(RandomizedRunner.java:916)
	at com.carrotsearch.randomizedtesting.RandomizedRunner$5.evaluate(RandomizedRunner.java:802)
	at com.carrotsearch.randomizedtesting.RandomizedRunner$6.evaluate(RandomizedRunner.java:852)
	at com.carrotsearch.randomizedtesting.RandomizedRunner$7.evaluate(RandomizedRunner.java:863)
	at org.apache.lucene.util.AbstractBeforeAfterRule$1.evaluate(AbstractBeforeAfterRule.java:45)
	at com.carrotsearch.randomizedtesting.rules.StatementAdapter.evaluate(StatementAdapter.java:36)
	at org.apache.lucene.util.TestRuleStoreClassName$1.evaluate(TestRuleStoreClassName.java:41)
	at com.carrotsearch.randomizedtesting.rules.NoShadowingOrOverridesOnMethodsRule$1.evaluate(NoShadowingOrOverridesOnMethodsRule.java:40)
	at com.carrotsearch.randomizedtesting.rules.NoShadowingOrOverridesOnMethodsRule$1.evaluate(NoShadowingOrOverridesOnMethodsRule.java:40)
	at com.carrotsearch.randomizedtesting.rules.StatementAdapter.evaluate(StatementAdapter.java:36)
	at com.carrotsearch.randomizedtesting.rules.StatementAdapter.evaluate(StatementAdapter.java:36)
	at org.apache.lucene.util.TestRuleAssertionsRequired$1.evaluate(TestRuleAssertionsRequired.java:53)
	at org.apache.lucene.util.TestRuleMarkFailure$1.evaluate(TestRuleMarkFailure.java:47)
	at org.apache.lucene.util.TestRuleIgnoreAfterMaxFailures$1.evaluate(TestRuleIgnoreAfterMaxFailures.java:64)
	at org.apache.lucene.util.TestRuleIgnoreTestSuites$1.evaluate(TestRuleIgnoreTestSuites.java:54)
	at com.carrotsearch.randomizedtesting.rules.StatementAdapter.evaluate(StatementAdapter.java:36)
	at com.carrotsearch.randomizedtesting.ThreadLeakControl$StatementRunner.run(ThreadLeakControl.java:367)
	at java.base/java.lang.Thread.run(Thread.java:844)


FAILED:  org.apache.lucene.codecs.perfield.TestPerFieldPostingsFormat.testRamBytesUsed

Error Message:
Actual RAM usage 408, but got 6258, -1433.8235294117646% error

Stack Trace:
java.lang.AssertionError: Actual RAM usage 408, but got 6258, -1433.8235294117646% error
	at __randomizedtesting.SeedInfo.seed([3275556E719265E7:C0D6472EBBED7AB1]:0)
	at org.junit.Assert.fail(Assert.java:93)
	at org.junit.Assert.assertTrue(Assert.java:43)
	at org.apache.lucene.index.BaseIndexFileFormatTestCase.testRamBytesUsed(BaseIndexFileFormatTestCase.java:279)
	at org.apache.lucene.index.BasePostingsFormatTestCase.testRamBytesUsed(BasePostingsFormatTestCase.java:85)
	at java.base/jdk.internal.reflect.NativeMethodAccessorImpl.invoke0(Native Method)
	at java.base/jdk.internal.reflect.NativeMethodAccessorImpl.invoke(NativeMethodAccessorImpl.java:62)
	at java.base/jdk.internal.reflect.DelegatingMethodAccessorImpl.invoke(DelegatingMethodAccessorImpl.java:43)
	at java.base/java.lang.reflect.Method.invoke(Method.java:538)
	at com.carrotsearch.randomizedtesting.RandomizedRunner.invoke(RandomizedRunner.java:1713)
	at com.carrotsearch.randomizedtesting.RandomizedRunner$8.evaluate(RandomizedRunner.java:907)
	at com.carrotsearch.randomizedtesting.RandomizedRunner$9.evaluate(RandomizedRunner.java:943)
	at com.carrotsearch.randomizedtesting.RandomizedRunner$10.evaluate(RandomizedRunner.java:957)
	at org.apache.lucene.util.TestRuleSetupTeardownChained$1.evaluate(TestRuleSetupTeardownChained.java:49)
	at org.apache.lucene.util.AbstractBeforeAfterRule$1.evaluate(AbstractBeforeAfterRule.java:45)
	at org.apache.lucene.util.TestRuleThreadAndTestName$1.evaluate(TestRuleThreadAndTestName.java:48)
	at org.apache.lucene.util.TestRuleIgnoreAfterMaxFailures$1.evaluate(TestRuleIgnoreAfterMaxFailures.java:64)
	at org.apache.lucene.util.TestRuleMarkFailure$1.evaluate(TestRuleMarkFailure.java:47)
	at com.carrotsearch.randomizedtesting.rules.StatementAdapter.evaluate(StatementAdapter.java:36)
	at com.carrotsearch.randomizedtesting.ThreadLeakControl$StatementRunner.run(ThreadLeakControl.java:367)
	at com.carrotsearch.randomizedtesting.ThreadLeakControl.forkTimeoutingTask(ThreadLeakControl.java:811)
	at com.carrotsearch.randomizedtesting.ThreadLeakControl$3.evaluate(ThreadLeakControl.java:462)
	at com.carrotsearch.randomizedtesting.RandomizedRunner.runSingleTest(RandomizedRunner.java:916)
	at com.carrotsearch.randomizedtesting.RandomizedRunner$5.evaluate(RandomizedRunner.java:802)
	at com.carrotsearch.randomizedtesting.RandomizedRunner$6.evaluate(RandomizedRunner.java:852)
	at com.carrotsearch.randomizedtesting.RandomizedRunner$7.evaluate(RandomizedRunner.java:863)
	at org.apache.lucene.util.AbstractBeforeAfterRule$1.evaluate(AbstractBeforeAfterRule.java:45)
	at com.carrotsearch.randomizedtesting.rules.StatementAdapter.evaluate(StatementAdapter.java:36)
	at org.apache.lucene.util.TestRuleStoreClassName$1.evaluate(TestRuleStoreClassName.java:41)
	at com.carrotsearch.randomizedtesting.rules.NoShadowingOrOverridesOnMethodsRule$1.evaluate(NoShadowingOrOverridesOnMethodsRule.java:40)
	at com.carrotsearch.randomizedtesting.rules.NoShadowingOrOverridesOnMethodsRule$1.evaluate(NoShadowingOrOverridesOnMethodsRule.java:40)
	at com.carrotsearch.randomizedtesting.rules.StatementAdapter.evaluate(StatementAdapter.java:36)
	at com.carrotsearch.randomizedtesting.rules.StatementAdapter.evaluate(StatementAdapter.java:36)
	at org.apache.lucene.util.TestRuleAssertionsRequired$1.evaluate(TestRuleAssertionsRequired.java:53)
	at org.apache.lucene.util.TestRuleMarkFailure$1.evaluate(TestRuleMarkFailure.java:47)
	at org.apache.lucene.util.TestRuleIgnoreAfterMaxFailures$1.evaluate(TestRuleIgnoreAfterMaxFailures.java:64)
	at org.apache.lucene.util.TestRuleIgnoreTestSuites$1.evaluate(TestRuleIgnoreTestSuites.java:54)
	at com.carrotsearch.randomizedtesting.rules.StatementAdapter.evaluate(StatementAdapter.java:36)
	at com.carrotsearch.randomizedtesting.ThreadLeakControl$StatementRunner.run(ThreadLeakControl.java:367)
	at java.base/java.lang.Thread.run(Thread.java:844)


FAILED:  org.apache.lucene.codecs.simpletext.TestSimpleTextNormsFormat.testRamBytesUsed

Error Message:
Actual RAM usage 314464, but got 689032, -119.11315762694616% error

Stack Trace:
java.lang.AssertionError: Actual RAM usage 314464, but got 689032, -119.11315762694616% error
	at __randomizedtesting.SeedInfo.seed([DE9F86D6A81BE32F:2C3C94966264FC79]:0)
	at org.junit.Assert.fail(Assert.java:93)
	at org.junit.Assert.assertTrue(Assert.java:43)
	at org.apache.lucene.index.BaseIndexFileFormatTestCase.testRamBytesUsed(BaseIndexFileFormatTestCase.java:279)
	at org.apache.lucene.index.BaseNormsFormatTestCase.testRamBytesUsed(BaseNormsFormatTestCase.java:46)
	at java.base/jdk.internal.reflect.NativeMethodAccessorImpl.invoke0(Native Method)
	at java.base/jdk.internal.reflect.NativeMethodAccessorImpl.invoke(NativeMethodAccessorImpl.java:62)
	at java.base/jdk.internal.reflect.DelegatingMethodAccessorImpl.invoke(DelegatingMethodAccessorImpl.java:43)
	at java.base/java.lang.reflect.Method.invoke(Method.java:538)
	at com.carrotsearch.randomizedtesting.RandomizedRunner.invoke(RandomizedRunner.java:1713)
	at com.carrotsearch.randomizedtesting.RandomizedRunner$8.evaluate(RandomizedRunner.java:907)
	at com.carrotsearch.randomizedtesting.RandomizedRunner$9.evaluate(RandomizedRunner.java:943)
	at com.carrotsearch.randomizedtesting.RandomizedRunner$10.evaluate(RandomizedRunner.java:957)
	at org.apache.lucene.util.TestRuleSetupTeardownChained$1.evaluate(TestRuleSetupTeardownChained.java:49)
	at org.apache.lucene.util.AbstractBeforeAfterRule$1.evaluate(AbstractBeforeAfterRule.java:45)
	at org.apache.lucene.util.TestRuleThreadAndTestName$1.evaluate(TestRuleThreadAndTestName.java:48)
	at org.apache.lucene.util.TestRuleIgnoreAfterMaxFailures$1.evaluate(TestRuleIgnoreAfterMaxFailures.java:64)
	at org.apache.lucene.util.TestRuleMarkFailure$1.evaluate(TestRuleMarkFailure.java:47)
	at com.carrotsearch.randomizedtesting.rules.StatementAdapter.evaluate(StatementAdapter.java:36)
	at com.carrotsearch.randomizedtesting.ThreadLeakControl$StatementRunner.run(ThreadLeakControl.java:367)
	at com.carrotsearch.randomizedtesting.ThreadLeakControl.forkTimeoutingTask(ThreadLeakControl.java:811)
	at com.carrotsearch.randomizedtesting.ThreadLeakControl$3.evaluate(ThreadLeakControl.java:462)
	at com.carrotsearch.randomizedtesting.RandomizedRunner.runSingleTest(RandomizedRunner.java:916)
	at com.carrotsearch.randomizedtesting.RandomizedRunner$5.evaluate(RandomizedRunner.java:802)
	at com.carrotsearch.randomizedtesting.RandomizedRunner$6.evaluate(RandomizedRunner.java:852)
	at com.carrotsearch.randomizedtesting.RandomizedRunner$7.evaluate(RandomizedRunner.java:863)
	at org.apache.lucene.util.AbstractBeforeAfterRule$1.evaluate(AbstractBeforeAfterRule.java:45)
	at com.carrotsearch.randomizedtesting.rules.StatementAdapter.evaluate(StatementAdapter.java:36)
	at org.apache.lucene.util.TestRuleStoreClassName$1.evaluate(TestRuleStoreClassName.java:41)
	at com.carrotsearch.randomizedtesting.rules.NoShadowingOrOverridesOnMethodsRule$1.evaluate(NoShadowingOrOverridesOnMethodsRule.java:40)
	at com.carrotsearch.randomizedtesting.rules.NoShadowingOrOverridesOnMethodsRule$1.evaluate(NoShadowingOrOverridesOnMethodsRule.java:40)
	at com.carrotsearch.randomizedtesting.rules.StatementAdapter.evaluate(StatementAdapter.java:36)
	at com.carrotsearch.randomizedtesting.rules.StatementAdapter.evaluate(StatementAdapter.java:36)
	at org.apache.lucene.util.TestRuleAssertionsRequired$1.evaluate(TestRuleAssertionsRequired.java:53)
	at org.apache.lucene.util.TestRuleMarkFailure$1.evaluate(TestRuleMarkFailure.java:47)
	at org.apache.lucene.util.TestRuleIgnoreAfterMaxFailures$1.evaluate(TestRuleIgnoreAfterMaxFailures.java:64)
	at org.apache.lucene.util.TestRuleIgnoreTestSuites$1.evaluate(TestRuleIgnoreTestSuites.java:54)
	at com.carrotsearch.randomizedtesting.rules.StatementAdapter.evaluate(StatementAdapter.java:36)
	at com.carrotsearch.randomizedtesting.ThreadLeakControl$StatementRunner.run(ThreadLeakControl.java:367)
	at java.base/java.lang.Thread.run(Thread.java:844)


FAILED:  org.apache.solr.metrics.reporters.SolrGangliaReporterTest.testReporter

Error Message:


Stack Trace:
java.util.ConcurrentModificationException
	at __randomizedtesting.SeedInfo.seed([B86E1D91F55AFC5D:E78A30A69E566F18]:0)
	at java.base/java.util.ArrayList$Itr.checkForComodification(ArrayList.java:938)
	at java.base/java.util.ArrayList$Itr.next(ArrayList.java:888)
	at org.apache.solr.metrics.reporters.SolrGangliaReporterTest.testReporter(SolrGangliaReporterTest.java:76)
	at java.base/jdk.internal.reflect.NativeMethodAccessorImpl.invoke0(Native Method)
	at java.base/jdk.internal.reflect.NativeMethodAccessorImpl.invoke(NativeMethodAccessorImpl.java:62)
	at java.base/jdk.internal.reflect.DelegatingMethodAccessorImpl.invoke(DelegatingMethodAccessorImpl.java:43)
	at java.base/java.lang.reflect.Method.invoke(Method.java:538)
	at com.carrotsearch.randomizedtesting.RandomizedRunner.invoke(RandomizedRunner.java:1713)
	at com.carrotsearch.randomizedtesting.RandomizedRunner$8.evaluate(RandomizedRunner.java:907)
	at com.carrotsearch.randomizedtesting.RandomizedRunner$9.evaluate(RandomizedRunner.java:943)
	at com.carrotsearch.randomizedtesting.RandomizedRunner$10.evaluate(RandomizedRunner.java:957)
	at com.carrotsearch.randomizedtesting.rules.SystemPropertiesRestoreRule$1.evaluate(SystemPropertiesRestoreRule.java:57)
	at org.apache.lucene.util.TestRuleSetupTeardownChained$1.evaluate(TestRuleSetupTeardownChained.java:49)
	at org.apache.lucene.util.AbstractBeforeAfterRule$1.evaluate(AbstractBeforeAfterRule.java:45)
	at org.apache.lucene.util.TestRuleThreadAndTestName$1.evaluate(TestRuleThreadAndTestName.java:48)
	at org.apache.lucene.util.TestRuleIgnoreAfterMaxFailures$1.evaluate(TestRuleIgnoreAfterMaxFailures.java:64)
	at org.apache.lucene.util.TestRuleMarkFailure$1.evaluate(TestRuleMarkFailure.java:47)
	at com.carrotsearch.randomizedtesting.rules.StatementAdapter.evaluate(StatementAdapter.java:36)
	at com.carrotsearch.randomizedtesting.ThreadLeakControl$StatementRunner.run(ThreadLeakControl.java:367)
	at com.carrotsearch.randomizedtesting.ThreadLeakControl.forkTimeoutingTask(ThreadLeakControl.java:811)
	at com.carrotsearch.randomizedtesting.ThreadLeakControl$3.evaluate(ThreadLeakControl.java:462)
	at com.carrotsearch.randomizedtesting.RandomizedRunner.runSingleTest(RandomizedRunner.java:916)
	at com.carrotsearch.randomizedtesting.RandomizedRunner$5.evaluate(RandomizedRunner.java:802)
	at com.carrotsearch.randomizedtesting.RandomizedRunner$6.evaluate(RandomizedRunner.java:852)
	at com.carrotsearch.randomizedtesting.RandomizedRunner$7.evaluate(RandomizedRunner.java:863)
	at com.carrotsearch.randomizedtesting.rules.StatementAdapter.evaluate(StatementAdapter.java:36)
	at com.carrotsearch.randomizedtesting.rules.SystemPropertiesRestoreRule$1.evaluate(SystemPropertiesRestoreRule.java:57)
	at org.apache.lucene.util.AbstractBeforeAfterRule$1.evaluate(AbstractBeforeAfterRule.java:45)
	at com.carrotsearch.randomizedtesting.rules.StatementAdapter.evaluate(StatementAdapter.java:36)
	at org.apache.lucene.util.TestRuleStoreClassName$1.evaluate(TestRuleStoreClassName.java:41)
	at com.carrotsearch.randomizedtesting.rules.NoShadowingOrOverridesOnMethodsRule$1.evaluate(NoShadowingOrOverridesOnMethodsRule.java:40)
	at com.carrotsearch.randomizedtesting.rules.NoShadowingOrOverridesOnMethodsRule$1.evaluate(NoShadowingOrOverridesOnMethodsRule.java:40)
	at com.carrotsearch.randomizedtesting.rules.StatementAdapter.evaluate(StatementAdapter.java:36)
	at com.carrotsearch.randomizedtesting.rules.StatementAdapter.evaluate(StatementAdapter.java:36)
	at org.apache.lucene.util.TestRuleAssertionsRequired$1.evaluate(TestRuleAssertionsRequired.java:53)
	at org.apache.lucene.util.TestRuleMarkFailure$1.evaluate(TestRuleMarkFailure.java:47)
	at org.apache.lucene.util.TestRuleIgnoreAfterMaxFailures$1.evaluate(TestRuleIgnoreAfterMaxFailures.java:64)
	at org.apache.lucene.util.TestRuleIgnoreTestSuites$1.evaluate(TestRuleIgnoreTestSuites.java:54)
	at com.carrotsearch.randomizedtesting.rules.StatementAdapter.evaluate(StatementAdapter.java:36)
	at com.carrotsearch.randomizedtesting.ThreadLeakControl$StatementRunner.run(ThreadLeakControl.java:367)
	at java.base/java.lang.Thread.run(Thread.java:844)




Build Log:
[...truncated 404 lines...]
   [junit4] Suite: org.apache.lucene.codecs.lucene53.TestLucene53NormsFormat
   [junit4] IGNOR/A 0.00s J2 | TestLucene53NormsFormat.testNCommonBig
   [junit4]    > Assumption #1: 'nightly' test group is disabled (@Nightly())
   [junit4]   2> NOTE: reproduce with: ant test  -Dtestcase=TestLucene53NormsFormat -Dtests.method=testRamBytesUsed -Dtests.seed=3275556E719265E7 -Dtests.multiplier=3 -Dtests.slow=true -Dtests.locale=ar-EG -Dtests.timezone=Australia/Victoria -Dtests.asserts=true -Dtests.file.encoding=UTF-8
   [junit4] FAILURE 0.30s J2 | TestLucene53NormsFormat.testRamBytesUsed <<<
   [junit4]    > Throwable #1: java.lang.AssertionError: Actual RAM usage 456, but got 5947, -1204.1666666666665% error
   [junit4]    > 	at __randomizedtesting.SeedInfo.seed([3275556E719265E7:C0D6472EBBED7AB1]:0)
   [junit4]    > 	at org.apache.lucene.index.BaseIndexFileFormatTestCase.testRamBytesUsed(BaseIndexFileFormatTestCase.java:279)
   [junit4]    > 	at org.apache.lucene.index.BaseNormsFormatTestCase.testRamBytesUsed(BaseNormsFormatTestCase.java:46)
   [junit4]    > 	at java.base/jdk.internal.reflect.NativeMethodAccessorImpl.invoke0(Native Method)
   [junit4]    > 	at java.base/jdk.internal.reflect.NativeMethodAccessorImpl.invoke(NativeMethodAccessorImpl.java:62)
   [junit4]    > 	at java.base/jdk.internal.reflect.DelegatingMethodAccessorImpl.invoke(DelegatingMethodAccessorImpl.java:43)
   [junit4]    > 	at java.base/java.lang.reflect.Method.invoke(Method.java:538)
   [junit4]    > 	at java.base/java.lang.Thread.run(Thread.java:844)
   [junit4] IGNOR/A 0.00s J2 | TestLucene53NormsFormat.testMergeStability
   [junit4]    > Assumption #1: The MockRandom PF randomizes content on the fly, so we can't check it
   [junit4]   2> NOTE: leaving temporary files on disk at: /home/jenkins/workspace/Lucene-Solr-6.x-Linux/lucene/build/core/test/J2/temp/lucene.codecs.lucene53.TestLucene53NormsFormat_3275556E719265E7-001
   [junit4]   2> NOTE: test params are: codec=Asserting(Lucene62): {}, docValues:{}, maxPointsInLeafNode=422, maxMBSortInHeap=6.880558507748937, sim=RandomSimilarity(queryNorm=true,coord=no): {foobar=DFR I(n)L1, content=IB LL-L3(800.0)}, locale=ar-EG, timezone=Australia/Victoria
   [junit4]   2> NOTE: Linux 4.4.0-53-generic i386/Oracle Corporation 9-ea (32-bit)/cpus=12,threads=1,free=96408112,total=193986560
   [junit4]   2> NOTE: All tests run in this JVM: [TestDirectMonotonic, TestBufferedChecksum, TestIndexWriterForceMerge, TestBooleanMinShouldMatch, TestLazyProxSkipping, TestForUtil, TestDocIdsWriter, TestLucene50StoredFieldsFormatHighCompression, TestIndexWriterNRTIsCurrent, TestBagOfPositions, TestSpanExplanations, TestLucene53NormsFormat]
   [junit4] Completed [64/444 (1!)] on J2 in 8.48s, 17 tests, 1 failure, 2 skipped <<< FAILURES!

[...truncated 592 lines...]
   [junit4] Suite: org.apache.lucene.codecs.perfield.TestPerFieldPostingsFormat
   [junit4]   2> NOTE: reproduce with: ant test  -Dtestcase=TestPerFieldPostingsFormat -Dtests.method=testRamBytesUsed -Dtests.seed=3275556E719265E7 -Dtests.multiplier=3 -Dtests.slow=true -Dtests.locale=fi-FI -Dtests.timezone=BET -Dtests.asserts=true -Dtests.file.encoding=UTF-8
   [junit4] FAILURE 1.17s J2 | TestPerFieldPostingsFormat.testRamBytesUsed <<<
   [junit4]    > Throwable #1: java.lang.AssertionError: Actual RAM usage 408, but got 6258, -1433.8235294117646% error
   [junit4]    > 	at __randomizedtesting.SeedInfo.seed([3275556E719265E7:C0D6472EBBED7AB1]:0)
   [junit4]    > 	at org.apache.lucene.index.BaseIndexFileFormatTestCase.testRamBytesUsed(BaseIndexFileFormatTestCase.java:279)
   [junit4]    > 	at org.apache.lucene.index.BasePostingsFormatTestCase.testRamBytesUsed(BasePostingsFormatTestCase.java:85)
   [junit4]    > 	at java.base/jdk.internal.reflect.NativeMethodAccessorImpl.invoke0(Native Method)
   [junit4]    > 	at java.base/jdk.internal.reflect.NativeMethodAccessorImpl.invoke(NativeMethodAccessorImpl.java:62)
   [junit4]    > 	at java.base/jdk.internal.reflect.DelegatingMethodAccessorImpl.invoke(DelegatingMethodAccessorImpl.java:43)
   [junit4]    > 	at java.base/java.lang.reflect.Method.invoke(Method.java:538)
   [junit4]    > 	at java.base/java.lang.Thread.run(Thread.java:844)
   [junit4] IGNOR/A 0.00s J2 | TestPerFieldPostingsFormat.testPostingsEnumReuse
   [junit4]    > Assumption #1: The MockRandom PF randomizes content on the fly, so we can't check it
   [junit4] IGNOR/A 0.00s J2 | TestPerFieldPostingsFormat.testMergeStability
   [junit4]    > Assumption #1: The MockRandom PF randomizes content on the fly, so we can't check it
   [junit4]   2> NOTE: leaving temporary files on disk at: /home/jenkins/workspace/Lucene-Solr-6.x-Linux/lucene/build/core/test/J2/temp/lucene.codecs.perfield.TestPerFieldPostingsFormat_3275556E719265E7-001
   [junit4]   2> NOTE: test params are: codec=CheapBastard, sim=RandomSimilarity(queryNorm=false,coord=no): {f_DOCS_AND_FREQS=DFR G2, field=DFR GBZ(0.3), f_DOCS_AND_FREQS_AND_POSITIONS_AND_OFFSETS=DFR I(F)BZ(0.3), f_DOCS_AND_FREQS_AND_POSITIONS=DFR I(F)2, body=DFR I(ne)B2, f_DOCS=DFR I(n)B1}, locale=fi-FI, timezone=BET
   [junit4]   2> NOTE: Linux 4.4.0-53-generic i386/Oracle Corporation 9-ea (32-bit)/cpus=12,threads=1,free=281711456,total=321912832
   [junit4]   2> NOTE: All tests run in this JVM: [TestDirectMonotonic, TestBufferedChecksum, TestIndexWriterForceMerge, TestBooleanMinShouldMatch, TestLazyProxSkipping, TestForUtil, TestDocIdsWriter, TestLucene50StoredFieldsFormatHighCompression, TestIndexWriterNRTIsCurrent, TestBagOfPositions, TestSpanExplanations, TestLucene53NormsFormat, LimitedFiniteStringsIteratorTest, TestStressNRT, TestWildcard, TestParallelTermEnum, TestSpanSearchEquivalence, TestIntsRef, TestSloppyPhraseQuery, TestMultiPhraseEnum, TestTermQuery, TestMergeSchedulerExternal, TestFixedBitDocIdSet, TestBytesRefArray, TestMultiMMap, TestReaderWrapperDVTypeCheck, TestDocumentsWriterStallControl, TestIndexWriterReader, TestLongPostings, TestEarlyTermination, TestAssertions, TestCharacterUtils, TestQueryBuilder, TestAttributeSource, TestMultiThreadTermVectors, TestNamedSPILoader, TestPositionIncrement, TestBlendedTermQuery, TestPackedTokenAttributeImpl, TestSpanExplanationsOfNonMatches, TestSort, TestElevationComparator, TestNotDocIdSet, TestVersion, TestFileSwitchDirectory, TestStressDeletes, TestBooleanOr, TestByteBlockPool, TestMaxTermFrequency, TestRegExp, TestSpanContainQuery, TestBoostQuery, TestFilterSpans, TestUTF32ToUTF8, TestNorms, TestBytesStore, TestDisjunctionMaxQuery, TestSimpleExplanationsWithFillerDocs, TestConcurrentMergeScheduler, TestDirectoryReader, TestMmapDirectory, Test2BBinaryDocValues, TestDocBoost, TestRamUsageEstimator, TestSameScoresWithThreads, TestSortedSetSelector, TestMatchNoDocsQuery, TestDocumentWriter, TestOrdinalMap, TestIOUtils, TestIndexCommit, TestNoMergePolicy, TestComplexExplanationsOfNonMatches, Test2BPagedBytes, TestIndexWriter, TestPerFieldDocValuesFormat, TestSearcherManager, TestBoolean2, TestTimeLimitingCollector, TestNeverDelete, TestPerFieldPostingsFormat]
   [junit4] Completed [186/444 (2!)] on J2 in 3.74s, 25 tests, 1 failure, 2 skipped <<< FAILURES!

[...truncated 1056 lines...]
   [junit4] Suite: org.apache.lucene.codecs.asserting.TestAssertingNormsFormat
   [junit4]   2> NOTE: reproduce with: ant test  -Dtestcase=TestAssertingNormsFormat -Dtests.method=testRamBytesUsed -Dtests.seed=18F35E00A2FC613F -Dtests.multiplier=3 -Dtests.slow=true -Dtests.locale=ar-001 -Dtests.timezone=America/Tijuana -Dtests.asserts=true -Dtests.file.encoding=UTF-8
   [junit4] FAILURE 1.36s J0 | TestAssertingNormsFormat.testRamBytesUsed <<<
   [junit4]    > Throwable #1: java.lang.AssertionError: Actual RAM usage 344, but got 6857, -1893.3139534883721% error
   [junit4]    > 	at __randomizedtesting.SeedInfo.seed([18F35E00A2FC613F:EA504C4068837E69]:0)
   [junit4]    > 	at org.apache.lucene.index.BaseIndexFileFormatTestCase.testRamBytesUsed(BaseIndexFileFormatTestCase.java:279)
   [junit4]    > 	at org.apache.lucene.index.BaseNormsFormatTestCase.testRamBytesUsed(BaseNormsFormatTestCase.java:46)
   [junit4]    > 	at java.base/jdk.internal.reflect.NativeMethodAccessorImpl.invoke0(Native Method)
   [junit4]    > 	at java.base/jdk.internal.reflect.NativeMethodAccessorImpl.invoke(NativeMethodAccessorImpl.java:62)
   [junit4]    > 	at java.base/jdk.internal.reflect.DelegatingMethodAccessorImpl.invoke(DelegatingMethodAccessorImpl.java:43)
   [junit4]    > 	at java.base/java.lang.reflect.Method.invoke(Method.java:538)
   [junit4]    > 	at java.base/java.lang.Thread.run(Thread.java:844)
   [junit4] IGNOR/A 0.00s J0 | TestAssertingNormsFormat.testNCommonBig
   [junit4]    > Assumption #1: 'nightly' test group is disabled (@Nightly())
   [junit4] IGNOR/A 0.00s J0 | TestAssertingNormsFormat.testMergeStability
   [junit4]    > Assumption #1: The MockRandom PF randomizes content on the fly, so we can't check it
   [junit4]   2> NOTE: leaving temporary files on disk at: /home/jenkins/workspace/Lucene-Solr-6.x-Linux/lucene/build/test-framework/test/J0/temp/lucene.codecs.asserting.TestAssertingNormsFormat_18F35E00A2FC613F-001
   [junit4]   2> NOTE: test params are: codec=Asserting(Lucene62), sim=RandomSimilarity(queryNorm=false,coord=yes): {foobar=DFR I(ne)Z(0.3), content=DFR I(F)3(800.0)}, locale=ar-001, timezone=America/Tijuana
   [junit4]   2> NOTE: Linux 4.4.0-53-generic i386/Oracle Corporation 9-ea (32-bit)/cpus=12,threads=1,free=42322248,total=83886080
   [junit4]   2> NOTE: All tests run in this JVM: [TestMockSynonymFilter, TestWindowsFS, TestRunWithRestrictedPermissions, TestWorstCaseTestBehavior, TestHandleLimitFS, TestAssertingNormsFormat]
   [junit4] Completed [18/42 (1!)] on J0 in 14.52s, 17 tests, 1 failure, 2 skipped <<< FAILURES!

[...truncated 2512 lines...]
   [junit4] Suite: org.apache.lucene.codecs.lucene50.TestLucene50NormsFormat
   [junit4]   2> NOTE: reproduce with: ant test  -Dtestcase=TestLucene50NormsFormat -Dtests.method=testRamBytesUsed -Dtests.seed=93FC1A8FFBD3CA85 -Dtests.multiplier=3 -Dtests.slow=true -Dtests.locale=fr-KM -Dtests.timezone=Europe/Istanbul -Dtests.asserts=true -Dtests.file.encoding=ISO-8859-1
   [junit4] FAILURE 0.96s J1 | TestLucene50NormsFormat.testRamBytesUsed <<<
   [junit4]    > Throwable #1: java.lang.AssertionError: Actual RAM usage 6000, but got 13049, -117.48333333333333% error
   [junit4]    > 	at __randomizedtesting.SeedInfo.seed([93FC1A8FFBD3CA85:615F08CF31ACD5D3]:0)
   [junit4]    > 	at org.apache.lucene.index.BaseIndexFileFormatTestCase.testRamBytesUsed(BaseIndexFileFormatTestCase.java:279)
   [junit4]    > 	at org.apache.lucene.index.BaseNormsFormatTestCase.testRamBytesUsed(BaseNormsFormatTestCase.java:46)
   [junit4]    > 	at java.base/jdk.internal.reflect.NativeMethodAccessorImpl.invoke0(Native Method)
   [junit4]    > 	at java.base/jdk.internal.reflect.NativeMethodAccessorImpl.invoke(NativeMethodAccessorImpl.java:62)
   [junit4]    > 	at java.base/jdk.internal.reflect.DelegatingMethodAccessorImpl.invoke(DelegatingMethodAccessorImpl.java:43)
   [junit4]    > 	at java.base/java.lang.reflect.Method.invoke(Method.java:538)
   [junit4]    > 	at java.base/java.lang.Thread.run(Thread.java:844)
   [junit4] IGNOR/A 0.00s J1 | TestLucene50NormsFormat.testNCommonBig
   [junit4]    > Assumption #1: 'nightly' test group is disabled (@Nightly())
   [junit4] IGNOR/A 0.00s J1 | TestLucene50NormsFormat.testMergeStability
   [junit4]    > Assumption #1: The MockRandom PF randomizes content on the fly, so we can't check it
   [junit4]   2> NOTE: leaving temporary files on disk at: /home/jenkins/workspace/Lucene-Solr-6.x-Linux/lucene/build/backward-codecs/test/J1/temp/lucene.codecs.lucene50.TestLucene50NormsFormat_93FC1A8FFBD3CA85-001
   [junit4]   2> NOTE: test params are: codec=HighCompressionCompressingStoredFields(storedFieldsFormat=CompressingStoredFieldsFormat(compressionMode=HIGH_COMPRESSION, chunkSize=6967, maxDocsPerChunk=931, blockSize=10), termVectorsFormat=CompressingTermVectorsFormat(compressionMode=HIGH_COMPRESSION, chunkSize=6967, blockSize=10)), sim=RandomSimilarity(queryNorm=false,coord=yes): {foobar=DFR I(ne)B3(800.0), content=DFR G3(800.0)}, locale=fr-KM, timezone=Europe/Istanbul
   [junit4]   2> NOTE: Linux 4.4.0-53-generic i386/Oracle Corporation 9-ea (32-bit)/cpus=12,threads=1,free=31706288,total=87031808
   [junit4]   2> NOTE: All tests run in this JVM: [TestMaxPositionInOldIndex, TestLucene50NormsFormat]
   [junit4] Completed [4/6 (1!)] on J1 in 14.71s, 19 tests, 1 failure, 2 skipped <<< FAILURES!

[...truncated 1645 lines...]
   [junit4] Suite: org.apache.lucene.codecs.memory.TestFSTPostingsFormat
   [junit4]   2> NOTE: reproduce with: ant test  -Dtestcase=TestFSTPostingsFormat -Dtests.method=testRamBytesUsed -Dtests.seed=DE9F86D6A81BE32F -Dtests.multiplier=3 -Dtests.slow=true -Dtests.locale=zh-SG -Dtests.timezone=America/Indiana/Indianapolis -Dtests.asserts=true -Dtests.file.encoding=ISO-8859-1
   [junit4] FAILURE 0.91s J2 | TestFSTPostingsFormat.testRamBytesUsed <<<
   [junit4]    > Throwable #1: java.lang.AssertionError: Actual RAM usage 376, but got 20700, -5405.31914893617% error
   [junit4]    > 	at __randomizedtesting.SeedInfo.seed([DE9F86D6A81BE32F:2C3C94966264FC79]:0)
   [junit4]    > 	at org.apache.lucene.index.BaseIndexFileFormatTestCase.testRamBytesUsed(BaseIndexFileFormatTestCase.java:279)
   [junit4]    > 	at org.apache.lucene.index.BasePostingsFormatTestCase.testRamBytesUsed(BasePostingsFormatTestCase.java:85)
   [junit4]    > 	at java.base/jdk.internal.reflect.NativeMethodAccessorImpl.invoke0(Native Method)
   [junit4]    > 	at java.base/jdk.internal.reflect.NativeMethodAccessorImpl.invoke(NativeMethodAccessorImpl.java:62)
   [junit4]    > 	at java.base/jdk.internal.reflect.DelegatingMethodAccessorImpl.invoke(DelegatingMethodAccessorImpl.java:43)
   [junit4]    > 	at java.base/java.lang.reflect.Method.invoke(Method.java:538)
   [junit4]    > 	at java.base/java.lang.Thread.run(Thread.java:844)
   [junit4]   2> NOTE: leaving temporary files on disk at: /home/jenkins/workspace/Lucene-Solr-6.x-Linux/lucene/build/codecs/test/J2/temp/lucene.codecs.memory.TestFSTPostingsFormat_DE9F86D6A81BE32F-001
   [junit4]   2> NOTE: test params are: codec=Asserting(Lucene62): {}, docValues:{}, maxPointsInLeafNode=768, maxMBSortInHeap=7.1700399359664635, sim=RandomSimilarity(queryNorm=false,coord=crazy): {f_DOCS_AND_FREQS=DFR I(n)2, field=DFR I(F)B3(800.0), f_DOCS_AND_FREQS_AND_POSITIONS_AND_OFFSETS=DFR I(ne)L2, f_DOCS_AND_FREQS_AND_POSITIONS=DFR I(ne)2, body=IB LL-D3(800.0), f_DOCS=DFR G1}, locale=zh-SG, timezone=America/Indiana/Indianapolis
   [junit4]   2> NOTE: Linux 4.4.0-53-generic i386/Oracle Corporation 9-ea (32-bit)/cpus=12,threads=1,free=50582144,total=69206016
   [junit4]   2> NOTE: All tests run in this JVM: [TestSimpleTextSegmentInfoFormat, TestBloomPostingsFormat, TestSimpleTextFieldInfoFormat, TestFSTPostingsFormat]
   [junit4] Completed [5/20 (1!)] on J2 in 4.74s, 25 tests, 1 failure <<< FAILURES!

[...truncated 1 lines...]
   [junit4] Suite: org.apache.lucene.codecs.blocktreeords.TestOrdsBlockTree
   [junit4]   2> NOTE: reproduce with: ant test  -Dtestcase=TestOrdsBlockTree -Dtests.method=testRamBytesUsed -Dtests.seed=DE9F86D6A81BE32F -Dtests.multiplier=3 -Dtests.slow=true -Dtests.locale=sk -Dtests.timezone=Pacific/Ponape -Dtests.asserts=true -Dtests.file.encoding=ISO-8859-1
   [junit4] FAILURE 1.04s J2 | TestOrdsBlockTree.testRamBytesUsed <<<
   [junit4]    > Throwable #1: java.lang.AssertionError: Actual RAM usage 376, but got 2063, -448.67021276595744% error
   [junit4]    > 	at __randomizedtesting.SeedInfo.seed([DE9F86D6A81BE32F:2C3C94966264FC79]:0)
   [junit4]    > 	at org.apache.lucene.index.BaseIndexFileFormatTestCase.testRamBytesUsed(BaseIndexFileFormatTestCase.java:279)
   [junit4]    > 	at org.apache.lucene.index.BasePostingsFormatTestCase.testRamBytesUsed(BasePostingsFormatTestCase.java:85)
   [junit4]    > 	at java.base/jdk.internal.reflect.NativeMethodAccessorImpl.invoke0(Native Method)
   [junit4]    > 	at java.base/jdk.internal.reflect.NativeMethodAccessorImpl.invoke(NativeMethodAccessorImpl.java:62)
   [junit4]    > 	at java.base/jdk.internal.reflect.DelegatingMethodAccessorImpl.invoke(DelegatingMethodAccessorImpl.java:43)
   [junit4]    > 	at java.base/java.lang.reflect.Method.invoke(Method.java:538)
   [junit4]    > 	at java.base/java.lang.Thread.run(Thread.java:844)
   [junit4]   2> NOTE: leaving temporary files on disk at: /home/jenkins/workspace/Lucene-Solr-6.x-Linux/lucene/build/codecs/test/J2/temp/lucene.codecs.blocktreeords.TestOrdsBlockTree_DE9F86D6A81BE32F-001
   [junit4]   2> NOTE: test params are: codec=Asserting(Lucene62): {}, docValues:{}, maxPointsInLeafNode=1996, maxMBSortInHeap=5.729085533201928, sim=RandomSimilarity(queryNorm=true,coord=no): {f_DOCS_AND_FREQS=DFR G3(800.0), field=DFR I(n)B1, f_DOCS_AND_FREQS_AND_POSITIONS_AND_OFFSETS=DFR I(F)Z(0.3), f_DOCS_AND_FREQS_AND_POSITIONS=DFR GBZ(0.3), body=IB SPL-L1, f_DOCS=IB SPL-LZ(0.3)}, locale=sk, timezone=Pacific/Ponape
   [junit4]   2> NOTE: Linux 4.4.0-53-generic i386/Oracle Corporation 9-ea (32-bit)/cpus=12,threads=1,free=55150120,total=69206016
   [junit4]   2> NOTE: All tests run in this JVM: [TestSimpleTextSegmentInfoFormat, TestBloomPostingsFormat, TestSimpleTextFieldInfoFormat, TestFSTPostingsFormat, TestOrdsBlockTree]
   [junit4] Completed [6/20 (2!)] on J2 in 5.53s, 32 tests, 1 failure <<< FAILURES!

[...truncated 16 lines...]
   [junit4] Suite: org.apache.lucene.codecs.memory.TestMemoryPostingsFormat
   [junit4]   2> NOTE: reproduce with: ant test  -Dtestcase=TestMemoryPostingsFormat -Dtests.method=testRamBytesUsed -Dtests.seed=DE9F86D6A81BE32F -Dtests.multiplier=3 -Dtests.slow=true -Dtests.locale=es-BO -Dtests.timezone=Etc/GMT+10 -Dtests.asserts=true -Dtests.file.encoding=ISO-8859-1
   [junit4] FAILURE 0.88s J0 | TestMemoryPostingsFormat.testRamBytesUsed <<<
   [junit4]    > Throwable #1: java.lang.AssertionError: Actual RAM usage 376, but got 590940, -157064.89361702127% error
   [junit4]    > 	at __randomizedtesting.SeedInfo.seed([DE9F86D6A81BE32F:2C3C94966264FC79]:0)
   [junit4]    > 	at org.apache.lucene.index.BaseIndexFileFormatTestCase.testRamBytesUsed(BaseIndexFileFormatTestCase.java:279)
   [junit4]    > 	at org.apache.lucene.index.BasePostingsFormatTestCase.testRamBytesUsed(BasePostingsFormatTestCase.java:85)
   [junit4]    > 	at java.base/jdk.internal.reflect.NativeMethodAccessorImpl.invoke0(Native Method)
   [junit4]    > 	at java.base/jdk.internal.reflect.NativeMethodAccessorImpl.invoke(NativeMethodAccessorImpl.java:62)
   [junit4]    > 	at java.base/jdk.internal.reflect.DelegatingMethodAccessorImpl.invoke(DelegatingMethodAccessorImpl.java:43)
   [junit4]    > 	at java.base/java.lang.reflect.Method.invoke(Method.java:538)
   [junit4]    > 	at java.base/java.lang.Thread.run(Thread.java:844)
   [junit4]   2> NOTE: leaving temporary files on disk at: /home/jenkins/workspace/Lucene-Solr-6.x-Linux/lucene/build/codecs/test/J0/temp/lucene.codecs.memory.TestMemoryPostingsFormat_DE9F86D6A81BE32F-001
   [junit4]   2> NOTE: test params are: codec=Asserting(Lucene62), sim=RandomSimilarity(queryNorm=false,coord=yes): {f_DOCS_AND_FREQS=DFR I(n)L1, field=DFR GB2, f_DOCS_AND_FREQS_AND_POSITIONS_AND_OFFSETS=DFR I(ne)BZ(0.3), f_DOCS_AND_FREQS_AND_POSITIONS=DFR GZ(0.3), body=DFR I(ne)L1, f_DOCS=DFR GB1}, locale=es-BO, timezone=Etc/GMT+10
   [junit4]   2> NOTE: Linux 4.4.0-53-generic i386/Oracle Corporation 9-ea (32-bit)/cpus=12,threads=1,free=113962768,total=152043520
   [junit4]   2> NOTE: All tests run in this JVM: [TestDirectDocValuesFormat, TestSimpleTextStoredFieldsFormat, TestMemoryDocValuesFormat, TestMemoryPostingsFormat]
   [junit4] Completed [11/20 (3!)] on J0 in 5.24s, 25 tests, 1 failure <<< FAILURES!

[...truncated 1 lines...]
   [junit4] Suite: org.apache.lucene.codecs.memory.TestDirectPostingsFormat
   [junit4]   2> NOTE: reproduce with: ant test  -Dtestcase=TestDirectPostingsFormat -Dtests.method=testRamBytesUsed -Dtests.seed=DE9F86D6A81BE32F -Dtests.multiplier=3 -Dtests.slow=true -Dtests.locale=uz-Arab -Dtests.timezone=AET -Dtests.asserts=true -Dtests.file.encoding=ISO-8859-1
   [junit4] FAILURE 0.63s J0 | TestDirectPostingsFormat.testRamBytesUsed <<<
   [junit4]    > Throwable #1: java.lang.AssertionError: Actual RAM usage 376, but got 4085640, -1086506.3829787234% error
   [junit4]    > 	at __randomizedtesting.SeedInfo.seed([DE9F86D6A81BE32F:2C3C94966264FC79]:0)
   [junit4]    > 	at org.apache.lucene.index.BaseIndexFileFormatTestCase.testRamBytesUsed(BaseIndexFileFormatTestCase.java:279)
   [junit4]    > 	at org.apache.lucene.index.BasePostingsFormatTestCase.testRamBytesUsed(BasePostingsFormatTestCase.java:85)
   [junit4]    > 	at java.base/jdk.internal.reflect.NativeMethodAccessorImpl.invoke0(Native Method)
   [junit4]    > 	at java.base/jdk.internal.reflect.NativeMethodAccessorImpl.invoke(NativeMethodAccessorImpl.java:62)
   [junit4]    > 	at java.base/jdk.internal.reflect.DelegatingMethodAccessorImpl.invoke(DelegatingMethodAccessorImpl.java:43)
   [junit4]    > 	at java.base/java.lang.reflect.Method.invoke(Method.java:538)
   [junit4]    > 	at java.base/java.lang.Thread.run(Thread.java:844)
   [junit4]   2> NOTE: leaving temporary files on disk at: /home/jenkins/workspace/Lucene-Solr-6.x-Linux/lucene/build/codecs/test/J0/temp/lucene.codecs.memory.TestDirectPostingsFormat_DE9F86D6A81BE32F-001
   [junit4]   2> NOTE: test params are: codec=Asserting(Lucene62): {}, docValues:{}, maxPointsInLeafNode=844, maxMBSortInHeap=5.031206546942719, sim=RandomSimilarity(queryNorm=true,coord=no): {f_DOCS_AND_FREQS=IB LL-D1, field=DFR I(F)1, f_DOCS_AND_FREQS_AND_POSITIONS_AND_OFFSETS=DFR I(ne)3(800.0), f_DOCS_AND_FREQS_AND_POSITIONS=DFI(Saturated), body=DFR I(F)B1, f_DOCS=DFR I(F)BZ(0.3)}, locale=uz-Arab, timezone=AET
   [junit4]   2> NOTE: Linux 4.4.0-53-generic i386/Oracle Corporation 9-ea (32-bit)/cpus=12,threads=1,free=59609536,total=152043520
   [junit4]   2> NOTE: All tests run in this JVM: [TestDirectDocValuesFormat, TestSimpleTextStoredFieldsFormat, TestMemoryDocValuesFormat, TestMemoryPostingsFormat, TestDirectPostingsFormat]
   [junit4] Completed [12/20 (4!)] on J0 in 3.97s, 25 tests, 1 failure <<< FAILURES!

[...truncated 67 lines...]
   [junit4] Suite: org.apache.lucene.codecs.memory.TestFSTOrdPostingsFormat
   [junit4]   2> NOTE: reproduce with: ant test  -Dtestcase=TestFSTOrdPostingsFormat -Dtests.method=testRamBytesUsed -Dtests.seed=DE9F86D6A81BE32F -Dtests.multiplier=3 -Dtests.slow=true -Dtests.locale=mt -Dtests.timezone=SystemV/PST8PDT -Dtests.asserts=true -Dtests.file.encoding=ISO-8859-1
   [junit4] FAILURE 0.68s J0 | TestFSTOrdPostingsFormat.testRamBytesUsed <<<
   [junit4]    > Throwable #1: java.lang.AssertionError: Actual RAM usage 376, but got 21360, -5580.851063829788% error
   [junit4]    > 	at __randomizedtesting.SeedInfo.seed([DE9F86D6A81BE32F:2C3C94966264FC79]:0)
   [junit4]    > 	at org.apache.lucene.index.BaseIndexFileFormatTestCase.testRamBytesUsed(BaseIndexFileFormatTestCase.java:279)
   [junit4]    > 	at org.apache.lucene.index.BasePostingsFormatTestCase.testRamBytesUsed(BasePostingsFormatTestCase.java:85)
   [junit4]    > 	at java.base/jdk.internal.reflect.NativeMethodAccessorImpl.invoke0(Native Method)
   [junit4]    > 	at java.base/jdk.internal.reflect.NativeMethodAccessorImpl.invoke(NativeMethodAccessorImpl.java:62)
   [junit4]    > 	at java.base/jdk.internal.reflect.DelegatingMethodAccessorImpl.invoke(DelegatingMethodAccessorImpl.java:43)
   [junit4]    > 	at java.base/java.lang.reflect.Method.invoke(Method.java:538)
   [junit4]    > 	at java.base/java.lang.Thread.run(Thread.java:844)
   [junit4]   2> NOTE: leaving temporary files on disk at: /home/jenkins/workspace/Lucene-Solr-6.x-Linux/lucene/build/codecs/test/J0/temp/lucene.codecs.memory.TestFSTOrdPostingsFormat_DE9F86D6A81BE32F-001
   [junit4]   2> NOTE: test params are: codec=Asserting(Lucene62): {}, docValues:{}, maxPointsInLeafNode=1408, maxMBSortInHeap=7.664673971871958, sim=RandomSimilarity(queryNorm=true,coord=yes): {f_DOCS_AND_FREQS=DFR I(ne)1, field=DFR I(ne)B2, f_DOCS_AND_FREQS_AND_POSITIONS_AND_OFFSETS=DFR I(ne)B1, f_DOCS_AND_FREQS_AND_POSITIONS=DFR I(ne)L2, body=DFR I(F)3(800.0), f_DOCS=DFR I(ne)B2}, locale=mt, timezone=SystemV/PST8PDT
   [junit4]   2> NOTE: Linux 4.4.0-53-generic i386/Oracle Corporation 9-ea (32-bit)/cpus=12,threads=1,free=99961840,total=152043520
   [junit4]   2> NOTE: All tests run in this JVM: [TestDirectDocValuesFormat, TestSimpleTextStoredFieldsFormat, TestMemoryDocValuesFormat, TestMemoryPostingsFormat, TestDirectPostingsFormat, TestFixedGapPostingsFormat, TestSimpleTextPostingsFormat, TestVarGapDocFreqIntervalPostingsFormat, TestFSTOrdPostingsFormat]
   [junit4] Completed [17/20 (5!)] on J0 in 3.91s, 25 tests, 1 failure <<< FAILURES!

[...truncated 4 lines...]
   [junit4] Suite: org.apache.lucene.codecs.simpletext.TestSimpleTextNormsFormat
   [junit4] IGNOR/A 0.00s J0 | TestSimpleTextNormsFormat.testMergeStability
   [junit4]    > Assumption #1: The MockRandom PF randomizes content on the fly, so we can't check it
   [junit4] IGNOR/A 0.00s J0 | TestSimpleTextNormsFormat.testNCommonBig
   [junit4]    > Assumption #1: 'nightly' test group is disabled (@Nightly())
   [junit4]   2> NOTE: reproduce with: ant test  -Dtestcase=TestSimpleTextNormsFormat -Dtests.method=testRamBytesUsed -Dtests.seed=DE9F86D6A81BE32F -Dtests.multiplier=3 -Dtests.slow=true -Dtests.locale=zh-Hant -Dtests.timezone=America/Grand_Turk -Dtests.asserts=true -Dtests.file.encoding=ISO-8859-1
   [junit4] FAILURE 1.36s J0 | TestSimpleTextNormsFormat.testRamBytesUsed <<<
   [junit4]    > Throwable #1: java.lang.AssertionError: Actual RAM usage 314464, but got 689032, -119.11315762694616% error
   [junit4]    > 	at __randomizedtesting.SeedInfo.seed([DE9F86D6A81BE32F:2C3C94966264FC79]:0)
   [junit4]    > 	at org.apache.lucene.index.BaseIndexFileFormatTestCase.testRamBytesUsed(BaseIndexFileFormatTestCase.java:279)
   [junit4]    > 	at org.apache.lucene.index.BaseNormsFormatTestCase.testRamBytesUsed(BaseNormsFormatTestCase.java:46)
   [junit4]    > 	at java.base/jdk.internal.reflect.NativeMethodAccessorImpl.invoke0(Native Method)
   [junit4]    > 	at java.base/jdk.internal.reflect.NativeMethodAccessorImpl.invoke(NativeMethodAccessorImpl.java:62)
   [junit4]    > 	at java.base/jdk.internal.reflect.DelegatingMethodAccessorImpl.invoke(DelegatingMethodAccessorImpl.java:43)
   [junit4]    > 	at java.base/java.lang.reflect.Method.invoke(Method.java:538)
   [junit4]    > 	at java.base/java.lang.Thread.run(Thread.java:844)
   [junit4]   2> NOTE: leaving temporary files on disk at: /home/jenkins/workspace/Lucene-Solr-6.x-Linux/lucene/build/codecs/test/J0/temp/lucene.codecs.simpletext.TestSimpleTextNormsFormat_DE9F86D6A81BE32F-001
   [junit4]   2> NOTE: test params are: codec=Asserting(Lucene62), sim=RandomSimilarity(queryNorm=false,coord=yes): {foobar=DFR I(F)L2, content=DFR I(ne)B2}, locale=zh-Hant, timezone=America/Grand_Turk
   [junit4]   2> NOTE: Linux 4.4.0-53-generic i386/Oracle Corporation 9-ea (32-bit)/cpus=12,threads=1,free=103952040,total=152043520
   [junit4]   2> NOTE: All tests run in this JVM: [TestDirectDocValuesFormat, TestSimpleTextStoredFieldsFormat, TestMemoryDocValuesFormat, TestMemoryPostingsFormat, TestDirectPostingsFormat, TestFixedGapPostingsFormat, TestSimpleTextPostingsFormat, TestVarGapDocFreqIntervalPostingsFormat, TestFSTOrdPostingsFormat, TestSimpleTextNormsFormat]
   [junit4] Completed [19/20 (6!)] on J0 in 14.44s, 17 tests, 1 failure, 2 skipped <<< FAILURES!

[...truncated 6410 lines...]
   [junit4] Suite: org.apache.solr.metrics.reporters.SolrGangliaReporterTest
   [junit4]   2> Creating dataDir: /home/jenkins/workspace/Lucene-Solr-6.x-Linux/solr/build/solr-core/test/J1/temp/solr.metrics.reporters.SolrGangliaReporterTest_B86E1D91F55AFC5D-001/init-core-data-001
   [junit4]   2> 1793223 INFO  (SUITE-SolrGangliaReporterTest-seed#[B86E1D91F55AFC5D]-worker) [    ] o.a.s.SolrTestCaseJ4 Randomized ssl (true) and clientAuth (true) via: @org.apache.solr.util.RandomizeSSL(reason="", ssl=0.0/0.0, value=0.0/0.0, clientAuth=0.0/0.0)
   [junit4]   2> 1793227 INFO  (TEST-SolrGangliaReporterTest.testReporter-seed#[B86E1D91F55AFC5D]) [    ] o.a.s.SolrTestCaseJ4 ###Starting testReporter
   [junit4]   2> 1793251 INFO  (TEST-SolrGangliaReporterTest.testReporter-seed#[B86E1D91F55AFC5D]) [    ] o.a.s.u.UpdateShardHandler Creating UpdateShardHandler HTTP client with params: socketTimeout=600000&connTimeout=60000&retry=true
   [junit4]   2> 1793259 INFO  (coreLoadExecutor-7578-thread-1) [    ] o.a.s.c.SolrResourceLoader [null] Added 2 libs to classloader, from paths: [/home/jenkins/workspace/Lucene-Solr-6.x-Linux/solr/core/src/test-files/solr/collection1/lib, /home/jenkins/workspace/Lucene-Solr-6.x-Linux/solr/core/src/test-files/solr/collection1/lib/classes]
   [junit4]   2> 1793336 WARN  (coreLoadExecutor-7578-thread-1) [    ] o.a.s.c.Config Beginning with Solr 5.5, <mergePolicy> is deprecated, use <mergePolicyFactory> instead.
   [junit4]   2> 1793337 INFO  (coreLoadExecutor-7578-thread-1) [    ] o.a.s.c.SolrConfig Using Lucene MatchVersion: 6.4.0
   [junit4]   2> 1793370 INFO  (coreLoadExecutor-7578-thread-1) [    ] o.a.s.s.IndexSchema [collection1] Schema name=test
   [junit4]   2> 1793444 WARN  (coreLoadExecutor-7578-thread-1) [    ] o.a.s.s.IndexSchema [collection1] default search field in schema is text. WARNING: Deprecated, please use 'df' on request instead.
   [junit4]   2> 1793446 INFO  (coreLoadExecutor-7578-thread-1) [    ] o.a.s.s.IndexSchema Loaded schema test/1.0 with uniqueid field id
   [junit4]   2> 1793467 INFO  (coreLoadExecutor-7578-thread-1) [    ] o.a.s.c.CoreContainer Creating SolrCore 'collection1' using configuration from instancedir /home/jenkins/workspace/Lucene-Solr-6.x-Linux/solr/core/src/test-files/solr/collection1
   [junit4]   2> 1793468 INFO  (coreLoadExecutor-7578-thread-1) [    ] o.a.s.c.SolrCore [[collection1] ] Opening new SolrCore at [/home/jenkins/workspace/Lucene-Solr-6.x-Linux/solr/core/src/test-files/solr/collection1], dataDir=[/home/jenkins/workspace/Lucene-Solr-6.x-Linux/solr/build/solr-core/test/J1/temp/solr.metrics.reporters.SolrGangliaReporterTest_B86E1D91F55AFC5D-001/init-core-data-001/]
   [junit4]   2> 1793468 INFO  (coreLoadExecutor-7578-thread-1) [    ] o.a.s.c.JmxMonitoredMap JMX monitoring is enabled. Adding Solr mbeans to JMX Server: com.sun.jmx.mbeanserver.JmxMBeanServer@5b7a73
   [junit4]   2> 1793469 INFO  (coreLoadExecutor-7578-thread-1) [    ] o.a.s.u.RandomMergePolicy RandomMergePolicy wrapping class org.apache.lucene.index.LogByteSizeMergePolicy: [LogByteSizeMergePolicy: minMergeSize=1677721, mergeFactor=33, maxMergeSize=2147483648, maxMergeSizeForForcedMerge=9223372036854775807, calibrateSizeByDeletes=false, maxMergeDocs=2147483647, maxCFSSegmentSizeMB=8.796093022207999E12, noCFSRatio=0.7432136698268356]
   [junit4]   2> 1793481 INFO  (coreLoadExecutor-7578-thread-1) [    ] o.a.s.u.UpdateHandler Using UpdateLog implementation: org.apache.solr.update.UpdateLog
   [junit4]   2> 1793481 INFO  (coreLoadExecutor-7578-thread-1) [    ] o.a.s.u.UpdateLog Initializing UpdateLog: dataDir= defaultSyncLevel=FLUSH numRecordsToKeep=100 maxNumLogsToKeep=10 numVersionBuckets=65536
   [junit4]   2> 1793482 INFO  (coreLoadExecutor-7578-thread-1) [    ] o.a.s.u.CommitTracker Hard AutoCommit: disabled
   [junit4]   2> 1793482 INFO  (coreLoadExecutor-7578-thread-1) [    ] o.a.s.u.CommitTracker Soft AutoCommit: disabled
   [junit4]   2> 1793482 INFO  (coreLoadExecutor-7578-thread-1) [    ] o.a.s.u.RandomMergePolicy RandomMergePolicy wrapping class org.apache.lucene.index.LogDocMergePolicy: [LogDocMergePolicy: minMergeSize=1000, mergeFactor=13, maxMergeSize=9223372036854775807, maxMergeSizeForForcedMerge=9223372036854775807, calibrateSizeByDeletes=false, maxMergeDocs=2147483647, maxCFSSegmentSizeMB=8.796093022207999E12, noCFSRatio=0.6638621973120354]
   [junit4]   2> 1793482 INFO  (coreLoadExecutor-7578-thread-1) [    ] o.a.s.s.SolrIndexSearcher Opening [Searcher@17a4228[collection1] main]
   [junit4]   2> 1793482 INFO  (coreLoadExecutor-7578-thread-1) [    ] o.a.s.h.c.SpellCheckComponent Initializing spell checkers
   [junit4]   2> 1793531 INFO  (coreLoadExecutor-7578-thread-1) [    ] o.a.s.s.DirectSolrSpellChecker init: {name=direct,classname=DirectSolrSpellChecker,field=lowerfilt,minQueryLength=3}
   [junit4]   2> 1793704 INFO  (coreLoadExecutor-7578-thread-1) [    ] o.a.s.h.ReplicationHandler Commits will be reserved for  10000
   [junit4]   2> 1793704 INFO  (searcherExecutor-7579-thread-1) [    ] o.a.s.h.c.SpellCheckComponent Loading spell index for spellchecker: default
   [junit4]   2> 1793705 INFO  (coreLoadExecutor-7578-thread-1) [    ] o.a.s.u.UpdateLog Could not find max version in index or recent updates, using new clock 1555072584810233856
   [junit4]   2> 1793705 INFO  (searcherExecutor-7579-thread-1) [    ] o.a.s.h.c.SpellCheckComponent Loading spell index for spellchecker: direct
   [junit4]   2> 1793705 INFO  (searcherExecutor-7579-thread-1) [    ] o.a.s.h.c.SpellCheckComponent Loading spell index for spellchecker: wordbreak
   [junit4]   2> 1793705 INFO  (searcherExecutor-7579-thread-1) [    ] o.a.s.h.c.SpellCheckComponent Loading spell index for spellchecker: multipleFields
   [junit4]   2> 1793706 INFO  (searcherExecutor-7579-thread-1) [    ] o.a.s.h.c.SpellCheckComponent Loading spell index for spellchecker: jarowinkler
   [junit4]   2> 1793706 INFO  (searcherExecutor-7579-thread-1) [    ] o.a.s.h.c.SpellCheckComponent Loading spell index for spellchecker: external
   [junit4]   2> 1793707 INFO  (searcherExecutor-7579-thread-1) [    ] o.a.s.h.c.SpellCheckComponent Loading spell index for spellchecker: freq
   [junit4]   2> 1793708 INFO  (searcherExecutor-7579-thread-1) [    ] o.a.s.h.c.SpellCheckComponent Loading spell index for spellchecker: fqcn
   [junit4]   2> 1793708 INFO  (searcherExecutor-7579-thread-1) [    ] o.a.s.h.c.SpellCheckComponent Loading spell index for spellchecker: perDict
   [junit4]   2> 1793709 INFO  (searcherExecutor-7579-thread-1) [    ] o.a.s.c.SolrCore [collection1] Registered new searcher Searcher@17a4228[collection1] main{ExitableDirectoryReader(UninvertingDirectoryReader())}
   [junit4]   2> 1798712 INFO  (TEST-SolrGangliaReporterTest.testReporter-seed#[B86E1D91F55AFC5D]) [    ] o.a.s.SolrTestCaseJ4 ###Ending testReporter
   [junit4]   2> NOTE: reproduce with: ant test  -Dtestcase=SolrGangliaReporterTest -Dtests.method=testReporter -Dtests.seed=B86E1D91F55AFC5D -Dtests.multiplier=3 -Dtests.slow=true -Dtests.locale=ast-ES -Dtests.timezone=America/Cayenne -Dtests.asserts=true -Dtests.file.encoding=UTF-8
   [junit4] ERROR   5.49s J1 | SolrGangliaReporterTest.testReporter <<<
   [junit4]    > Throwable #1: java.util.ConcurrentModificationException
   [junit4]    > 	at __randomizedtesting.SeedInfo.seed([B86E1D91F55AFC5D:E78A30A69E566F18]:0)
   [junit4]    > 	at java.base/java.util.ArrayList$Itr.checkForComodification(ArrayList.java:938)
   [junit4]    > 	at java.base/java.util.ArrayList$Itr.next(ArrayList.java:888)
   [junit4]    > 	at org.apache.solr.metrics.reporters.SolrGangliaReporterTest.testReporter(SolrGangliaReporterTest.java:76)
   [junit4]    > 	at java.base/jdk.internal.reflect.NativeMethodAccessorImpl.invoke0(Native Method)
   [junit4]    > 	at java.base/jdk.internal.reflect.NativeMethodAccessorImpl.invoke(NativeMethodAccessorImpl.java:62)
   [junit4]    > 	at java.base/jdk.internal.reflect.DelegatingMethodAccessorImpl.invoke(DelegatingMethodAccessorImpl.java:43)
   [junit4]    > 	at java.base/java.lang.reflect.Method.invoke(Method.java:538)
   [junit4]    > 	at java.base/java.lang.Thread.run(Thread.java:844)
   [junit4]   2> 1798719 INFO  (SUITE-SolrGangliaReporterTest-seed#[B86E1D91F55AFC5D]-worker) [    ] o.a.s.SolrTestCaseJ4 ###deleteCore
   [junit4]   2> 1798719 INFO  (SUITE-SolrGangliaReporterTest-seed#[B86E1D91F55AFC5D]-worker) [    ] o.a.s.c.CoreContainer Shutting down CoreContainer instance=9220576
   [junit4]   2> 1798720 INFO  (coreCloseExecutor-7584-thread-1) [    ] o.a.s.c.SolrCore [collection1]  CLOSING SolrCore org.apache.solr.core.SolrCore@10659d7
   [junit4]   2> 1798726 INFO  (coreCloseExecutor-7584-thread-1) [    ] o.a.s.m.SolrMetricManager Closing metric reporters for: solr.core.collection1
   [junit4]   2> 1798726 INFO  (SUITE-SolrGangliaReporterTest-seed#[B86E1D91F55AFC5D]-worker) [    ] o.a.s.m.SolrMetricManager Closing metric reporters for: solr.node
   [junit4]   2> NOTE: leaving temporary files on disk at: /home/jenkins/workspace/Lucene-Solr-6.x-Linux/solr/build/solr-core/test/J1/temp/solr.metrics.reporters.SolrGangliaReporterTest_B86E1D91F55AFC5D-001
   [junit4]   2> NOTE: test params are: codec=Asserting(Lucene62): {}, docValues:{}, maxPointsInLeafNode=1657, maxMBSortInHeap=6.614160663249434, sim=RandomSimilarity(queryNorm=true,coord=yes): {}, locale=ast-ES, timezone=America/Cayenne
   [junit4]   2> NOTE: Linux 4.4.0-53-generic i386/Oracle Corporation 9-ea (32-bit)/cpus=12,threads=1,free=175634144,total=484442112
   [junit4]   2> NOTE: All tests run in this JVM: [SimplePostToolTest, TestSolrQueryParserDefaultOperatorResource, TestLegacyFieldCache, BigEndianAscendingWordDeserializerTest, TestAuthenticationFramework, TestMiniSolrCloudClusterSSL, SolrCLIZkUtilsTest, OverseerStatusTest, TestSearcherReuse, TestDeleteCollectionOnDownNodes, TestAnalyzeInfixSuggestions, ShardRoutingCustomTest, TestExactSharedStatsCache, SortSpecParsingTest, BJQParserTest, IndexSchemaTest, SpatialFilterTest, ParsingFieldUpdateProcessorsTest, SSLMigrationTest, TestSolrCoreSnapshots, TestNamedUpdateProcessors, TestFiltering, ChaosMonkeySafeLeaderTest, CachingDirectoryFactoryTest, OverseerCollectionConfigSetProcessorTest, DocValuesNotIndexedTest, DistributedSuggestComponentTest, HttpSolrCallGetCoreTest, UpdateRequestProcessorFactoryTest, TestBulkSchemaAPI, TestJavabinTupleStreamParser, TestSolrIndexConfig, SolrInfoMBeanTest, OpenCloseCoreStressTest, TestTolerantUpdateProcessorRandomCloud, EchoParamsTest, CSVRequestHandlerTest, SystemInfoHandlerTest, TestLMDirichletSimilarityFactory, CollectionReloadTest, TestHashPartitioner, DistanceFunctionTest, TestBackupRepositoryFactory, ConfigSetsAPITest, AliasIntegrationTest, SolrIndexSplitterTest, SolrIndexConfigTest, MultiTermTest, TestQuerySenderListener, CloneFieldUpdateProcessorFactoryTest, TestSolrCloudWithDelegationTokens, CollectionsAPIAsyncDistributedZkTest, DistributedFacetPivotLongTailTest, RecoveryAfterSoftCommitTest, TestScoreJoinQPScore, TestMinMaxOnMultiValuedField, HdfsNNFailoverTest, TermVectorComponentTest, TestFieldCacheSortRandom, TestFieldCollectionResource, TestUseDocValuesAsStored2, VersionInfoTest, TestCollapseQParserPlugin, TestXmlQParserPlugin, PreAnalyzedFieldManagedSchemaCloudTest, SpellCheckComponentTest, HdfsRestartWhileUpdatingTest, TestSweetSpotSimilarityFactory, VMParamsZkACLAndCredentialsProvidersTest, SharedFSAutoReplicaFailoverTest, TestInfoStreamLogging, CursorMarkTest, TestFieldCacheReopen, ConvertedLegacyTest, TestConfigSetsAPIExclusivity, BasicFunctionalityTest, ReplicationFactorTest, RAMDirectoryFactoryTest, TestDocBasedVersionConstraints, TestCoreContainer, TestReqParamsAPI, TestSolr4Spatial2, CoreAdminCreateDiscoverTest, TestSuggestSpellingConverter, ClassificationUpdateProcessorFactoryTest, TestManagedStopFilterFactory, DistribJoinFromCollectionTest, TestTrie, DistributedIntervalFacetingTest, CdcrReplicationHandlerTest, TestRawTransformer, SortByFunctionTest, DocumentBuilderTest, ExitableDirectoryReaderTest, JsonLoaderTest, TestSchemaSimilarityResource, HdfsTlogReplayBufferedWhileIndexingTest, TestMissingGroups, RulesTest, TestQueryWrapperFilter, TestUpdate, ZkControllerTest, DateMathParserTest, SuggesterFSTTest, LoggingHandlerTest, SpellingQueryConverterTest, CustomCollectionTest, TestNonDefinedSimilarityFactory, StressHdfsTest, SoftAutoCommitTest, LeaderElectionContextKeyTest, BasicDistributedZk2Test, CollectionsAPIDistributedZkTest, SyncSliceTest, OverseerTest, ShardRoutingTest, BasicZkTest, ClusterStateUpdateTest, ZkSolrClientTest, TestZkChroot, ZkCLITest, TestDistributedSearch, QueryElevationComponentTest, PeerSyncTest, TestFunctionQuery, TestLazyCores, TestCoreDiscovery, SpellCheckCollatorTest, SuggesterTSTTest, SuggesterTest, TestStressLucene, SuggesterWFSTTest, TestCSVLoader, NoCacheHeaderTest, WordBreakSolrSpellCheckerTest, SchemaVersionSpecificBehaviorTest, TestPseudoReturnFields, TestAtomicUpdateErrorCases, TestRemoteStreaming, DocValuesMultiTest, TestSolrDeletionPolicy1, XsltUpdateRequestHandlerTest, TestSurroundQueryParser, StandardRequestHandlerTest, DirectSolrSpellCheckerTest, TestQueryTypes, TestValueSourceCache, FieldAnalysisRequestHandlerTest, IndexSchemaRuntimeFieldTest, ReturnFieldsTest, TestCSVResponseWriter, SearchHandlerTest, NumericFieldsTest, TestElisionMultitermQuery, TestFuzzyAnalyzedSuggestions, SpellPossibilityIteratorTest, TestCharFilters, TestCodecSupport, TestJmxMonitoredMap, ResourceLoaderTest, ScriptEngineTest, PrimUtilsTest, DOMUtilTest, TestLRUCache, TestDocumentBuilder, SliceStateTest, FileUtilsTest, DistributedMLTComponentTest, TestSimpleTrackingShardHandler, CdcrReplicationDistributedZkTest, CdcrVersionReplicationTest, CleanupOldIndexTest, CloudExitableDirectoryReaderTest, CollectionsAPISolrJTest, ConcurrentDeleteAndCreateCollectionTest, CreateCollectionCleanupTest, DeleteLastCustomShardedReplicaTest, DeleteNodeTest, DeleteShardTest, DeleteStatusTest, LeaderInitiatedRecoveryOnCommitTest, MigrateRouteKeyTest, MultiThreadedOCPTest, SaslZkACLProviderTest, SharedFSAutoReplicaFailoverUtilsTest, SimpleCollectionCreateDeleteTest, TestCloudPivotFacet, TestConfigSetsAPI, TestExclusionRuleCollectionAccess, TestHdfsCloudBackupRestore, TestLeaderElectionWithEmptyReplica, TestLeaderInitiatedRecoveryThread, TestRandomRequestDistribution, TestRequestForwarding, TestSegmentSorting, TestStressCloudBlindAtomicUpdates, HdfsChaosMonkeyNothingIsSafeTest, HdfsChaosMonkeySafeLeaderTest, HdfsCollectionsAPIDistributedZkTest, HdfsRecoverLeaseTest, HdfsThreadLeakTest, HdfsUnloadDistributedZkTest, HdfsWriteToMultipleCollectionsTest, ZkStateReaderTest, ZkStateWriterTest, RuleEngineTest, BlobRepositoryCloudTest, TestCorePropertiesReload, TestDynamicLoading, TestHdfsBackupRestoreCore, TestReplicationHandlerBackup, TestSQLHandlerNonCloud, InfoHandlerTest, MetricsHandlerTest, SecurityConfHandlerTest, SegmentsInfoRequestHandlerTest, StatsReloadRaceTest, DistributedExpandComponentTest, DistributedQueryComponentCustomSortTest, ReplicaListTransformerTest, ShufflingReplicaListTransformerTest, SuggestComponentTest, TestExpandComponent, TestPivotHelperCode, TestTrackingShardHandlerFactory, HighlighterMaxOffsetTest, TestUnifiedSolrHighlighter, WrapperMergePolicyFactoryTest, CheckHdfsIndexTest, JvmMetricsTest, SolrMetricManagerTest, SolrMetricReporterTest, SolrGangliaReporterTest]
   [junit4] Completed [561/675 (1!)] on J1 in 5.52s, 1 test, 1 error <<< FAILURES!

[...truncated 51881 lines...]


Mime
View raw message