lucene-dev mailing list archives

Site index · List index
Message view « Date » · « Thread »
Top « Date » · « Thread »
From Policeman Jenkins Server <jenk...@thetaphi.de>
Subject [JENKINS] Lucene-Solr-master-Linux (32bit/jdk1.8.0_112) - Build # 18543 - Unstable!
Date Fri, 16 Dec 2016 15:48:36 GMT
Build: https://jenkins.thetaphi.de/job/Lucene-Solr-master-Linux/18543/
Java: 32bit/jdk1.8.0_112 -client -XX:+UseConcMarkSweepGC

1 tests failed.
FAILED:  org.apache.solr.security.PKIAuthenticationIntegrationTest.testPkiAuth

Error Message:
There are still nodes recoverying - waited for 10 seconds

Stack Trace:
java.lang.AssertionError: There are still nodes recoverying - waited for 10 seconds
	at __randomizedtesting.SeedInfo.seed([BBB0D8F724242CF:3B0594DE92F4C56E]:0)
	at org.junit.Assert.fail(Assert.java:93)
	at org.apache.solr.cloud.AbstractDistribZkTestBase.waitForRecoveriesToFinish(AbstractDistribZkTestBase.java:184)
	at org.apache.solr.cloud.AbstractFullDistribZkTestBase.waitForRecoveriesToFinish(AbstractFullDistribZkTestBase.java:862)
	at org.apache.solr.cloud.AbstractFullDistribZkTestBase.waitForThingsToLevelOut(AbstractFullDistribZkTestBase.java:1418)
	at org.apache.solr.security.PKIAuthenticationIntegrationTest.testPkiAuth(PKIAuthenticationIntegrationTest.java:50)
	at sun.reflect.NativeMethodAccessorImpl.invoke0(Native Method)
	at sun.reflect.NativeMethodAccessorImpl.invoke(NativeMethodAccessorImpl.java:62)
	at sun.reflect.DelegatingMethodAccessorImpl.invoke(DelegatingMethodAccessorImpl.java:43)
	at java.lang.reflect.Method.invoke(Method.java:498)
	at com.carrotsearch.randomizedtesting.RandomizedRunner.invoke(RandomizedRunner.java:1713)
	at com.carrotsearch.randomizedtesting.RandomizedRunner$8.evaluate(RandomizedRunner.java:907)
	at com.carrotsearch.randomizedtesting.RandomizedRunner$9.evaluate(RandomizedRunner.java:943)
	at com.carrotsearch.randomizedtesting.RandomizedRunner$10.evaluate(RandomizedRunner.java:957)
	at org.apache.solr.BaseDistributedSearchTestCase$ShardsRepeatRule$ShardsFixedStatement.callStatement(BaseDistributedSearchTestCase.java:985)
	at org.apache.solr.BaseDistributedSearchTestCase$ShardsRepeatRule$ShardsStatement.evaluate(BaseDistributedSearchTestCase.java:960)
	at com.carrotsearch.randomizedtesting.rules.SystemPropertiesRestoreRule$1.evaluate(SystemPropertiesRestoreRule.java:57)
	at org.apache.lucene.util.TestRuleSetupTeardownChained$1.evaluate(TestRuleSetupTeardownChained.java:49)
	at org.apache.lucene.util.AbstractBeforeAfterRule$1.evaluate(AbstractBeforeAfterRule.java:45)
	at org.apache.lucene.util.TestRuleThreadAndTestName$1.evaluate(TestRuleThreadAndTestName.java:48)
	at org.apache.lucene.util.TestRuleIgnoreAfterMaxFailures$1.evaluate(TestRuleIgnoreAfterMaxFailures.java:64)
	at org.apache.lucene.util.TestRuleMarkFailure$1.evaluate(TestRuleMarkFailure.java:47)
	at com.carrotsearch.randomizedtesting.rules.StatementAdapter.evaluate(StatementAdapter.java:36)
	at com.carrotsearch.randomizedtesting.ThreadLeakControl$StatementRunner.run(ThreadLeakControl.java:367)
	at com.carrotsearch.randomizedtesting.ThreadLeakControl.forkTimeoutingTask(ThreadLeakControl.java:811)
	at com.carrotsearch.randomizedtesting.ThreadLeakControl$3.evaluate(ThreadLeakControl.java:462)
	at com.carrotsearch.randomizedtesting.RandomizedRunner.runSingleTest(RandomizedRunner.java:916)
	at com.carrotsearch.randomizedtesting.RandomizedRunner$5.evaluate(RandomizedRunner.java:802)
	at com.carrotsearch.randomizedtesting.RandomizedRunner$6.evaluate(RandomizedRunner.java:852)
	at com.carrotsearch.randomizedtesting.RandomizedRunner$7.evaluate(RandomizedRunner.java:863)
	at com.carrotsearch.randomizedtesting.rules.StatementAdapter.evaluate(StatementAdapter.java:36)
	at com.carrotsearch.randomizedtesting.rules.SystemPropertiesRestoreRule$1.evaluate(SystemPropertiesRestoreRule.java:57)
	at org.apache.lucene.util.AbstractBeforeAfterRule$1.evaluate(AbstractBeforeAfterRule.java:45)
	at com.carrotsearch.randomizedtesting.rules.StatementAdapter.evaluate(StatementAdapter.java:36)
	at org.apache.lucene.util.TestRuleStoreClassName$1.evaluate(TestRuleStoreClassName.java:41)
	at com.carrotsearch.randomizedtesting.rules.NoShadowingOrOverridesOnMethodsRule$1.evaluate(NoShadowingOrOverridesOnMethodsRule.java:40)
	at com.carrotsearch.randomizedtesting.rules.NoShadowingOrOverridesOnMethodsRule$1.evaluate(NoShadowingOrOverridesOnMethodsRule.java:40)
	at com.carrotsearch.randomizedtesting.rules.StatementAdapter.evaluate(StatementAdapter.java:36)
	at com.carrotsearch.randomizedtesting.rules.StatementAdapter.evaluate(StatementAdapter.java:36)
	at com.carrotsearch.randomizedtesting.rules.StatementAdapter.evaluate(StatementAdapter.java:36)
	at org.apache.lucene.util.TestRuleAssertionsRequired$1.evaluate(TestRuleAssertionsRequired.java:53)
	at org.apache.lucene.util.TestRuleMarkFailure$1.evaluate(TestRuleMarkFailure.java:47)
	at org.apache.lucene.util.TestRuleIgnoreAfterMaxFailures$1.evaluate(TestRuleIgnoreAfterMaxFailures.java:64)
	at org.apache.lucene.util.TestRuleIgnoreTestSuites$1.evaluate(TestRuleIgnoreTestSuites.java:54)
	at com.carrotsearch.randomizedtesting.rules.StatementAdapter.evaluate(StatementAdapter.java:36)
	at com.carrotsearch.randomizedtesting.ThreadLeakControl$StatementRunner.run(ThreadLeakControl.java:367)
	at java.lang.Thread.run(Thread.java:745)




Build Log:
[...truncated 11345 lines...]
   [junit4] Suite: org.apache.solr.security.PKIAuthenticationIntegrationTest
   [junit4]   2> Creating dataDir: /home/jenkins/workspace/Lucene-Solr-master-Linux/solr/build/solr-core/test/J1/temp/solr.security.PKIAuthenticationIntegrationTest_BBB0D8F724242CF-001/init-core-data-001
   [junit4]   2> 701429 INFO  (SUITE-PKIAuthenticationIntegrationTest-seed#[BBB0D8F724242CF]-worker) [    ] o.a.s.SolrTestCaseJ4 Randomized ssl (false) and clientAuth (false) via: @org.apache.solr.SolrTestCaseJ4$SuppressSSL(bugUrl=None)
   [junit4]   2> 701429 INFO  (SUITE-PKIAuthenticationIntegrationTest-seed#[BBB0D8F724242CF]-worker) [    ] o.a.s.BaseDistributedSearchTestCase Setting hostContext system property: /zq/h
   [junit4]   2> 701431 INFO  (TEST-PKIAuthenticationIntegrationTest.testPkiAuth-seed#[BBB0D8F724242CF]) [    ] o.a.s.c.ZkTestServer STARTING ZK TEST SERVER
   [junit4]   2> 701431 INFO  (Thread-1336) [    ] o.a.s.c.ZkTestServer client port:0.0.0.0/0.0.0.0:0
   [junit4]   2> 701431 INFO  (Thread-1336) [    ] o.a.s.c.ZkTestServer Starting server
   [junit4]   2> 701531 INFO  (TEST-PKIAuthenticationIntegrationTest.testPkiAuth-seed#[BBB0D8F724242CF]) [    ] o.a.s.c.ZkTestServer start zk server on port:35255
   [junit4]   2> 701544 INFO  (TEST-PKIAuthenticationIntegrationTest.testPkiAuth-seed#[BBB0D8F724242CF]) [    ] o.a.s.c.AbstractZkTestCase put /home/jenkins/workspace/Lucene-Solr-master-Linux/solr/core/src/test-files/solr/collection1/conf/solrconfig-tlog.xml to /configs/conf1/solrconfig.xml
   [junit4]   2> 701547 INFO  (TEST-PKIAuthenticationIntegrationTest.testPkiAuth-seed#[BBB0D8F724242CF]) [    ] o.a.s.c.AbstractZkTestCase put /home/jenkins/workspace/Lucene-Solr-master-Linux/solr/core/src/test-files/solr/collection1/conf/schema.xml to /configs/conf1/schema.xml
   [junit4]   2> 701550 INFO  (TEST-PKIAuthenticationIntegrationTest.testPkiAuth-seed#[BBB0D8F724242CF]) [    ] o.a.s.c.AbstractZkTestCase put /home/jenkins/workspace/Lucene-Solr-master-Linux/solr/core/src/test-files/solr/collection1/conf/solrconfig.snippet.randomindexconfig.xml to /configs/conf1/solrconfig.snippet.randomindexconfig.xml
   [junit4]   2> 701552 INFO  (TEST-PKIAuthenticationIntegrationTest.testPkiAuth-seed#[BBB0D8F724242CF]) [    ] o.a.s.c.AbstractZkTestCase put /home/jenkins/workspace/Lucene-Solr-master-Linux/solr/core/src/test-files/solr/collection1/conf/stopwords.txt to /configs/conf1/stopwords.txt
   [junit4]   2> 701554 INFO  (TEST-PKIAuthenticationIntegrationTest.testPkiAuth-seed#[BBB0D8F724242CF]) [    ] o.a.s.c.AbstractZkTestCase put /home/jenkins/workspace/Lucene-Solr-master-Linux/solr/core/src/test-files/solr/collection1/conf/protwords.txt to /configs/conf1/protwords.txt
   [junit4]   2> 701555 INFO  (TEST-PKIAuthenticationIntegrationTest.testPkiAuth-seed#[BBB0D8F724242CF]) [    ] o.a.s.c.AbstractZkTestCase put /home/jenkins/workspace/Lucene-Solr-master-Linux/solr/core/src/test-files/solr/collection1/conf/currency.xml to /configs/conf1/currency.xml
   [junit4]   2> 701557 INFO  (TEST-PKIAuthenticationIntegrationTest.testPkiAuth-seed#[BBB0D8F724242CF]) [    ] o.a.s.c.AbstractZkTestCase put /home/jenkins/workspace/Lucene-Solr-master-Linux/solr/core/src/test-files/solr/collection1/conf/enumsConfig.xml to /configs/conf1/enumsConfig.xml
   [junit4]   2> 701559 INFO  (TEST-PKIAuthenticationIntegrationTest.testPkiAuth-seed#[BBB0D8F724242CF]) [    ] o.a.s.c.AbstractZkTestCase put /home/jenkins/workspace/Lucene-Solr-master-Linux/solr/core/src/test-files/solr/collection1/conf/open-exchange-rates.json to /configs/conf1/open-exchange-rates.json
   [junit4]   2> 701562 INFO  (TEST-PKIAuthenticationIntegrationTest.testPkiAuth-seed#[BBB0D8F724242CF]) [    ] o.a.s.c.AbstractZkTestCase put /home/jenkins/workspace/Lucene-Solr-master-Linux/solr/core/src/test-files/solr/collection1/conf/mapping-ISOLatin1Accent.txt to /configs/conf1/mapping-ISOLatin1Accent.txt
   [junit4]   2> 701563 INFO  (TEST-PKIAuthenticationIntegrationTest.testPkiAuth-seed#[BBB0D8F724242CF]) [    ] o.a.s.c.AbstractZkTestCase put /home/jenkins/workspace/Lucene-Solr-master-Linux/solr/core/src/test-files/solr/collection1/conf/old_synonyms.txt to /configs/conf1/old_synonyms.txt
   [junit4]   2> 701565 INFO  (TEST-PKIAuthenticationIntegrationTest.testPkiAuth-seed#[BBB0D8F724242CF]) [    ] o.a.s.c.AbstractZkTestCase put /home/jenkins/workspace/Lucene-Solr-master-Linux/solr/core/src/test-files/solr/collection1/conf/synonyms.txt to /configs/conf1/synonyms.txt
   [junit4]   2> 701677 INFO  (TEST-PKIAuthenticationIntegrationTest.testPkiAuth-seed#[BBB0D8F724242CF]) [    ] o.a.s.SolrTestCaseJ4 Writing core.properties file to /home/jenkins/workspace/Lucene-Solr-master-Linux/solr/build/solr-core/test/J1/temp/solr.security.PKIAuthenticationIntegrationTest_BBB0D8F724242CF-001/control-001/cores/collection1
   [junit4]   2> 701678 INFO  (TEST-PKIAuthenticationIntegrationTest.testPkiAuth-seed#[BBB0D8F724242CF]) [    ] o.e.j.s.Server jetty-9.3.14.v20161028
   [junit4]   2> 701679 INFO  (TEST-PKIAuthenticationIntegrationTest.testPkiAuth-seed#[BBB0D8F724242CF]) [    ] o.e.j.s.h.ContextHandler Started o.e.j.s.ServletContextHandler@327a38{/zq/h,null,AVAILABLE}
   [junit4]   2> 701681 INFO  (TEST-PKIAuthenticationIntegrationTest.testPkiAuth-seed#[BBB0D8F724242CF]) [    ] o.e.j.s.AbstractConnector Started ServerConnector@f911b2{HTTP/1.1,[http/1.1]}{127.0.0.1:43349}
   [junit4]   2> 701681 INFO  (TEST-PKIAuthenticationIntegrationTest.testPkiAuth-seed#[BBB0D8F724242CF]) [    ] o.e.j.s.Server Started @702891ms
   [junit4]   2> 701681 INFO  (TEST-PKIAuthenticationIntegrationTest.testPkiAuth-seed#[BBB0D8F724242CF]) [    ] o.a.s.c.s.e.JettySolrRunner Jetty properties: {solr.data.dir=/home/jenkins/workspace/Lucene-Solr-master-Linux/solr/build/solr-core/test/J1/temp/solr.security.PKIAuthenticationIntegrationTest_BBB0D8F724242CF-001/tempDir-001/control/data, hostContext=/zq/h, hostPort=43349, coreRootDirectory=/home/jenkins/workspace/Lucene-Solr-master-Linux/solr/build/solr-core/test/J1/../../../../../../../../../home/jenkins/workspace/Lucene-Solr-master-Linux/solr/build/solr-core/test/J1/temp/solr.security.PKIAuthenticationIntegrationTest_BBB0D8F724242CF-001/control-001/cores}
   [junit4]   2> 701681 ERROR (TEST-PKIAuthenticationIntegrationTest.testPkiAuth-seed#[BBB0D8F724242CF]) [    ] o.a.s.s.StartupLoggingUtils Missing Java Option solr.log.dir. Logging may be missing or incomplete.
   [junit4]   2> 701681 INFO  (TEST-PKIAuthenticationIntegrationTest.testPkiAuth-seed#[BBB0D8F724242CF]) [    ] o.a.s.s.SolrDispatchFilter  ___      _       Welcome to Apache Solr? version 7.0.0
   [junit4]   2> 701682 INFO  (TEST-PKIAuthenticationIntegrationTest.testPkiAuth-seed#[BBB0D8F724242CF]) [    ] o.a.s.s.SolrDispatchFilter / __| ___| |_ _   Starting in cloud mode on port null
   [junit4]   2> 701682 INFO  (TEST-PKIAuthenticationIntegrationTest.testPkiAuth-seed#[BBB0D8F724242CF]) [    ] o.a.s.s.SolrDispatchFilter \__ \/ _ \ | '_|  Install dir: null
   [junit4]   2> 701682 INFO  (TEST-PKIAuthenticationIntegrationTest.testPkiAuth-seed#[BBB0D8F724242CF]) [    ] o.a.s.s.SolrDispatchFilter |___/\___/_|_|    Start time: 2016-12-16T15:17:01.666Z
   [junit4]   2> 701686 INFO  (TEST-PKIAuthenticationIntegrationTest.testPkiAuth-seed#[BBB0D8F724242CF]) [    ] o.a.s.s.SolrDispatchFilter Loading solr.xml from SolrHome (not found in ZooKeeper)
   [junit4]   2> 701686 INFO  (TEST-PKIAuthenticationIntegrationTest.testPkiAuth-seed#[BBB0D8F724242CF]) [    ] o.a.s.c.SolrXmlConfig Loading container configuration from /home/jenkins/workspace/Lucene-Solr-master-Linux/solr/build/solr-core/test/J1/temp/solr.security.PKIAuthenticationIntegrationTest_BBB0D8F724242CF-001/control-001/solr.xml
   [junit4]   2> 701700 INFO  (TEST-PKIAuthenticationIntegrationTest.testPkiAuth-seed#[BBB0D8F724242CF]) [    ] o.a.s.c.ZkContainer Zookeeper client=127.0.0.1:35255/solr
   [junit4]   2> 701725 INFO  (TEST-PKIAuthenticationIntegrationTest.testPkiAuth-seed#[BBB0D8F724242CF]) [n:127.0.0.1:43349_zq%2Fh    ] o.a.s.c.OverseerElectionContext I am going to be the leader 127.0.0.1:43349_zq%2Fh
   [junit4]   2> 701726 INFO  (TEST-PKIAuthenticationIntegrationTest.testPkiAuth-seed#[BBB0D8F724242CF]) [n:127.0.0.1:43349_zq%2Fh    ] o.a.s.c.Overseer Overseer (id=97117891553918980-127.0.0.1:43349_zq%2Fh-n_0000000000) starting
   [junit4]   2> 701735 INFO  (TEST-PKIAuthenticationIntegrationTest.testPkiAuth-seed#[BBB0D8F724242CF]) [n:127.0.0.1:43349_zq%2Fh    ] o.a.s.c.ZkController Register node as live in ZooKeeper:/live_nodes/127.0.0.1:43349_zq%2Fh
   [junit4]   2> 701737 INFO  (zkCallback-842-thread-1-processing-n:127.0.0.1:43349_zq%2Fh) [n:127.0.0.1:43349_zq%2Fh    ] o.a.s.c.c.ZkStateReader Updated live nodes from ZooKeeper... (0) -> (1)
   [junit4]   2> 701848 INFO  (TEST-PKIAuthenticationIntegrationTest.testPkiAuth-seed#[BBB0D8F724242CF]) [n:127.0.0.1:43349_zq%2Fh    ] o.a.s.c.CorePropertiesLocator Found 1 core definitions underneath /home/jenkins/workspace/Lucene-Solr-master-Linux/solr/build/solr-core/test/J1/../../../../../../../../../home/jenkins/workspace/Lucene-Solr-master-Linux/solr/build/solr-core/test/J1/temp/solr.security.PKIAuthenticationIntegrationTest_BBB0D8F724242CF-001/control-001/cores
   [junit4]   2> 701848 INFO  (TEST-PKIAuthenticationIntegrationTest.testPkiAuth-seed#[BBB0D8F724242CF]) [n:127.0.0.1:43349_zq%2Fh    ] o.a.s.c.CorePropertiesLocator Cores are: [collection1]
   [junit4]   2> 701851 INFO  (OverseerStateUpdate-97117891553918980-127.0.0.1:43349_zq%2Fh-n_0000000000) [n:127.0.0.1:43349_zq%2Fh    ] o.a.s.c.o.ReplicaMutator Assigning new node to shard shard=shard1
   [junit4]   2> 702864 INFO  (coreLoadExecutor-2519-thread-1-processing-n:127.0.0.1:43349_zq%2Fh) [n:127.0.0.1:43349_zq%2Fh c:control_collection   x:collection1] o.a.s.c.SolrConfig Using Lucene MatchVersion: 7.0.0
   [junit4]   2> 702879 INFO  (coreLoadExecutor-2519-thread-1-processing-n:127.0.0.1:43349_zq%2Fh) [n:127.0.0.1:43349_zq%2Fh c:control_collection   x:collection1] o.a.s.s.IndexSchema [collection1] Schema name=test
   [junit4]   2> 702974 WARN  (coreLoadExecutor-2519-thread-1-processing-n:127.0.0.1:43349_zq%2Fh) [n:127.0.0.1:43349_zq%2Fh c:control_collection   x:collection1] o.a.s.s.IndexSchema [collection1] default search field in schema is text. WARNING: Deprecated, please use 'df' on request instead.
   [junit4]   2> 702979 INFO  (coreLoadExecutor-2519-thread-1-processing-n:127.0.0.1:43349_zq%2Fh) [n:127.0.0.1:43349_zq%2Fh c:control_collection   x:collection1] o.a.s.s.IndexSchema Loaded schema test/1.0 with uniqueid field id
   [junit4]   2> 702993 INFO  (coreLoadExecutor-2519-thread-1-processing-n:127.0.0.1:43349_zq%2Fh) [n:127.0.0.1:43349_zq%2Fh c:control_collection   x:collection1] o.a.s.c.CoreContainer Creating SolrCore 'collection1' using configuration from collection control_collection
   [junit4]   2> 702993 INFO  (coreLoadExecutor-2519-thread-1-processing-n:127.0.0.1:43349_zq%2Fh) [n:127.0.0.1:43349_zq%2Fh c:control_collection   x:collection1] o.a.s.c.SolrCore [[collection1] ] Opening new SolrCore at [/home/jenkins/workspace/Lucene-Solr-master-Linux/solr/build/solr-core/test/J1/temp/solr.security.PKIAuthenticationIntegrationTest_BBB0D8F724242CF-001/control-001/cores/collection1], dataDir=[/home/jenkins/workspace/Lucene-Solr-master-Linux/solr/build/solr-core/test/J1/../../../../../../../../../home/jenkins/workspace/Lucene-Solr-master-Linux/solr/build/solr-core/test/J1/temp/solr.security.PKIAuthenticationIntegrationTest_BBB0D8F724242CF-001/control-001/cores/collection1/data/]
   [junit4]   2> 702993 INFO  (coreLoadExecutor-2519-thread-1-processing-n:127.0.0.1:43349_zq%2Fh) [n:127.0.0.1:43349_zq%2Fh c:control_collection   x:collection1] o.a.s.c.JmxMonitoredMap JMX monitoring is enabled. Adding Solr mbeans to JMX Server: com.sun.jmx.mbeanserver.JmxMBeanServer@173cd89
   [junit4]   2> 702995 INFO  (coreLoadExecutor-2519-thread-1-processing-n:127.0.0.1:43349_zq%2Fh) [n:127.0.0.1:43349_zq%2Fh c:control_collection   x:collection1] o.a.s.u.RandomMergePolicy RandomMergePolicy wrapping class org.apache.lucene.index.LogDocMergePolicy: [LogDocMergePolicy: minMergeSize=1000, mergeFactor=46, maxMergeSize=9223372036854775807, maxMergeSizeForForcedMerge=9223372036854775807, calibrateSizeByDeletes=false, maxMergeDocs=2147483647, maxCFSSegmentSizeMB=8.796093022207999E12, noCFSRatio=0.0]
   [junit4]   2> 702998 WARN  (coreLoadExecutor-2519-thread-1-processing-n:127.0.0.1:43349_zq%2Fh) [n:127.0.0.1:43349_zq%2Fh c:control_collection   x:collection1] o.a.s.c.RequestHandlers INVALID paramSet a in requestHandler {type = requestHandler,name = /dump,class = DumpRequestHandler,args = {defaults={a=A,b=B}}}
   [junit4]   2> 703009 INFO  (coreLoadExecutor-2519-thread-1-processing-n:127.0.0.1:43349_zq%2Fh) [n:127.0.0.1:43349_zq%2Fh c:control_collection   x:collection1] o.a.s.u.UpdateHandler Using UpdateLog implementation: org.apache.solr.update.UpdateLog
   [junit4]   2> 703009 INFO  (coreLoadExecutor-2519-thread-1-processing-n:127.0.0.1:43349_zq%2Fh) [n:127.0.0.1:43349_zq%2Fh c:control_collection   x:collection1] o.a.s.u.UpdateLog Initializing UpdateLog: dataDir= defaultSyncLevel=FLUSH numRecordsToKeep=100 maxNumLogsToKeep=10 numVersionBuckets=65536
   [junit4]   2> 703010 INFO  (coreLoadExecutor-2519-thread-1-processing-n:127.0.0.1:43349_zq%2Fh) [n:127.0.0.1:43349_zq%2Fh c:control_collection   x:collection1] o.a.s.u.CommitTracker Hard AutoCommit: disabled
   [junit4]   2> 703010 INFO  (coreLoadExecutor-2519-thread-1-processing-n:127.0.0.1:43349_zq%2Fh) [n:127.0.0.1:43349_zq%2Fh c:control_collection   x:collection1] o.a.s.u.CommitTracker Soft AutoCommit: disabled
   [junit4]   2> 703010 INFO  (coreLoadExecutor-2519-thread-1-processing-n:127.0.0.1:43349_zq%2Fh) [n:127.0.0.1:43349_zq%2Fh c:control_collection   x:collection1] o.a.s.u.RandomMergePolicy RandomMergePolicy wrapping class org.apache.lucene.index.LogDocMergePolicy: [LogDocMergePolicy: minMergeSize=1000, mergeFactor=40, maxMergeSize=9223372036854775807, maxMergeSizeForForcedMerge=9223372036854775807, calibrateSizeByDeletes=false, maxMergeDocs=2147483647, maxCFSSegmentSizeMB=8.796093022207999E12, noCFSRatio=0.5119829699318189]
   [junit4]   2> 703010 INFO  (coreLoadExecutor-2519-thread-1-processing-n:127.0.0.1:43349_zq%2Fh) [n:127.0.0.1:43349_zq%2Fh c:control_collection   x:collection1] o.a.s.s.SolrIndexSearcher Opening [Searcher@16ac3ef[collection1] main]
   [junit4]   2> 703012 INFO  (coreLoadExecutor-2519-thread-1-processing-n:127.0.0.1:43349_zq%2Fh) [n:127.0.0.1:43349_zq%2Fh c:control_collection   x:collection1] o.a.s.r.ManagedResourceStorage Configured ZooKeeperStorageIO with znodeBase: /configs/conf1
   [junit4]   2> 703012 INFO  (coreLoadExecutor-2519-thread-1-processing-n:127.0.0.1:43349_zq%2Fh) [n:127.0.0.1:43349_zq%2Fh c:control_collection   x:collection1] o.a.s.r.ManagedResourceStorage Loaded null at path _rest_managed.json using ZooKeeperStorageIO:path=/configs/conf1
   [junit4]   2> 703012 INFO  (coreLoadExecutor-2519-thread-1-processing-n:127.0.0.1:43349_zq%2Fh) [n:127.0.0.1:43349_zq%2Fh c:control_collection   x:collection1] o.a.s.h.ReplicationHandler Commits will be reserved for  10000
   [junit4]   2> 703014 INFO  (searcherExecutor-2520-thread-1-processing-n:127.0.0.1:43349_zq%2Fh x:collection1 c:control_collection) [n:127.0.0.1:43349_zq%2Fh c:control_collection   x:collection1] o.a.s.c.SolrCore [collection1] Registered new searcher Searcher@16ac3ef[collection1] main{ExitableDirectoryReader(UninvertingDirectoryReader())}
   [junit4]   2> 703014 INFO  (coreLoadExecutor-2519-thread-1-processing-n:127.0.0.1:43349_zq%2Fh) [n:127.0.0.1:43349_zq%2Fh c:control_collection   x:collection1] o.a.s.u.UpdateLog Could not find max version in index or recent updates, using new clock 1553886266521550848
   [junit4]   2> 703022 INFO  (coreZkRegister-2512-thread-1-processing-n:127.0.0.1:43349_zq%2Fh x:collection1 c:control_collection) [n:127.0.0.1:43349_zq%2Fh c:control_collection s:shard1 r:core_node1 x:collection1] o.a.s.c.ShardLeaderElectionContext Enough replicas found to continue.
   [junit4]   2> 703022 INFO  (coreZkRegister-2512-thread-1-processing-n:127.0.0.1:43349_zq%2Fh x:collection1 c:control_collection) [n:127.0.0.1:43349_zq%2Fh c:control_collection s:shard1 r:core_node1 x:collection1] o.a.s.c.ShardLeaderElectionContext I may be the new leader - try and sync
   [junit4]   2> 703022 INFO  (coreZkRegister-2512-thread-1-processing-n:127.0.0.1:43349_zq%2Fh x:collection1 c:control_collection) [n:127.0.0.1:43349_zq%2Fh c:control_collection s:shard1 r:core_node1 x:collection1] o.a.s.c.SyncStrategy Sync replicas to http://127.0.0.1:43349/zq/h/collection1/
   [junit4]   2> 703022 INFO  (coreZkRegister-2512-thread-1-processing-n:127.0.0.1:43349_zq%2Fh x:collection1 c:control_collection) [n:127.0.0.1:43349_zq%2Fh c:control_collection s:shard1 r:core_node1 x:collection1] o.a.s.c.SyncStrategy Sync Success - now sync replicas to me
   [junit4]   2> 703022 INFO  (coreZkRegister-2512-thread-1-processing-n:127.0.0.1:43349_zq%2Fh x:collection1 c:control_collection) [n:127.0.0.1:43349_zq%2Fh c:control_collection s:shard1 r:core_node1 x:collection1] o.a.s.c.SyncStrategy http://127.0.0.1:43349/zq/h/collection1/ has no replicas
   [junit4]   2> 703027 INFO  (coreZkRegister-2512-thread-1-processing-n:127.0.0.1:43349_zq%2Fh x:collection1 c:control_collection) [n:127.0.0.1:43349_zq%2Fh c:control_collection s:shard1 r:core_node1 x:collection1] o.a.s.c.ShardLeaderElectionContext I am the new leader: http://127.0.0.1:43349/zq/h/collection1/ shard1
   [junit4]   2> 703178 INFO  (coreZkRegister-2512-thread-1-processing-n:127.0.0.1:43349_zq%2Fh x:collection1 c:control_collection) [n:127.0.0.1:43349_zq%2Fh c:control_collection s:shard1 r:core_node1 x:collection1] o.a.s.c.ZkController I am the leader, no recovery necessary
   [junit4]   2> 703354 INFO  (TEST-PKIAuthenticationIntegrationTest.testPkiAuth-seed#[BBB0D8F724242CF]) [    ] o.a.s.c.c.ZkStateReader Updated live nodes from ZooKeeper... (0) -> (1)
   [junit4]   2> 703355 INFO  (TEST-PKIAuthenticationIntegrationTest.testPkiAuth-seed#[BBB0D8F724242CF]) [    ] o.a.s.c.s.i.ZkClientClusterStateProvider Cluster at 127.0.0.1:35255/solr ready
   [junit4]   2> 703356 INFO  (TEST-PKIAuthenticationIntegrationTest.testPkiAuth-seed#[BBB0D8F724242CF]) [    ] o.a.s.c.ChaosMonkey monkey: init - expire sessions:false cause connection loss:false
   [junit4]   2> 703356 INFO  (TEST-PKIAuthenticationIntegrationTest.testPkiAuth-seed#[BBB0D8F724242CF]) [    ] o.a.s.c.AbstractFullDistribZkTestBase Creating collection1 with stateFormat=2
   [junit4]   2> 703438 INFO  (TEST-PKIAuthenticationIntegrationTest.testPkiAuth-seed#[BBB0D8F724242CF]) [    ] o.a.s.SolrTestCaseJ4 Writing core.properties file to /home/jenkins/workspace/Lucene-Solr-master-Linux/solr/build/solr-core/test/J1/temp/solr.security.PKIAuthenticationIntegrationTest_BBB0D8F724242CF-001/shard-1-001/cores/collection1
   [junit4]   2> 703439 INFO  (TEST-PKIAuthenticationIntegrationTest.testPkiAuth-seed#[BBB0D8F724242CF]) [    ] o.a.s.c.AbstractFullDistribZkTestBase create jetty 1 in directory /home/jenkins/workspace/Lucene-Solr-master-Linux/solr/build/solr-core/test/J1/temp/solr.security.PKIAuthenticationIntegrationTest_BBB0D8F724242CF-001/shard-1-001
   [junit4]   2> 703440 INFO  (TEST-PKIAuthenticationIntegrationTest.testPkiAuth-seed#[BBB0D8F724242CF]) [    ] o.e.j.s.Server jetty-9.3.14.v20161028
   [junit4]   2> 703440 INFO  (TEST-PKIAuthenticationIntegrationTest.testPkiAuth-seed#[BBB0D8F724242CF]) [    ] o.e.j.s.h.ContextHandler Started o.e.j.s.ServletContextHandler@d92f05{/zq/h,null,AVAILABLE}
   [junit4]   2> 703441 INFO  (TEST-PKIAuthenticationIntegrationTest.testPkiAuth-seed#[BBB0D8F724242CF]) [    ] o.e.j.s.AbstractConnector Started ServerConnector@118a25d{HTTP/1.1,[http/1.1]}{127.0.0.1:45588}
   [junit4]   2> 703441 INFO  (TEST-PKIAuthenticationIntegrationTest.testPkiAuth-seed#[BBB0D8F724242CF]) [    ] o.e.j.s.Server Started @704651ms
   [junit4]   2> 703441 INFO  (TEST-PKIAuthenticationIntegrationTest.testPkiAuth-seed#[BBB0D8F724242CF]) [    ] o.a.s.c.s.e.JettySolrRunner Jetty properties: {solr.data.dir=/home/jenkins/workspace/Lucene-Solr-master-Linux/solr/build/solr-core/test/J1/temp/solr.security.PKIAuthenticationIntegrationTest_BBB0D8F724242CF-001/tempDir-001/jetty1, solrconfig=solrconfig.xml, hostContext=/zq/h, hostPort=45588, coreRootDirectory=/home/jenkins/workspace/Lucene-Solr-master-Linux/solr/build/solr-core/test/J1/temp/solr.security.PKIAuthenticationIntegrationTest_BBB0D8F724242CF-001/shard-1-001/cores}
   [junit4]   2> 703442 ERROR (TEST-PKIAuthenticationIntegrationTest.testPkiAuth-seed#[BBB0D8F724242CF]) [    ] o.a.s.s.StartupLoggingUtils Missing Java Option solr.log.dir. Logging may be missing or incomplete.
   [junit4]   2> 703442 INFO  (TEST-PKIAuthenticationIntegrationTest.testPkiAuth-seed#[BBB0D8F724242CF]) [    ] o.a.s.s.SolrDispatchFilter  ___      _       Welcome to Apache Solr? version 7.0.0
   [junit4]   2> 703442 INFO  (TEST-PKIAuthenticationIntegrationTest.testPkiAuth-seed#[BBB0D8F724242CF]) [    ] o.a.s.s.SolrDispatchFilter / __| ___| |_ _   Starting in cloud mode on port null
   [junit4]   2> 703442 INFO  (TEST-PKIAuthenticationIntegrationTest.testPkiAuth-seed#[BBB0D8F724242CF]) [    ] o.a.s.s.SolrDispatchFilter \__ \/ _ \ | '_|  Install dir: null
   [junit4]   2> 703442 INFO  (TEST-PKIAuthenticationIntegrationTest.testPkiAuth-seed#[BBB0D8F724242CF]) [    ] o.a.s.s.SolrDispatchFilter |___/\___/_|_|    Start time: 2016-12-16T15:17:03.426Z
   [junit4]   2> 703446 INFO  (TEST-PKIAuthenticationIntegrationTest.testPkiAuth-seed#[BBB0D8F724242CF]) [    ] o.a.s.s.SolrDispatchFilter Loading solr.xml from SolrHome (not found in ZooKeeper)
   [junit4]   2> 703446 INFO  (TEST-PKIAuthenticationIntegrationTest.testPkiAuth-seed#[BBB0D8F724242CF]) [    ] o.a.s.c.SolrXmlConfig Loading container configuration from /home/jenkins/workspace/Lucene-Solr-master-Linux/solr/build/solr-core/test/J1/temp/solr.security.PKIAuthenticationIntegrationTest_BBB0D8F724242CF-001/shard-1-001/solr.xml
   [junit4]   2> 703453 INFO  (TEST-PKIAuthenticationIntegrationTest.testPkiAuth-seed#[BBB0D8F724242CF]) [    ] o.a.s.c.ZkContainer Zookeeper client=127.0.0.1:35255/solr
   [junit4]   2> 703462 INFO  (TEST-PKIAuthenticationIntegrationTest.testPkiAuth-seed#[BBB0D8F724242CF]) [n:127.0.0.1:45588_zq%2Fh    ] o.a.s.c.c.ZkStateReader Updated live nodes from ZooKeeper... (0) -> (1)
   [junit4]   2> 703465 INFO  (TEST-PKIAuthenticationIntegrationTest.testPkiAuth-seed#[BBB0D8F724242CF]) [n:127.0.0.1:45588_zq%2Fh    ] o.a.s.c.ZkController Register node as live in ZooKeeper:/live_nodes/127.0.0.1:45588_zq%2Fh
   [junit4]   2> 703466 INFO  (zkCallback-842-thread-2-processing-n:127.0.0.1:43349_zq%2Fh) [n:127.0.0.1:43349_zq%2Fh    ] o.a.s.c.c.ZkStateReader Updated live nodes from ZooKeeper... (1) -> (2)
   [junit4]   2> 703467 INFO  (zkCallback-846-thread-1) [    ] o.a.s.c.c.ZkStateReader Updated live nodes from ZooKeeper... (1) -> (2)
   [junit4]   2> 703467 INFO  (zkCallback-852-thread-1-processing-n:127.0.0.1:45588_zq%2Fh) [n:127.0.0.1:45588_zq%2Fh    ] o.a.s.c.c.ZkStateReader Updated live nodes from ZooKeeper... (1) -> (2)
   [junit4]   2> 703644 INFO  (TEST-PKIAuthenticationIntegrationTest.testPkiAuth-seed#[BBB0D8F724242CF]) [n:127.0.0.1:45588_zq%2Fh    ] o.a.s.c.CorePropertiesLocator Found 1 core definitions underneath /home/jenkins/workspace/Lucene-Solr-master-Linux/solr/build/solr-core/test/J1/temp/solr.security.PKIAuthenticationIntegrationTest_BBB0D8F724242CF-001/shard-1-001/cores
   [junit4]   2> 703644 INFO  (TEST-PKIAuthenticationIntegrationTest.testPkiAuth-seed#[BBB0D8F724242CF]) [n:127.0.0.1:45588_zq%2Fh    ] o.a.s.c.CorePropertiesLocator Cores are: [collection1]
   [junit4]   2> 703646 INFO  (OverseerStateUpdate-97117891553918980-127.0.0.1:43349_zq%2Fh-n_0000000000) [n:127.0.0.1:43349_zq%2Fh    ] o.a.s.c.o.ReplicaMutator Assigning new node to shard shard=shard2
   [junit4]   2> 703749 INFO  (zkCallback-852-thread-1-processing-n:127.0.0.1:45588_zq%2Fh) [n:127.0.0.1:45588_zq%2Fh    ] o.a.s.c.c.ZkStateReader A cluster state change: [WatchedEvent state:SyncConnected type:NodeDataChanged path:/collections/collection1/state.json] for collection [collection1] has occurred - updating... (live nodes size: [2])
   [junit4]   2> 704663 INFO  (coreLoadExecutor-2530-thread-1-processing-n:127.0.0.1:45588_zq%2Fh) [n:127.0.0.1:45588_zq%2Fh c:collection1   x:collection1] o.a.s.c.SolrConfig Using Lucene MatchVersion: 7.0.0
   [junit4]   2> 704679 INFO  (coreLoadExecutor-2530-thread-1-processing-n:127.0.0.1:45588_zq%2Fh) [n:127.0.0.1:45588_zq%2Fh c:collection1   x:collection1] o.a.s.s.IndexSchema [collection1] Schema name=test
   [junit4]   2> 704787 WARN  (coreLoadExecutor-2530-thread-1-processing-n:127.0.0.1:45588_zq%2Fh) [n:127.0.0.1:45588_zq%2Fh c:collection1   x:collection1] o.a.s.s.IndexSchema [collection1] default search field in schema is text. WARNING: Deprecated, please use 'df' on request instead.
   [junit4]   2> 704791 INFO  (coreLoadExecutor-2530-thread-1-processing-n:127.0.0.1:45588_zq%2Fh) [n:127.0.0.1:45588_zq%2Fh c:collection1   x:collection1] o.a.s.s.IndexSchema Loaded schema test/1.0 with uniqueid field id
   [junit4]   2> 704803 INFO  (coreLoadExecutor-2530-thread-1-processing-n:127.0.0.1:45588_zq%2Fh) [n:127.0.0.1:45588_zq%2Fh c:collection1   x:collection1] o.a.s.c.CoreContainer Creating SolrCore 'collection1' using configuration from collection collection1
   [junit4]   2> 704804 INFO  (coreLoadExecutor-2530-thread-1-processing-n:127.0.0.1:45588_zq%2Fh) [n:127.0.0.1:45588_zq%2Fh c:collection1   x:collection1] o.a.s.c.SolrCore [[collection1] ] Opening new SolrCore at [/home/jenkins/workspace/Lucene-Solr-master-Linux/solr/build/solr-core/test/J1/temp/solr.security.PKIAuthenticationIntegrationTest_BBB0D8F724242CF-001/shard-1-001/cores/collection1], dataDir=[/home/jenkins/workspace/Lucene-Solr-master-Linux/solr/build/solr-core/test/J1/temp/solr.security.PKIAuthenticationIntegrationTest_BBB0D8F724242CF-001/shard-1-001/cores/collection1/data/]
   [junit4]   2> 704804 INFO  (coreLoadExecutor-2530-thread-1-processing-n:127.0.0.1:45588_zq%2Fh) [n:127.0.0.1:45588_zq%2Fh c:collection1   x:collection1] o.a.s.c.JmxMonitoredMap JMX monitoring is enabled. Adding Solr mbeans to JMX Server: com.sun.jmx.mbeanserver.JmxMBeanServer@173cd89
   [junit4]   2> 704805 INFO  (coreLoadExecutor-2530-thread-1-processing-n:127.0.0.1:45588_zq%2Fh) [n:127.0.0.1:45588_zq%2Fh c:collection1   x:collection1] o.a.s.u.RandomMergePolicy RandomMergePolicy wrapping class org.apache.lucene.index.LogDocMergePolicy: [LogDocMergePolicy: minMergeSize=1000, mergeFactor=46, maxMergeSize=9223372036854775807, maxMergeSizeForForcedMerge=9223372036854775807, calibrateSizeByDeletes=false, maxMergeDocs=2147483647, maxCFSSegmentSizeMB=8.796093022207999E12, noCFSRatio=0.0]
   [junit4]   2> 704809 WARN  (coreLoadExecutor-2530-thread-1-processing-n:127.0.0.1:45588_zq%2Fh) [n:127.0.0.1:45588_zq%2Fh c:collection1   x:collection1] o.a.s.c.RequestHandlers INVALID paramSet a in requestHandler {type = requestHandler,name = /dump,class = DumpRequestHandler,args = {defaults={a=A,b=B}}}
   [junit4]   2> 704835 INFO  (coreLoadExecutor-2530-thread-1-processing-n:127.0.0.1:45588_zq%2Fh) [n:127.0.0.1:45588_zq%2Fh c:collection1   x:collection1] o.a.s.u.UpdateHandler Using UpdateLog implementation: org.apache.solr.update.UpdateLog
   [junit4]   2> 704835 INFO  (coreLoadExecutor-2530-thread-1-processing-n:127.0.0.1:45588_zq%2Fh) [n:127.0.0.1:45588_zq%2Fh c:collection1   x:collection1] o.a.s.u.UpdateLog Initializing UpdateLog: dataDir= defaultSyncLevel=FLUSH numRecordsToKeep=100 maxNumLogsToKeep=10 numVersionBuckets=65536
   [junit4]   2> 704836 INFO  (coreLoadExecutor-2530-thread-1-processing-n:127.0.0.1:45588_zq%2Fh) [n:127.0.0.1:45588_zq%2Fh c:collection1   x:collection1] o.a.s.u.CommitTracker Hard AutoCommit: disabled
   [junit4]   2> 704836 INFO  (coreLoadExecutor-2530-thread-1-processing-n:127.0.0.1:45588_zq%2Fh) [n:127.0.0.1:45588_zq%2Fh c:collection1   x:collection1] o.a.s.u.CommitTracker Soft AutoCommit: disabled
   [junit4]   2> 704837 INFO  (coreLoadExecutor-2530-thread-1-processing-n:127.0.0.1:45588_zq%2Fh) [n:127.0.0.1:45588_zq%2Fh c:collection1   x:collection1] o.a.s.u.RandomMergePolicy RandomMergePolicy wrapping class org.apache.lucene.index.LogDocMergePolicy: [LogDocMergePolicy: minMergeSize=1000, mergeFactor=40, maxMergeSize=9223372036854775807, maxMergeSizeForForcedMerge=9223372036854775807, calibrateSizeByDeletes=false, maxMergeDocs=2147483647, maxCFSSegmentSizeMB=8.796093022207999E12, noCFSRatio=0.5119829699318189]
   [junit4]   2> 704837 INFO  (coreLoadExecutor-2530-thread-1-processing-n:127.0.0.1:45588_zq%2Fh) [n:127.0.0.1:45588_zq%2Fh c:collection1   x:collection1] o.a.s.s.SolrIndexSearcher Opening [Searcher@1ccaf4d[collection1] main]
   [junit4]   2> 704838 INFO  (coreLoadExecutor-2530-thread-1-processing-n:127.0.0.1:45588_zq%2Fh) [n:127.0.0.1:45588_zq%2Fh c:collection1   x:collection1] o.a.s.r.ManagedResourceStorage Configured ZooKeeperStorageIO with znodeBase: /configs/conf1
   [junit4]   2> 704838 INFO  (coreLoadExecutor-2530-thread-1-processing-n:127.0.0.1:45588_zq%2Fh) [n:127.0.0.1:45588_zq%2Fh c:collection1   x:collection1] o.a.s.r.ManagedResourceStorage Loaded null at path _rest_managed.json using ZooKeeperStorageIO:path=/configs/conf1
   [junit4]   2> 704838 INFO  (coreLoadExecutor-2530-thread-1-processing-n:127.0.0.1:45588_zq%2Fh) [n:127.0.0.1:45588_zq%2Fh c:collection1   x:collection1] o.a.s.h.ReplicationHandler Commits will be reserved for  10000
   [junit4]   2> 704840 INFO  (searcherExecutor-2531-thread-1-processing-n:127.0.0.1:45588_zq%2Fh x:collection1 c:collection1) [n:127.0.0.1:45588_zq%2Fh c:collection1   x:collection1] o.a.s.c.SolrCore [collection1] Registered new searcher Searcher@1ccaf4d[collection1] main{ExitableDirectoryReader(UninvertingDirectoryReader())}
   [junit4]   2> 704841 INFO  (coreLoadExecutor-2530-thread-1-processing-n:127.0.0.1:45588_zq%2Fh) [n:127.0.0.1:45588_zq%2Fh c:collection1   x:collection1] o.a.s.u.UpdateLog Could not find max version in index or recent updates, using new clock 1553886268437299200
   [junit4]   2> 704846 INFO  (coreZkRegister-2525-thread-1-processing-n:127.0.0.1:45588_zq%2Fh x:collection1 c:collection1) [n:127.0.0.1:45588_zq%2Fh c:collection1 s:shard2 r:core_node1 x:collection1] o.a.s.c.ShardLeaderElectionContext Enough replicas found to continue.
   [junit4]   2> 704846 INFO  (coreZkRegister-2525-thread-1-processing-n:127.0.0.1:45588_zq%2Fh x:collection1 c:collection1) [n:127.0.0.1:45588_zq%2Fh c:collection1 s:shard2 r:core_node1 x:collection1] o.a.s.c.ShardLeaderElectionContext I may be the new leader - try and sync
   [junit4]   2> 704847 INFO  (coreZkRegister-2525-thread-1-processing-n:127.0.0.1:45588_zq%2Fh x:collection1 c:collection1) [n:127.0.0.1:45588_zq%2Fh c:collection1 s:shard2 r:core_node1 x:collection1] o.a.s.c.SyncStrategy Sync replicas to http://127.0.0.1:45588/zq/h/collection1/
   [junit4]   2> 704847 INFO  (coreZkRegister-2525-thread-1-processing-n:127.0.0.1:45588_zq%2Fh x:collection1 c:collection1) [n:127.0.0.1:45588_zq%2Fh c:collection1 s:shard2 r:core_node1 x:collection1] o.a.s.c.SyncStrategy Sync Success - now sync replicas to me
   [junit4]   2> 704847 INFO  (coreZkRegister-2525-thread-1-processing-n:127.0.0.1:45588_zq%2Fh x:collection1 c:collection1) [n:127.0.0.1:45588_zq%2Fh c:collection1 s:shard2 r:core_node1 x:collection1] o.a.s.c.SyncStrategy http://127.0.0.1:45588/zq/h/collection1/ has no replicas
   [junit4]   2> 704850 INFO  (coreZkRegister-2525-thread-1-processing-n:127.0.0.1:45588_zq%2Fh x:collection1 c:collection1) [n:127.0.0.1:45588_zq%2Fh c:collection1 s:shard2 r:core_node1 x:collection1] o.a.s.c.ShardLeaderElectionContext I am the new leader: http://127.0.0.1:45588/zq/h/collection1/ shard2
   [junit4]   2> 704953 INFO  (zkCallback-852-thread-1-processing-n:127.0.0.1:45588_zq%2Fh) [n:127.0.0.1:45588_zq%2Fh    ] o.a.s.c.c.ZkStateReader A cluster state change: [WatchedEvent state:SyncConnected type:NodeDataChanged path:/collections/collection1/state.json] for collection [collection1] has occurred - updating... (live nodes size: [2])
   [junit4]   2> 705001 INFO  (coreZkRegister-2525-thread-1-processing-n:127.0.0.1:45588_zq%2Fh x:collection1 c:collection1) [n:127.0.0.1:45588_zq%2Fh c:collection1 s:shard2 r:core_node1 x:collection1] o.a.s.c.ZkController I am the leader, no recovery necessary
   [junit4]   2> 705105 INFO  (zkCallback-852-thread-1-processing-n:127.0.0.1:45588_zq%2Fh) [n:127.0.0.1:45588_zq%2Fh    ] o.a.s.c.c.ZkStateReader A cluster state change: [WatchedEvent state:SyncConnected type:NodeDataChanged path:/collections/collection1/state.json] for collection [collection1] has occurred - updating... (live nodes size: [2])
   [junit4]   2> 705268 INFO  (TEST-PKIAuthenticationIntegrationTest.testPkiAuth-seed#[BBB0D8F724242CF]) [    ] o.a.s.SolrTestCaseJ4 Writing core.properties file to /home/jenkins/workspace/Lucene-Solr-master-Linux/solr/build/solr-core/test/J1/temp/solr.security.PKIAuthenticationIntegrationTest_BBB0D8F724242CF-001/shard-2-001/cores/collection1
   [junit4]   2> 705269 INFO  (TEST-PKIAuthenticationIntegrationTest.testPkiAuth-seed#[BBB0D8F724242CF]) [    ] o.a.s.c.AbstractFullDistribZkTestBase create jetty 2 in directory /home/jenkins/workspace/Lucene-Solr-master-Linux/solr/build/solr-core/test/J1/temp/solr.security.PKIAuthenticationIntegrationTest_BBB0D8F724242CF-001/shard-2-001
   [junit4]   2> 705270 INFO  (TEST-PKIAuthenticationIntegrationTest.testPkiAuth-seed#[BBB0D8F724242CF]) [    ] o.e.j.s.Server jetty-9.3.14.v20161028
   [junit4]   2> 705271 INFO  (TEST-PKIAuthenticationIntegrationTest.testPkiAuth-seed#[BBB0D8F724242CF]) [    ] o.e.j.s.h.ContextHandler Started o.e.j.s.ServletContextHandler@37ee2d{/zq/h,null,AVAILABLE}
   [junit4]   2> 705272 INFO  (TEST-PKIAuthenticationIntegrationTest.testPkiAuth-seed#[BBB0D8F724242CF]) [    ] o.e.j.s.AbstractConnector Started ServerConnector@1256d6{HTTP/1.1,[http/1.1]}{127.0.0.1:43703}
   [junit4]   2> 705272 INFO  (TEST-PKIAuthenticationIntegrationTest.testPkiAuth-seed#[BBB0D8F724242CF]) [    ] o.e.j.s.Server Started @706482ms
   [junit4]   2> 705272 INFO  (TEST-PKIAuthenticationIntegrationTest.testPkiAuth-seed#[BBB0D8F724242CF]) [    ] o.a.s.c.s.e.JettySolrRunner Jetty properties: {solr.data.dir=/home/jenkins/workspace/Lucene-Solr-master-Linux/solr/build/solr-core/test/J1/temp/solr.security.PKIAuthenticationIntegrationTest_BBB0D8F724242CF-001/tempDir-001/jetty2, solrconfig=solrconfig.xml, hostContext=/zq/h, hostPort=43703, coreRootDirectory=/home/jenkins/workspace/Lucene-Solr-master-Linux/solr/build/solr-core/test/J1/temp/solr.security.PKIAuthenticationIntegrationTest_BBB0D8F724242CF-001/shard-2-001/cores}
   [junit4]   2> 705272 ERROR (TEST-PKIAuthenticationIntegrationTest.testPkiAuth-seed#[BBB0D8F724242CF]) [    ] o.a.s.s.StartupLoggingUtils Missing Java Option solr.log.dir. Logging may be missing or incomplete.
   [junit4]   2> 705273 INFO  (TEST-PKIAuthenticationIntegrationTest.testPkiAuth-seed#[BBB0D8F724242CF]) [    ] o.a.s.s.SolrDispatchFilter  ___      _       Welcome to Apache Solr? version 7.0.0
   [junit4]   2> 705273 INFO  (TEST-PKIAuthenticationIntegrationTest.testPkiAuth-seed#[BBB0D8F724242CF]) [    ] o.a.s.s.SolrDispatchFilter / __| ___| |_ _   Starting in cloud mode on port null
   [junit4]   2> 705273 INFO  (TEST-PKIAuthenticationIntegrationTest.testPkiAuth-seed#[BBB0D8F724242CF]) [    ] o.a.s.s.SolrDispatchFilter \__ \/ _ \ | '_|  Install dir: null
   [junit4]   2> 705273 INFO  (TEST-PKIAuthenticationIntegrationTest.testPkiAuth-seed#[BBB0D8F724242CF]) [    ] o.a.s.s.SolrDispatchFilter |___/\___/_|_|    Start time: 2016-12-16T15:17:05.257Z
   [junit4]   2> 705276 INFO  (TEST-PKIAuthenticationIntegrationTest.testPkiAuth-seed#[BBB0D8F724242CF]) [    ] o.a.s.s.SolrDispatchFilter Loading solr.xml from SolrHome (not found in ZooKeeper)
   [junit4]   2> 705276 INFO  (TEST-PKIAuthenticationIntegrationTest.testPkiAuth-seed#[BBB0D8F724242CF]) [    ] o.a.s.c.SolrXmlConfig Loading container configuration from /home/jenkins/workspace/Lucene-Solr-master-Linux/solr/build/solr-core/test/J1/temp/solr.security.PKIAuthenticationIntegrationTest_BBB0D8F724242CF-001/shard-2-001/solr.xml
   [junit4]   2> 705287 INFO  (TEST-PKIAuthenticationIntegrationTest.testPkiAuth-seed#[BBB0D8F724242CF]) [    ] o.a.s.c.ZkContainer Zookeeper client=127.0.0.1:35255/solr
   [junit4]   2> 705296 INFO  (TEST-PKIAuthenticationIntegrationTest.testPkiAuth-seed#[BBB0D8F724242CF]) [n:127.0.0.1:43703_zq%2Fh    ] o.a.s.c.c.ZkStateReader Updated live nodes from ZooKeeper... (0) -> (2)
   [junit4]   2> 705300 INFO  (TEST-PKIAuthenticationIntegrationTest.testPkiAuth-seed#[BBB0D8F724242CF]) [n:127.0.0.1:43703_zq%2Fh    ] o.a.s.c.ZkController Register node as live in ZooKeeper:/live_nodes/127.0.0.1:43703_zq%2Fh
   [junit4]   2> 705301 INFO  (zkCallback-842-thread-2-processing-n:127.0.0.1:43349_zq%2Fh) [n:127.0.0.1:43349_zq%2Fh    ] o.a.s.c.c.ZkStateReader Updated live nodes from ZooKeeper... (2) -> (3)
   [junit4]   2> 705302 INFO  (zkCallback-858-thread-1-processing-n:127.0.0.1:43703_zq%2Fh) [n:127.0.0.1:43703_zq%2Fh    ] o.a.s.c.c.ZkStateReader Updated live nodes from ZooKeeper... (2) -> (3)
   [junit4]   2> 705301 INFO  (zkCallback-846-thread-1) [    ] o.a.s.c.c.ZkStateReader Updated live nodes from ZooKeeper... (2) -> (3)
   [junit4]   2> 705301 INFO  (zkCallback-852-thread-1-processing-n:127.0.0.1:45588_zq%2Fh) [n:127.0.0.1:45588_zq%2Fh    ] o.a.s.c.c.ZkStateReader Updated live nodes from ZooKeeper... (2) -> (3)
   [junit4]   2> 705406 INFO  (zkCallback-852-thread-1-processing-n:127.0.0.1:45588_zq%2Fh) [n:127.0.0.1:45588_zq%2Fh    ] o.a.s.c.c.ZkStateReader A cluster state change: [WatchedEvent state:SyncConnected type:NodeDataChanged path:/collections/collection1/state.json] for collection [collection1] has occurred - updating... (live nodes size: [3])
   [junit4]   2> 705510 INFO  (TEST-PKIAuthenticationIntegrationTest.testPkiAuth-seed#[BBB0D8F724242CF]) [n:127.0.0.1:43703_zq%2Fh    ] o.a.s.c.CorePropertiesLocator Found 1 core definitions underneath /home/jenkins/workspace/Lucene-Solr-master-Linux/solr/build/solr-core/test/J1/temp/solr.security.PKIAuthenticationIntegrationTest_BBB0D8F724242CF-001/shard-2-001/cores
   [junit4]   2> 705510 INFO  (TEST-PKIAuthenticationIntegrationTest.testPkiAuth-seed#[BBB0D8F724242CF]) [n:127.0.0.1:43703_zq%2Fh    ] o.a.s.c.CorePropertiesLocator Cores are: [collection1]
   [junit4]   2> 705516 INFO  (OverseerStateUpdate-97117891553918980-127.0.0.1:43349_zq%2Fh-n_0000000000) [n:127.0.0.1:43349_zq%2Fh    ] o.a.s.c.o.ReplicaMutator Assigning new node to shard shard=shard1
   [junit4]   2> 705619 INFO  (zkCallback-852-thread-1-processing-n:127.0.0.1:45588_zq%2Fh) [n:127.0.0.1:45588_zq%2Fh    ] o.a.s.c.c.ZkStateReader A cluster state change: [WatchedEvent state:SyncConnected type:NodeDataChanged path:/collections/collection1/state.json] for collection [collection1] has occurred - updating... (live nodes size: [3])
   [junit4]   2> 705619 INFO  (zkCallback-858-thread-1-processing-n:127.0.0.1:43703_zq%2Fh) [n:127.0.0.1:43703_zq%2Fh    ] o.a.s.c.c.ZkStateReader A cluster state change: [WatchedEvent state:SyncConnected type:NodeDataChanged path:/collections/collection1/state.json] for collection [collection1] has occurred - updating... (live nodes size: [3])
   [junit4]   2> 706528 INFO  (coreLoadExecutor-2541-thread-1-processing-n:127.0.0.1:43703_zq%2Fh) [n:127.0.0.1:43703_zq%2Fh c:collection1   x:collection1] o.a.s.c.SolrConfig Using Lucene MatchVersion: 7.0.0
   [junit4]   2> 706569 INFO  (coreLoadExecutor-2541-thread-1-processing-n:127.0.0.1:43703_zq%2Fh) [n:127.0.0.1:43703_zq%2Fh c:collection1   x:collection1] o.a.s.s.IndexSchema [collection1] Schema name=test
   [junit4]   2> 706692 WARN  (coreLoadExecutor-2541-thread-1-processing-n:127.0.0.1:43703_zq%2Fh) [n:127.0.0.1:43703_zq%2Fh c:collection1   x:collection1] o.a.s.s.IndexSchema [collection1] default search field in schema is text. WARNING: Deprecated, please use 'df' on request instead.
   [junit4]   2> 706695 INFO  (coreLoadExecutor-2541-thread-1-processing-n:127.0.0.1:43703_zq%2Fh) [n:127.0.0.1:43703_zq%2Fh c:collection1   x:collection1] o.a.s.s.IndexSchema Loaded schema test/1.0 with uniqueid field id
   [junit4]   2> 706709 INFO  (coreLoadExecutor-2541-thread-1-processing-n:127.0.0.1:43703_zq%2Fh) [n:127.0.0.1:43703_zq%2Fh c:collection1   x:collection1] o.a.s.c.CoreContainer Creating SolrCore 'collection1' using configuration from collection collection1
   [junit4]   2> 706709 INFO  (coreLoadExecutor-2541-thread-1-processing-n:127.0.0.1:43703_zq%2Fh) [n:127.0.0.1:43703_zq%2Fh c:collection1   x:collection1] o.a.s.c.SolrCore [[collection1] ] Opening new SolrCore at [/home/jenkins/workspace/Lucene-Solr-master-Linux/solr/build/solr-core/test/J1/temp/solr.security.PKIAuthenticationIntegrationTest_BBB0D8F724242CF-001/shard-2-001/cores/collection1], dataDir=[/home/jenkins/workspace/Lucene-Solr-master-Linux/solr/build/solr-core/test/J1/temp/solr.security.PKIAuthenticationIntegrationTest_BBB0D8F724242CF-001/shard-2-001/cores/collection1/data/]
   [junit4]   2> 706709 INFO  (coreLoadExecutor-2541-thread-1-processing-n:127.0.0.1:43703_zq%2Fh) [n:127.0.0.1:43703_zq%2Fh c:collection1   x:collection1] o.a.s.c.JmxMonitoredMap JMX monitoring is enabled. Adding Solr mbeans to JMX Server: com.sun.jmx.mbeanserver.JmxMBeanServer@173cd89
   [junit4]   2> 706710 INFO  (coreLoadExecutor-2541-thread-1-processing-n:127.0.0.1:43703_zq%2Fh) [n:127.0.0.1:43703_zq%2Fh c:collection1   x:collection1] o.a.s.u.RandomMergePolicy RandomMergePolicy wrapping class org.apache.lucene.index.LogDocMergePolicy: [LogDocMergePolicy: minMergeSize=1000, mergeFactor=46, maxMergeSize=9223372036854775807, maxMergeSizeForForcedMerge=9223372036854775807, calibrateSizeByDeletes=false, maxMergeDocs=2147483647, maxCFSSegmentSizeMB=8.796093022207999E12, noCFSRatio=0.0]
   [junit4]   2> 706715 WARN  (coreLoadExecutor-2541-thread-1-processing-n:127.0.0.1:43703_zq%2Fh) [n:127.0.0.1:43703_zq%2Fh c:collection1   x:collection1] o.a.s.c.RequestHandlers INVALID paramSet a in requestHandler {type = requestHandler,name = /dump,class = DumpRequestHandler,args = {defaults={a=A,b=B}}}
   [junit4]   2> 706729 INFO  (coreLoadExecutor-2541-thread-1-processing-n:127.0.0.1:43703_zq%2Fh) [n:127.0.0.1:43703_zq%2Fh c:collection1   x:collection1] o.a.s.u.UpdateHandler Using UpdateLog implementation: org.apache.solr.update.UpdateLog
   [junit4]   2> 706729 INFO  (coreLoadExecutor-2541-thread-1-processing-n:127.0.0.1:43703_zq%2Fh) [n:127.0.0.1:43703_zq%2Fh c:collection1   x:collection1] o.a.s.u.UpdateLog Initializing UpdateLog: dataDir= defaultSyncLevel=FLUSH numRecordsToKeep=100 maxNumLogsToKeep=10 numVersionBuckets=65536
   [junit4]   2> 706729 INFO  (coreLoadExecutor-2541-thread-1-processing-n:127.0.0.1:43703_zq%2Fh) [n:127.0.0.1:43703_zq%2Fh c:collection1   x:collection1] o.a.s.u.CommitTracker Hard AutoCommit: disabled
   [junit4]   2> 706729 INFO  (coreLoadExecutor-2541-thread-1-processing-n:127.0.0.1:43703_zq%2Fh) [n:127.0.0.1:43703_zq%2Fh c:collection1   x:collection1] o.a.s.u.CommitTracker Soft AutoCommit: disabled
   [junit4]   2> 706730 INFO  (coreLoadExecutor-2541-thread-1-processing-n:127.0.0.1:43703_zq%2Fh) [n:127.0.0.1:43703_zq%2Fh c:collection1   x:collection1] o.a.s.u.RandomMergePolicy RandomMergePolicy wrapping class org.apache.lucene.index.LogDocMergePolicy: [LogDocMergePolicy: minMergeSize=1000, mergeFactor=40, maxMergeSize=9223372036854775807, maxMergeSizeForForcedMerge=9223372036854775807, calibrateSizeByDeletes=false, maxMergeDocs=2147483647, maxCFSSegmentSizeMB=8.796093022207999E12, noCFSRatio=0.5119829699318189]
   [junit4]   2> 706731 INFO  (coreLoadExecutor-2541-thread-1-processing-n:127.0.0.1:43703_zq%2Fh) [n:127.0.0.1:43703_zq%2Fh c:collection1   x:collection1] o.a.s.s.SolrIndexSearcher Opening [Searcher@f96afa[collection1] main]
   [junit4]   2> 706733 INFO  (coreLoadExecutor-2541-thread-1-processing-n:127.0.0.1:43703_zq%2Fh) [n:127.0.0.1:43703_zq%2Fh c:collection1   x:collection1] o.a.s.r.ManagedResourceStorage Configured ZooKeeperStorageIO with znodeBase: /configs/conf1
   [junit4]   2> 706733 INFO  (coreLoadExecutor-2541-thread-1-processing-n:127.0.0.1:43703_zq%2Fh) [n:127.0.0.1:43703_zq%2Fh c:collection1   x:collection1] o.a.s.r.ManagedResourceStorage Loaded null at path _rest_managed.json using ZooKeeperStorageIO:path=/configs/conf1
   [junit4]   2> 706733 INFO  (coreLoadExecutor-2541-thread-1-processing-n:127.0.0.1:43703_zq%2Fh) [n:127.0.0.1:43703_zq%2Fh c:collection1   x:collection1] o.a.s.h.ReplicationHandler Commits will be reserved for  10000
   [junit4]   2> 706736 INFO  (searcherExecutor-2542-thread-1-processing-n:127.0.0.1:43703_zq%2Fh x:collection1 c:collection1) [n:127.0.0.1:43703_zq%2Fh c:collection1   x:collection1] o.a.s.c.SolrCore [collection1] Registered new searcher Searcher@f96afa[collection1] main{ExitableDirectoryReader(UninvertingDirectoryReader())}
   [junit4]   2> 706736 INFO  (coreLoadExecutor-2541-thread-1-processing-n:127.0.0.1:43703_zq%2Fh) [n:127.0.0.1:43703_zq%2Fh c:collection1   x:collection1] o.a.s.u.UpdateLog Could not find max version in index or recent updates, using new clock 1553886270424350720
   [junit4]   2> 706742 INFO  (coreZkRegister-2536-thread-1-processing-n:127.0.0.1:43703_zq%2Fh x:collection1 c:collection1) [n:127.0.0.1:43703_zq%2Fh c:collection1 s:shard1 r:core_node2 x:collection1] o.a.s.c.ShardLeaderElectionContext Enough replicas found to continue.
   [junit4]   2> 706742 INFO  (coreZkRegister-2536-thread-1-processing-n:127.0.0.1:43703_zq%2Fh x:collection1 c:collection1) [n:127.0.0.1:43703_zq%2Fh c:collection1 s:shard1 r:core_node2 x:collection1] o.a.s.c.ShardLeaderElectionContext I may be the new leader - try and sync
   [junit4]   2> 706742 INFO  (coreZkRegister-2536-thread-1-processing-n:127.0.0.1:43703_zq%2Fh x:collection1 c:collection1) [n:127.0.0.1:43703_zq%2Fh c:collection1 s:shard1 r:core_node2 x:collection1] o.a.s.c.SyncStrategy Sync replicas to http://127.0.0.1:43703/zq/h/collection1/
   [junit4]   2> 706742 INFO  (coreZkRegister-2536-thread-1-processing-n:127.0.0.1:43703_zq%2Fh x:collection1 c:collection1) [n:127.0.0.1:43703_zq%2Fh c:collection1 s:shard1 r:core_node2 x:collection1] o.a.s.c.SyncStrategy Sync Success - now sync replicas to me
   [junit4]   2> 706742 INFO  (coreZkRegister-2536-thread-1-processing-n:127.0.0.1:43703_zq%2Fh x:collection1 c:collection1) [n:127.0.0.1:43703_zq%2Fh c:collection1 s:shard1 r:core_node2 x:collection1] o.a.s.c.SyncStrategy http://127.0.0.1:43703/zq/h/collection1/ has no replicas
   [junit4]   2> 706745 INFO  (coreZkRegister-2536-thread-1-processing-n:127.0.0.1:43703_zq%2Fh x:collection1 c:collection1) [n:127.0.0.1:43703_zq%2Fh c:collection1 s:shard1 r:core_node2 x:collection1] o.a.s.c.ShardLeaderElectionContext I am the new leader: http://127.0.0.1:43703/zq/h/collection1/ shard1
   [junit4]   2> 706848 INFO  (zkCallback-858-thread-1-processing-n:127.0.0.1:43703_zq%2Fh) [n:127.0.0.1:43703_zq%2Fh    ] o.a.s.c.c.ZkStateReader A cluster state change: [WatchedEvent state:SyncConnected type:NodeDataChanged path:/collections/collection1/state.json] for collection [collection1] has occurred - updating... (live nodes size: [3])
   [junit4]   2> 706848 INFO  (zkCallback-852-thread-1-processing-n:127.0.0.1:45588_zq%2Fh) [n:127.0.0.1:45588_zq%2Fh    ] o.a.s.c.c.ZkStateReader A cluster state change: [WatchedEvent state:SyncConnected type:NodeDataChanged path:/collections/collection1/state.json] for collection [collection1] has occurred - updating... (live nodes size: [3])
   [junit4]   2> 706896 INFO  (coreZkRegister-2536-thread-1-processing-n:127.0.0.1:43703_zq%2Fh x:collection1 c:collection1) [n:127.0.0.1:43703_zq%2Fh c:collection1 s:shard1 r:core_node2 x:collection1] o.a.s.c.ZkController I am the leader, no recovery necessary
   [junit4]   2> 707000 INFO  (zkCallback-852-thread-1-processing-n:127.0.0.1:45588_zq%2Fh) [n:127.0.0.1:45588_zq%2Fh    ] o.a.s.c.c.ZkStateReader A cluster state change: [WatchedEvent state:SyncConnected type:NodeDataChanged path:/collections/collection1/state.json] for collection [collection1] has occurred - updating... (live nodes size: [3])
   [junit4]   2> 707000 INFO  (zkCallback-858-thread-1-processing-n:127.0.0.1:43703_zq%2Fh) [n:127.0.0.1:43703_zq%2Fh    ] o.a.s.c.c.ZkStateReader A cluster state change: [WatchedEvent state:SyncConnected type:NodeDataChanged path:/collections/collection1/state.json] for collection [collection1] has occurred - updating... (live nodes size: [3])
   [junit4]   2> 707192 INFO  (TEST-PKIAuthenticationIntegrationTest.testPkiAuth-seed#[BBB0D8F724242CF]) [    ] o.a.s.SolrTestCaseJ4 Writing core.properties file to /home/jenkins/workspace/Lucene-Solr-master-Linux/solr/build/solr-core/test/J1/temp/solr.security.PKIAuthenticationIntegrationTest_BBB0D8F724242CF-001/shard-3-001/cores/collection1
   [junit4]   2> 707192 INFO  (TEST-PKIAuthenticationIntegrationTest.testPkiAuth-seed#[BBB0D8F724242CF]) [    ] o.a.s.c.AbstractFullDistribZkTestBase create jetty 3 in directory /home/jenkins/workspace/Lucene-Solr-master-Linux/solr/build/solr-core/test/J1/temp/solr.security.PKIAuthenticationIntegrationTest_BBB0D8F724242CF-001/shard-3-001
   [junit4]   2> 707193 INFO  (TEST-PKIAuthenticationIntegrationTest.testPkiAuth-seed#[BBB0D8F724242CF]) [    ] o.e.j.s.Server jetty-9.3.14.v20161028
   [junit4]   2> 707194 INFO  (TEST-PKIAuthenticationIntegrationTest.testPkiAuth-seed#[BBB0D8F724242CF]) [    ] o.e.j.s.h.ContextHandler Started o.e.j.s.ServletContextHandler@1aca57{/zq/h,null,AVAILABLE}
   [junit4]   2> 707195 INFO  (TEST-PKIAuthenticationIntegrationTest.testPkiAuth-seed#[BBB0D8F724242CF]) [    ] o.e.j.s.AbstractConnector Started ServerConnector@1354ac8{HTTP/1.1,[http/1.1]}{127.0.0.1:41569}
   [junit4]   2> 707195 INFO  (TEST-PKIAuthenticationIntegrationTest.testPkiAuth-seed#[BBB0D8F724242CF]) [    ] o.e.j.s.Server Started @708405ms
   [junit4]   2> 707195 INFO  (TEST-PKIAuthenticationIntegrationTest.testPkiAuth-seed#[BBB0D8F724242CF]) [    ] o.a.s.c.s.e.JettySolrRunner Jetty properties: {solr.data.dir=/home/jenkins/workspace/Lucene-Solr-master-Linux/solr/build/solr-core/test/J1/temp/solr.security.PKIAuthenticationIntegrationTest_BBB0D8F724242CF-001/tempDir-001/jetty3, solrconfig=solrconfig.xml, hostContext=/zq/h, hostPort=41569, coreRootDirectory=/home/jenkins/workspace/Lucene-Solr-master-Linux/solr/build/solr-core/test/J1/../../../../../../../../../home/jenkins/workspace/Lucene-Solr-master-Linux/solr/build/solr-core/test/J1/temp/solr.security.PKIAuthenticationIntegrationTest_BBB0D8F724242CF-001/shard-3-001/cores}
   [junit4]   2> 707195 ERROR (TEST-PKIAuthenticationIntegrationTest.testPkiAuth-seed#[BBB0D8F724242CF]) [    ] o.a.s.s.StartupLoggingUtils Missing Java Option solr.log.dir. Logging may be missing or incomplete.
   [junit4]   2> 707196 INFO  (TEST-PKIAuthenticationIntegrationTest.testPkiAuth-seed#[BBB0D8F724242CF]) [    ] o.a.s.s.SolrDispatchFilter  ___      _       Welcome to Apache Solr? version 7.0.0
   [junit4]   2> 707196 INFO  (TEST-PKIAuthenticationIntegrationTest.testPkiAuth-seed#[BBB0D8F724242CF]) [    ] o.a.s.s.SolrDispatchFilter / __| ___| |_ _   Starting in cloud mode on port null
   [junit4]   2> 707196 INFO  (TEST-PKIAuthenticationIntegrationTest.testPkiAuth-seed#[BBB0D8F724242CF]) [    ] o.a.s.s.SolrDispatchFilter \__ \/ _ \ | '_|  Install dir: null
   [junit4]   2> 707196 INFO  (TEST-PKIAuthenticationIntegrationTest.testPkiAuth-seed#[BBB0D8F724242CF]) [    ] o.a.s.s.SolrDispatchFilter |___/\___/_|_|    Start time: 2016-12-16T15:17:07.180Z
   [junit4]   2> 707199 INFO  (TEST-PKIAuthenticationIntegrationTest.testPkiAuth-seed#[BBB0D8F724242CF]) [    ] o.a.s.s.SolrDispatchFilter Loading solr.xml from SolrHome (not found in ZooKeeper)
   [junit4]   2> 707199 INFO  (TEST-PKIAuthenticationIntegrationTest.testPkiAuth-seed#[BBB0D8F724242CF]) [    ] o.a.s.c.SolrXmlConfig Loading container configuration from /home/jenkins/workspace/Lucene-Solr-master-Linux/solr/build/solr-core/test/J1/temp/solr.security.PKIAuthenticationIntegrationTest_BBB0D8F724242CF-001/shard-3-001/solr.xml
   [junit4]   2> 707206 INFO  (TEST-PKIAuthenticationIntegrationTest.testPkiAuth-seed#[BBB0D8F724242CF]) [    ] o.a.s.c.ZkContainer Zookeeper client=127.0.0.1:35255/solr
   [junit4]   2> 707216 INFO  (TEST-PKIAuthenticationIntegrationTest.testPkiAuth-seed#[BBB0D8F724242CF]) [n:127.0.0.1:41569_zq%2Fh    ] o.a.s.c.c.ZkStateReader Updated live nodes from ZooKeeper... (0) -> (3)
   [junit4]   2> 707219 INFO  (TEST-PKIAuthenticationIntegrationTest.testPkiAuth-seed#[BBB0D8F724242CF]) [n:127.0.0.1:41569_zq%2Fh    ] o.a.s.c.ZkController Register node as live in ZooKeeper:/live_nodes/127.0.0.1:41569_zq%2Fh
   [junit4]   2> 707221 INFO  (zkCallback-864-thread-1-processing-n:127.0.0.1:41569_zq%2Fh) [n:127.0.0.1:41569_zq%2Fh    ] o.a.s.c.c.ZkStateReader Updated live nodes from ZooKeeper... (3) -> (4)
   [junit4]   2> 707221 INFO  (zkCallback-858-thread-1-processing-n:127.0.0.1:43703_zq%2Fh) [n:127.0.0.1:43703_zq%2Fh    ] o.a.s.c.c.ZkStateReader Updated live nodes from ZooKeeper... (3) -> (4)
   [junit4]   2> 707221 INFO  (zkCallback-842-thread-3-processing-n:127.0.0.1:43349_zq%2Fh) [n:127.0.0.1:43349_zq%2Fh    ] o.a.s.c.c.ZkStateReader Updated live nodes from ZooKeeper... (3) -> (4)
   [junit4]   2> 707221 INFO  (zkCallback-852-thread-1-processing-n:127.0.0.1:45588_zq%2Fh) [n:127.0.0.1:45588_zq%2Fh    ] o.a.s.c.c.ZkStateReader Updated live nodes from ZooKeeper... (3) -> (4)
   [junit4]   2> 707225 INFO  (zkCallback-846-thread-1) [    ] o.a.s.c.c.ZkStateReader Updated live nodes from ZooKeeper... (3) -> (4)
   [junit4]   2> 707333 INFO  (zkCallback-852-thread-1-processing-n:127.0.0.1:45588_zq%2Fh) [n:127.0.0.1:45588_zq%2Fh    ] o.a.s.c.c.ZkStateReader A cluster state change: [WatchedEvent state:SyncConnected type:NodeDataChanged path:/collections/collection1/state.json] for collection [collection1] has occurred - updating... (live nodes size: [4])
   [junit4]   2> 707333 INFO  (zkCallback-858-thread-1-processing-n:127.0.0.1:43703_zq%2Fh) [n:127.0.0.1:43703_zq%2Fh    ] o.a.s.c.c.ZkStateReader A cluster state change: [WatchedEvent state:SyncConnected type:NodeDataChanged path:/collections/collection1/state.json] for collection [collection1] has occurred - updating... (live nodes size: [4])
   [junit4]   2> 707580 INFO  (TEST-PKIAuthenticationIntegrationTest.testPkiAuth-seed#[BBB0D8F724242CF]) [n:127.0.0.1:41569_zq%2Fh    ] o.a.s.c.CorePropertiesLocator Found 1 core definitions underneath /home/jenkins/workspace/Lucene-Solr-master-Linux/solr/build/solr-core/test/J1/../../../../../../../../../home/jenkins/workspace/Lucene-Solr-master-Linux/solr/build/solr-core/test/J1/temp/solr.security.PKIAuthenticationIntegrationTest_BBB0D8F724242CF-001/shard-3-001/cores
   [junit4]   2> 707580 INFO  (TEST-PKIAuthenticationIntegrationTest.testPkiAuth-seed#[BBB0D8F724242CF]) [n:127.0.0.1:41569_zq%2Fh    ] o.a.s.c.CorePropertiesLocator Cores are: [collection1]
   [junit4]   2> 707596 INFO  (OverseerStateUpdate-97117891553918980-127.0.0.1:43349_zq%2Fh-n_0000000000) [n:127.0.0.1:43349_zq%2Fh    ] o.a.s.c.o.ReplicaMutator Assigning new node to shard shard=shard2
   [junit4]   2> 707699 INFO  (zkCallback-864-thread-1-processing-n:127.0.0.1:41569_zq%2Fh) [n:127.0.0.1:41569_zq%2Fh    ] o.a.s.c.c.ZkStateReader A cluster state change: [WatchedEvent state:SyncConnected type:NodeDataChanged path:/collections/collection1/state.json] for collection [collection1] has occurred - updating... (live nodes size: [4])
   [junit4]   2> 707699 INFO  (zkCallback-858-thread-1-processing-n:127.0.0.1:43703_zq%2Fh) [n:127.0.0.1:43703_zq%2Fh    ] o.a.s.c.c.ZkStateReader A cluster state change: [WatchedEvent state:SyncConnected type:NodeDataChanged path:/collections/collection1/state.json] for collection [collection1] has occurred - updating... (live nodes size: [4])
   [junit4]   2> 707699 INFO  (zkCallback-852-thread-1-processing-n:127.0.0.1:45588_zq%2Fh) [n:127.0.0.1:45588_zq%2Fh    ] o.a.s.c.c.ZkStateReader A cluster state change: [WatchedEvent state:SyncConnected type:NodeDataChanged path:/collections/collection1/state.json] for collection [collection1] has occurred - updating... (live nodes size: [4])
   [junit4]   2> 708607 INFO  (coreLoadExecutor-2552-thread-1-processing-n:127.0.0.1:41569_zq%2Fh) [n:127.0.0.1:41569_zq%2Fh c:collection1   x:collection1] o.a.s.c.SolrConfig Using Lucene MatchVersion: 7.0.0
   [junit4]   2> 708622 INFO  (coreLoadExecutor-2552-thread-1-processing-n:127.0.0.1:41569_zq%2Fh) [n:127.0.0.1:41569_zq%2Fh c:collection1   x:collection1] o.a.s.s.IndexSchema [collection1] Schema name=test
   [junit4]   2> 708718 WARN  (coreLoadExecutor-2552-thread-1-processing-n:127.0.0.1:41569_zq%2Fh) [n:127.0.0.1:41569_zq%2Fh c:collection1   x:collection1] o.a.s.s.IndexSchema [collection1] default search field in schema is text. WARNING: Deprecated, please use 'df' on request instead.
   [junit4]   2> 708721 INFO  (coreLoadExecutor-2552-thread-1-processing-n:127.0.0.1:41569_zq%2Fh) [n:127.0.0.1:41569_zq%2Fh c:collection1   x:collection1] o.a.s.s.IndexSchema Loaded schema test/1.0 with uniqueid field id
   [junit4]   2> 708731 INFO  (coreLoadExecutor-2552-thread-1-processing-n:127.0.0.1:41569_zq%2Fh) [n:127.0.0.1:41569_zq%2Fh c:collection1   x:collection1] o.a.s.c.CoreContainer Creating SolrCore 'collection1' using configuration from collection collection1
   [junit4]   2> 708731 INFO  (coreLoadExecutor-2552-thread-1-processing-n:127.0.0.1:41569_zq%2Fh) [n:127.0.0.1:41569_zq%2Fh c:collection1   x:collection1] o.a.s.c.SolrCore [[collection1] ] Opening new SolrCore at [/home/jenkins/workspace/Lucene-Solr-master-Linux/solr/build/solr-core/test/J1/temp/solr.security.PKIAuthenticationIntegrationTest_BBB0D8F724242CF-001/shard-3-001/cores/collection1], dataDir=[/home/jenkins/workspace/Lucene-Solr-master-Linux/solr/build/solr-core/test/J1/../../../../../../../../../home/jenkins/workspace/Lucene-Solr-master-Linux/solr/build/solr-core/test/J1/temp/solr.security.PKIAuthenticationIntegrationTest_BBB0D8F724242CF-001/shard-3-001/cores/collection1/data/]
   [junit4]   2> 708732 INFO  (coreLoadExecutor-2552-thread-1-processing-n:127.0.0.1:41569_zq%2Fh) [n:127.0.0.1:41569_zq%2Fh c:collection1   x:collection1] o.a.s.c.JmxMonitoredMap JMX monitoring is enabled. Adding Solr mbeans to JMX Server: com.sun.jmx.mbeanserver.JmxMBeanServer@173cd89
   [junit4]   2> 708733 INFO  (coreLoadExecutor-2552-thread-1-processing-n:127.0.0.1:41569_zq%2Fh) [n:127.0.0.1:41569_zq%2Fh c:collection1   x:collection1] o.a.s.u.RandomMergePolicy RandomMergePolicy wrapping class org.apache.lucene.index.LogDocMergePolicy: [LogDocMergePolicy: minMergeSize=1000, mergeFactor=46, maxMergeSize=9223372036854775807, maxMergeSizeForForcedMerge=9223372036854775807, calibrateSizeByDeletes=false, maxMergeDocs=2147483647, maxCFSSegmentSizeMB=8.796093022207999E12, noCFSRatio=0.0]
   [junit4]   2> 708738 WARN  (coreLoadExecutor-2552-thread-1-processing-n:127.0.0.1:41569_zq%2Fh) [n:127.0.0.1:41569_zq%2Fh c:collection1   x:collection1] o.a.s.c.RequestHandlers INVALID paramSet a in requestHandler {type = requestHandler,name = /dump,class = DumpRequestHandler,args = {defaults={a=A,b=B}}}
   [junit4]   2> 708751 INFO  (coreLoadExecutor-2552-thread-1-processing-n:127.0.0.1:41569_zq%2Fh) [n:127.0.0.1:41569_zq%2Fh c:collection1   x:collection1] o.a.s.u.UpdateHandler Using UpdateLog implementation: org.apache.solr.update.UpdateLog
   [junit4]   2> 708751 INFO  (coreLoadExecutor-2552-thread-1-processing-n:127.0.0.1:41569_zq%2Fh) [n:127.0.0.1:41569_zq%2Fh c:collection1   x:collection1] o.a.s.u.UpdateLog Initializing UpdateLog: dataDir= defaultSyncLevel=FLUSH numRecordsToKeep=100 maxNumLogsToKeep=10 numVersionBuckets=65536
   [junit4]   2> 708752 INFO  (coreLoadExecutor-2552-thread-1-processing-n:127.0.0.1:41569_zq%2Fh) [n:127.0.0.1:41569_zq%2Fh c:collection1   x:collection1] o.a.s.u.CommitTracker Hard AutoCommit: disabled
   [junit4]   2> 708752 INFO  (coreLoadExecutor-2552-thread-1-processing-n:127.0.0.1:41569_zq%2Fh) [n:127.0.0.1:41569_zq%2Fh c:collection1   x:collection1] o.a.s.u.CommitTracker Soft AutoCommit: disabled
   [junit4]   2> 708753 INFO  (coreLoadExecutor-2552-thread-1-processing-n:127.0.0.1:41569_zq%2Fh) [n:127.0.0.1:41569_zq%2Fh c:collection1   x:collection1] o.a.s.u.RandomMergePolicy RandomMergePolicy wrapping class org.apache.lucene.index.LogDocMergePolicy: [LogDocMergePolicy: minMergeSize=1000, mergeFactor=40, maxMergeSize=9223372036854775807, maxMergeSizeForForcedMerge=9223372036854775807, calibrateSizeByDeletes=false, maxMergeDocs=2147483647, maxCFSSegmentSizeMB=8.796093022207999E12, noCFSRatio=0.5119829699318189]
   [junit4]   2> 708753 INFO  (coreLoadExecutor-2552-thread-1-processing-n:127.0.0.1:41569_zq%2Fh) [n:127.0.0.1:41569_zq%2Fh c:collection1   x:collection1] o.a.s.s.SolrIndexSearcher Opening [Searcher@198d131[collection1] main]
   [junit4]   2> 708754 INFO  (coreLoadExecutor-2552-thread-1-processing-n:127.0.0.1:41569_zq%2Fh) [n:127.0.0.1:41569_zq%2Fh c:collection1   x:collection1] o.a.s.r.ManagedResourceStorage Configured ZooKeeperStorageIO with znodeBase: /configs/conf1
   [junit4]   2> 708754 INFO  (coreLoadExecutor-2552-thread-1-processing-n:127.0.0.1:41569_zq%2Fh) [n:127.0.0.1:41569_zq%2Fh c:collection1   x:collection1] o.a.s.r.ManagedResourceStorage Loaded null at path _rest_managed.json using ZooKeeperStorageIO:path=/configs/conf1
   [junit4]   2> 708754 INFO  (coreLoadExecutor-2552-thread-1-processing-n:127.0.0.1:41569_zq%2Fh) [n:127.0.0.1:41569_zq%2Fh c:collection1   x:collection1] o.a.s.h.ReplicationHandler Commits will be reserved for  10000
   [junit4]   2> 708756 INFO  (searcherExecutor-2553-thread-1-processing-n:127.0.0.1:41569_zq%2Fh x:collection1 c:collection1) [n:127.0.0.1:41569_zq%2Fh c:collection1   x:collection1] o.a.s.c.SolrCore [collection1] Registered new searcher Searcher@198d131[collection1] main{ExitableDirectoryReader(UninvertingDirectoryReader())}
   [junit4]   2> 708756 INFO  (coreLoadExecutor-2552-thread-1-processing-n:127.0.0.1:41569_zq%2Fh) [n:127.0.0.1:41569_zq%2Fh c:collection1   x:collection1] o.a.s.u.UpdateLog Could not find max version in index or recent updates, using new clock 1553886272542474240
   [junit4]   2> 708760 INFO  (coreZkRegister-2547-thread-1-processing-n:127.0.0.1:41569_zq%2Fh x:collection1 c:collection1) [n:127.0.0.1:41569_zq%2Fh c:collection1 s:shard2 r:core_node3 x:collection1] o.a.s.c.ZkController Core needs to recover:collection1
   [junit4]   2> 708760 INFO  (updateExecutor-861-thread-1-processing-n:127.0.0.1:41569_zq%2Fh x:collection1 s:shard2 c:collection1 r:core_node3) [n:127.0.0.1:41569_zq%2Fh c:collection1 s:shard2 r:core_node3 x:collection1] o.a.s.u.DefaultSolrCoreState Running recovery
   [junit4]   2> 708761 INFO  (recoveryExecutor-862-thread-1-processing-n:127.0.0.1:41569_zq%2Fh x:collection1 s:shard2 c:collection1 r:core_node3) [n:127.0.0.1:41569_zq%2Fh c:collection1 s:shard2 r:core_node3 x:collection1] o.a.s.c.RecoveryStrategy Starting recovery process. recoveringAfterStartup=true
   [junit4]   2> 708761 INFO  (recoveryExecutor-862-thread-1-processing-n:127.0.0.1:41569_zq%2Fh x:collection1 s:shard2 c:collection1 r:core_node3) [n:127.0.0.1:41569_zq%2Fh c:collection1 s:shard2 r:core_node3 x:collection1] o.a.s.c.RecoveryStrategy ###### startupVersions=[[]]
   [junit4]   2> 708761 INFO  (recoveryExecutor-862-thread-1-processing-n:127.0.0.1:41569_zq%2Fh x:collection1 s:shard2 c:collection1 r:core_node3) [n:127.0.0.1:41569_zq%2Fh c:collection1 s:shard2 r:core_node3 x:collection1] o.a.s.c.RecoveryStrategy Begin buffering updates. core=[collection1]
   [junit4]   2> 708761 INFO  (recoveryExecutor-862-thread-1-processing-n:127.0.0.1:41569_zq%2Fh x:collection1 s:shard2 c:collection1 r:core_node3) [n:127.0.0.1:41569_zq%2Fh c:collection1 s:shard2 r:core_node3 x:collection1] o.a.s.u.UpdateLog Starting to buffer updates. FSUpdateLog{state=ACTIVE, tlog=null}
   [junit4]   2> 708761 INFO  (recoveryExecutor-862-thread-1-processing-n:127.0.0.1:41569_zq%2Fh x:collection1 s:shard2 c:collection1 r:core_node3) [n:127.0.0.1:41569_zq%2Fh c:collection1 s:shard2 r:core_node3 x:collection1] o.a.s.c.RecoveryStrategy Publishing state of core [collection1] as recovering, leader is [http://127.0.0.1:45588/zq/h/collection1/] and I am [http://127.0.0.1:41569/zq/h/collection1/]
   [junit4]   2> 708763 INFO  (recoveryExecutor-862-thread-1-processing-n:127.0.0.1:41569_zq%2Fh x:collection1 s:shard2 c:collection1 r:core_node3) [n:127.0.0.1:41569_zq%2Fh c:collection1 s:shard2 r:core_node3 x:collection1] o.a.s.c.RecoveryStrategy Sending prep recovery command to [http://127.0.0.1:45588/zq/h]; [WaitForState: action=PREPRECOVERY&core=collection1&nodeName=127.0.0.1:41569_zq%252Fh&coreNodeName=core_node3&state=recovering&checkLive=true&onlyIfLeader=true&onlyIfLeaderActive=true]
   [junit4]   2> 708765 INFO  (qtp12704332-5340) [n:127.0.0.1:45588_zq%2Fh    ] o.a.s.h.a.PrepRecoveryOp Going to wait for coreNodeName: core_node3, state: recovering, checkLive: true, onlyIfLeader: true, onlyIfLeaderActive: true
   [junit4]   2> 708765 INFO  (qtp12704332-5340) [n:127.0.0.1:45588_zq%2Fh    ] o.a.s.h.a.PrepRecoveryOp Will wait a max of 183 seconds to see collection1 (shard2 of collection1) have state: recovering
   [junit4]   2> 708765 INFO  (qtp12704332-5340) [n:127.0.0.1:45588_zq%2Fh    ] o.a.s.h.a.PrepRecoveryOp In WaitForState(recovering): collection=collection1, shard=shard2, thisCore=collection1, leaderDoesNotNeedRecovery=false, isLeader? true, live=true, checkLive=true, currentState=down, localState=active, nodeName=127.0.0.1:41569_zq%2Fh, coreNodeName=core_node3, onlyIfActiveCheckResult=false, nodeProps: core_node3:{"core":"collection1","base_url":"http://127.0.0.1:41569/zq/h","node_name":"127.0.0.1:41569_zq%2Fh","state":"down"}
   [junit4]   2> 708865 INFO  (zkCallback-852-thread-1-processing-n:127.0.0.1:45588_zq%2Fh) [n:127.0.0.1:45588_zq%2Fh    ] o.a.s.c.c.ZkStateReader A cluster state change: [WatchedEvent state:SyncConnected type:NodeDataChanged path:/collections/collection1/state.json] for collection [collection1] has occurred - updating... (live nodes size: [4])
   [junit4]   2> 708865 INFO  (zkCallback-864-thread-1-processing-n:127.0.0.1:41569_zq%2Fh) [n:127.0.0.1:41569_zq%2Fh    ] o.a.s.c.c.ZkStateReader A cluster state change: [WatchedEvent state:SyncConnected type:NodeDataChanged path:/collections/collection1/state.json] for collection [collection1] has occurred - updating... (live nodes size: [4])
   [junit4]   2> 708865 INFO  (zkCallback-858-thread-1-processing-n:127.0.0.1:43703_zq%2Fh) [n:127.0.0.1:43703_zq%2Fh    ] o.a.s.c.c.ZkStateReader A cluster state change: [WatchedEvent state:SyncConnected type:NodeDataChanged path:/collections/collection1/state.json] for collection [collection1] has occurred - updating... (live nodes size: [4])
   [junit4]   2> 709150 INFO  (TEST-PKIAuthenticationIntegrationTest.testPkiAuth-seed#[BBB0D8F724242CF]) [    ] o.a.s.SolrTestCaseJ4 Writing core.properties file to /home/jenkins/workspace/Lucene-Solr-master-Linux/solr/build/solr-core/test/J1/temp/solr.security.PKIAuthenticationIntegrationTest_BBB0D8F724242CF-001/shard-4-001/cores/collection1
   [junit4]   2> 709151 INFO  (TEST-PKIAuthenticationIntegrationTest.testPkiAuth-seed#[BBB0D8F724242CF]) [    ] o.a.s.c.AbstractFullDistribZkTestBase create jetty 4 in directory /home/jenkins/workspace/Lucene-Solr-master-Linux/solr/build/solr-core/test/J1/temp/solr.security.PKIAuthenticationIntegrationTest_BBB0D8F724242CF-001/shard-4-001
   [junit4]   2> 709152 INFO  (TEST-PKIAuthenticationIntegrationTest.testPkiAuth-seed#[BBB0D8F724242CF]) [    ] o.e.j.s.Server jetty-9.3.14.v20161028
   [junit4]   2> 709153 INFO  (TEST-PKIAuthenticationIntegrationTest.testPkiAuth-seed#[BBB0D8F724242CF]) [    ] o.e.j.s.h.ContextHandler Started o.e.j.s.ServletContextHandler@18ff16a{/zq/h,null,AVAILABLE}
   [junit4]   2> 709154 INFO  (TEST-PKIAuthenticationIntegrationTest.testPkiAuth-seed#[BBB0D8F724242CF]) [    ] o.e.j.s.AbstractConnector Started ServerConnector@c766f6{HTTP/1.1,[http/1.1]}{127.0.0.1:46271}
   [junit4]   2> 709154 INFO  (TEST-PKIAuthenticationIntegrationTest.testPkiAuth-seed#[BBB0D8F724242CF]) [    ] o.e.j.s.Server Started @710364ms
   [junit4]   2> 709154 INFO  (TEST-PKIAuthenticationIntegrationTest.testPkiAuth-seed#[BBB0D8F724242CF]) [    ] o.a.s.c.s.e.JettySolrRunner Jetty properties: {solr.data.dir=/home/jenkins/workspace/Lucene-Solr-master-Linux/solr/build/solr-core/test/J1/temp/solr.security.PKIAuthenticationIntegrationTest_BBB0D8F724242CF-001/tempDir-001/jetty4, solrconfig=solrconfig.xml, hostContext=/zq/h, hostPort=46271, coreRootDirectory=/home/jenkins/workspace/Lucene-Solr-master-Linux/solr/build/solr-core/test/J1/temp/solr.security.PKIAuthenticationIntegrationTest_BBB0D8F724242CF-001/shard-4-001/cores}
   [junit4]   2> 709154 ERROR (TEST-PKIAuthenticationIntegrationTest.testPkiAuth-seed#[BBB0D8F724242CF]) [    ] o.a.s.s.StartupLoggingUtils Missing Java Option solr.log.dir. Logging may be missing or incomplete.
   [junit4]   2> 709154 INFO  (TEST-PKIAuthenticationIntegrationTest.testPkiAuth-seed#[BBB0D8F724242CF]) [    ] o.a.s.s.SolrDispatchFilter  ___      _       Welcome to Apache Solr? version 7.0.0
   [junit4]   2> 709154 INFO  (TEST-PKIAuthenticationIntegrationTest.testPkiAuth-seed#[BBB0D8F724242CF]) [    ] o.a.s.s.SolrDispatchFilter / __| ___| |_ _   Starting in cloud mode on port null
   [junit4]   2> 709154 INFO  (TEST-PKIAuthenticationIntegrationTest.testPkiAuth-seed#[BBB0D8F724242CF]) [    ] o.a.s.s.SolrDispatchFilter \__ \/ _ \ | '_|  Install dir: null
   [junit4]   2> 709155 INFO  (TEST-PKIAuthenticationIntegrationTest.testPkiAuth-seed#[BBB0D8F724242CF]) [    ] o.a.s.s.SolrDispatchFilter |___/\___/_|_|    Start time: 2016-12-16T15:17:09.139Z
   [junit4]   2> 709158 INFO  (TEST-PKIAuthenticationIntegrationTest.testPkiAuth-seed#[BBB0D8F724242CF]) [    ] o.a.s.s.SolrDispatchFilter Loading solr.xml from SolrHome (not found in ZooKeeper)
   [junit4]   2> 709158 INFO  (TEST-PKIAuthenticationIntegrationTest.testPkiAuth-seed#[BBB0D8F724242CF]) [    ] o.a.s.c.SolrXmlConfig Loading container configuration from /home/jenkins/workspace/Lucene-Solr-master-Linux/solr/build/solr-core/test/J1/temp/solr.security.PKIAuthenticationIntegrationTest_BBB0D8F724242CF-001/shard-4-001/solr.xml
   [junit4]   2> 709166 INFO  (TEST-PKIAuthenticationIntegrationTest.testPkiAuth-seed#[BBB0D8F724242CF]) [    ] o.a.s.c.ZkContainer Zookeeper client=127.0.0.1:35255/solr
   [junit4]   2> 709171 WARN  (NIOServerCxn.Factory:0.0.0.0/0.0.0.0:0) [    ] o.a.z.s.NIOServerCnxn caught end of stream exception
   [junit4]   2> EndOfStreamException: Unable to read additional data from client sessionid 0x159083533680011, likely client has closed socket
   [junit4]   2> 	at org.apache.zookeeper.server.NIOServerCnxn.doIO(NIOServerCnxn.java:228)
   [junit4]   2> 	at org.apache.zookeeper.server.NIOServerCnxnFactory.run(NIOServerCnxnFactory.java:208)
   [junit4]   2> 	at java.lang.Thread.run(Thread.java:745)
   [junit4]   2> 709178 INFO  (TEST-PKIAuthenticationIntegrationTest.testPkiAuth-seed#[BBB0D8F724242CF]) [n:127.0.0.1:46271_zq%2Fh    ] o.a.s.c.c.ZkStateReader Updated live nodes from ZooKeeper... (0) -> (4)
   [junit4]   2> 709184 INFO  (TEST-PKIAuthenticationIntegrationTest.testPkiAuth-seed#[BBB0D8F724242CF]) [n:127.0.0.1:46271_zq%2Fh    ] o.a.s.c.ZkController Register node as live in ZooKeeper:/live_nodes/127.0.0.1:46271_zq%2Fh
   [junit4]   2> 709186 INFO  (zkCallback-846-thread-2) [    ] o.a.s.c.c.ZkStateReader Updated live nodes from ZooKeeper... (4) -> (5)
   [junit4]   2> 709187 INFO  (zkCallback-858-thread-1-processing-n:127.0.0.1:43703_zq%2Fh) [n:127.0.0.1:43703_zq%2Fh    ] o.a.s.c.c.ZkStateReader Updated live nodes from ZooKeeper... (4) -> (5)
   [junit4]   2> 709187 INFO  (zkCallback-852-thread-1-processing-n:127.0.0.1:45588_zq%2Fh) [n:127.0.0.1:45588_zq%2Fh    ] o.a.s.c.c.ZkStateReader Updated live nodes from ZooKeeper... (4) -> (5)
   [junit4]   2> 709187 INFO  (zkCallback-864-thread-1-processing-n:127.0.0.1:41569_zq%2Fh) [n:127.0.0.1:41569_zq%2Fh    ] o.a.s.c.c.ZkStateReader Updated live nodes from ZooKeeper... (4) -> (5)
   [junit4]   2> 709207 INFO  (zkCallback-842-thread-1-processing-n:127.0.0.1:43349_zq%2Fh) [n:127.0.0.1:43349_zq%2Fh    ] o.a.s.c.c.ZkStateReader Updated live nodes from ZooKeeper... (4) -> (5)
   [junit4]   2> 709207 INFO  (zkCallback-871-thread-1-processing-n:127.0.0.1:46271_zq%2Fh) [n:127.0.0.1:46271_zq%2Fh    ] o.a.s.c.c.ZkStateReader Updated live nodes from ZooKeeper... (4) -> (5)
   [junit4]   2> 709312 INFO  (zkCallback-852-thread-1-processing-n:127.0.0.1:45588_zq%2Fh) [n:127.0.0.1:45588_zq%2Fh    ] o.a.s.c.c.ZkStateReader A cluster state change: [WatchedEvent state:SyncConnected type:NodeDataChanged path:/collections/collection1/state.json] for collection [collection1] has occurred - updating... (live nodes size: [5])
   [junit4]   2> 709312 INFO  (zkCallback-858-thread-1-processing-n:127.0.0.1:43703_zq%2Fh) [n:127.0.0.1:43703_zq%2Fh    ] o.a.s.c.c.ZkStateReader A cluster state change: [WatchedEvent state:SyncConnected type:NodeDataChanged path:/collections/collection1/state.json] for collection [collection1] has occurred - updating... (live nodes size: [5])
   [junit4]   2> 709312 INFO  (zkCallback-864-thread-1-processing-n:127.0.0.1:41569_zq%2Fh) [n:127.0.0.1:41569_zq%2Fh    ] o.a.s.c.c.ZkStateReader A cluster state change: [WatchedEvent state:SyncConnected type:NodeDataChanged path:/collections/collection1/state.json] for collection [collection1] has occurred - updating... (live nodes size: [5])
   [junit4]   2> 709336 INFO  (TEST-PKIAuthenticationIntegrationTest.testPkiAuth-seed#[BBB0D8F724242CF]) [n:127.0.0.1:46271_zq%2Fh    ] o.a.s.c.CorePropertiesLocator Found 1 core definitions underneath /home/jenkins/workspace/Lucene-Solr-master-Linux/solr/build/solr-core/test/J1/temp/solr.security.PKIAuthenticationIntegrationTest_BBB0D8F724242CF-001/shard-4-001/cores
   [junit4]   2> 709336 INFO  (TEST-PKIAuthenticationIntegrationTest.testPkiAuth-seed#[BBB0D8F724242CF]) [n:127.0.0.1:46271_zq%2Fh    ] o.a.s.c.CorePropertiesLocator Cores are: [collection1]
   [junit4]   2> 709338 INFO  (OverseerStateUpdate-97117891553918980-127.0.0.1:43349_zq%2Fh-n_0000000000) [n:127.0.0.1:43349_zq%2Fh    ] o.a.s.c.o.ReplicaMutator Assigning new node to shard shard=shard1
   [junit4]   2> 709440 INFO  (zkCallback-871-thread-1-processing-n:127.0.0.1:46271_zq%2Fh) [n:127.0.0.1:46271_zq%2Fh    ] o.a.s.c.c.ZkStateReader A cluster state change: [WatchedEvent state:SyncConnected type:NodeDataChanged path:/collections/collection1/state.json] for collection [collection1] has occurred - updating... (live nodes size: [5])
   [junit4]   2> 709440 INFO  (zkCallback-858-thread-1-processing-n:127.0.0.1:43703_zq%2Fh) [n:127.0.0.1:43703_zq%2Fh    ] o.a.s.c.c.ZkStateReader A cluster state change: [WatchedEvent state:SyncConnected type:NodeDataChanged path:/collections/collection1/state.json] for collection [collection1] has occurred - updating... (live nodes size: [5])
   [junit4]   2> 709440 INFO  (zkCallback-852-thread-1-processing-n:127.0.0.1:45588_zq%2Fh) [n:127.0.0.1:45588_zq%2Fh    ] o.a.s.c.c.ZkStateReader A cluster state change: [WatchedEvent state:SyncConnected type:NodeDataChanged path:/collections/collection1/state.json] for collection [collection1] has occurred - updating... (live nodes size: [5])
   [junit4]   2> 709440 INFO  (zkCallback-864-thread-1-processing-n:127.0.0.1:41569_zq%2Fh) [n:127.0.0.1:41569_zq%2Fh    ] o.a.s.c.c.ZkStateReader A cluster state change: [WatchedEvent state:SyncConnected type:NodeDataChanged path:/collections/collection1/state.json] for collection [collection1] has occurred - updating... (live nodes size: [5])
   [junit4]   2> 709766 INFO  (qtp12704332-5340) [n:127.0.0.1:45588_zq%2Fh    ] o.a.s.h.a.PrepRecoveryOp In WaitForState(recovering): collection=collection1, shard=shard2, thisCore=collection1, leaderDoesNotNeedRecovery=false, isLeader? true, live=true, checkLive=true, currentState=recovering, localState=active, nodeName=127.0.0.1:41569_zq%2Fh, coreNodeName=core_node3, onlyIfActiveCheckResult=false, nodeProps: core_node3:{"core":"collection1","base_url":"http://127.0.0.1:41569/zq/h","node_name":"127.0.0.1:41569_zq%2Fh","state":"recovering"}
   [junit4]   2> 709766 INFO  (qtp12704332-5340) [n:127.0.0.1:45588_zq%2Fh    ] o.a.s.h.a.PrepRecoveryOp Waited coreNodeName: core_node3, state: recovering, checkLive: true, onlyIfLeader: true for: 1 seconds.
   [junit4]   2> 709766 INFO  (qtp12704332-5340) [n:127.0.0.1:45588_zq%2Fh    ] o.a.s.s.HttpSolrCall [admin] webapp=null path=/admin/cores params={nodeName=127.0.0.1:41569_zq%252Fh&onlyIfLeaderActive=true&core=collection1&coreNodeName=core_node3&action=PREPRECOVERY&checkLive=true&state=recovering&onlyIfLeader=true&wt=javabin&version=2} status=0 QTime=1000
   [junit4]   2> 710349 INFO  (coreLoadExecutor-2563-thread-1-processing-n:127.0.0.1:46271_zq%2Fh) [n:127.0.0.1:46271_zq%2Fh c:collection1   x:collection1] o.a.s.c.SolrConfig Using Lucene MatchVersion: 7.0.0
   [junit4]   2> 710362 INFO  (coreLoadExecutor-2563-thread-1-processing-n:127.0.0.1:46271_zq%2Fh) [n:127.0.0.1:46271_zq%2Fh c:collection1   x:collection1] o.a.s.s.IndexSchema [collection1] Schema name=test
   [junit4]   2> 710493 WARN  (coreLoadExecutor-2563-thread-1-processing-n:127.0.0.1:46271_zq%2Fh) [n:127.0.0.1:46271_zq%2Fh c:collection1   x:collection1] o.a.s.s.IndexSchema [collection1] default search field in schema is text. WARNING: Deprecated, please use 'df' on request instead.
   [junit4]   2> 710500 INFO  (coreLoadExecutor-2563-thread-1-processing-n:127.0.0.1:46271_zq%2Fh) [n:127.0.0.1:46271_zq%2Fh c:collection1   x:collection1] o.a.s.s.IndexSchema Loaded schema test/1.0 with uniqueid field id
   [junit4]   2> 710515 INFO  (coreLoadExecutor-2563-thread-1-processing-n:127.0.0.1:46271_zq%2Fh) [n:127.0.0.1:46271_zq%2Fh c:collection1   x:collection1] o.a.s.c.CoreContainer Creating SolrCore 'collection1' using configuration from collection collection1
   [junit4]   2> 710515 INFO  (coreLoadExecutor-2563-thread-1-processing-n:127.0.0.1:46271_zq%2Fh) [n:127.0.0.1:46271_zq%2Fh c:collection1   x:collection1] o.a.s.c.SolrCore [[collection1] ] Opening new SolrCore at [/home/jenkins/workspace/Lucene-Solr-master-Linux/solr/build/solr-core/test/J1/temp/solr.security.PKIAuthenticationIntegrationTest_BBB0D8F724242CF-001/shard-4-001/cores/collection1], dataDir=[/home/jenkins/workspace/Lucene-Solr-master-Linux/solr/build/solr-core/test/J1/temp/solr.security.PKIAuthenticationIntegrationTest_BBB0D8F724242CF-001/shard-4-001/cores/collection1/data/]
   [junit4]   2> 710515 INFO  (coreLoadExecutor-2563-thread-1-processing-n:127.0.0.1:46271_zq%2Fh) [n:127.0.0.1:46271_zq%2Fh c:collection1   x:collection1] o.a.s.c.JmxMonitoredMap JMX monitoring is enabled. Adding Solr mbeans to JMX Server: com.sun.jmx.mbeanserver.JmxMBeanServer@173cd89
   [junit4]   2> 710516 INFO  (coreLoadExecutor-2563-thread-1-processing-n:127.0.0.1:46271_zq%2Fh) [n:127.0.0.1:46271_zq%2Fh c:collection1   x:collection1] o.a.s.u.RandomMergePolicy RandomMergePolicy wrapping class org.apache.lucene.index.LogDocMergePolicy: [LogDocMergePolicy: minMergeSize=1000, mergeFactor=46, maxMergeSize=9223372036854775807, maxMergeSizeForForcedMerge=9223372036854775807, calibrateSizeByDeletes=false, maxMergeDocs=2147483647, maxCFSSegmentSizeMB=8.796093022207999E12, noCFSRatio=0.0]
   [junit4]   2> 710521 WARN  (coreLoadExecutor-2563-thread-1-processing-n:127.0.0.1:46271_zq%2Fh) [n:127.0.0.1:46271_zq%2Fh c:collection1   x:collection1] o.a.s.c.RequestHandlers INVALID paramSet a in requestHandler {type = requestHandler,name = /dump,class = DumpRequestHandler,args = {defaults={a=A,b=B}}}
   [junit4]   2> 710540 INFO  (coreLoadExecutor-2563-thread-1-processing-n:127.0.0.1:46271_zq%2Fh) [n:127.0.0.1:46271_zq%2Fh c:collection1   x:collection1] o.a.s.u.UpdateHandler Using UpdateLog implementation: org.apache.solr.update.UpdateLog
   [junit4]   2> 710540 INFO  (coreLoadExecutor-2563-thread-1-processing-n:127.0.0.1:46271_zq%2Fh) [n:127.0.0.1:46271_zq%2Fh c:collection1   x:collection1] o.a.s.u.UpdateLog Initializing UpdateLog: dataDir= defaultSyncLevel=FLUSH numRecordsToKeep=100 maxNumLogsToKeep=10 numVersionBuckets=65536
   [junit4]   2> 710540 INFO  (coreLoadExecutor-2563-thread-1-processing-n:127.0.0.1:46271_zq%2Fh) [n:127.0.0.1:46271_zq%2Fh c:collection1   x:collection1] o.a.s.u.CommitTracker Hard AutoCommit: disabled
   [junit4]   2> 710541 INFO  (coreLoadExecutor-2563-thread-1-processing-n:127.0.0.1:46271_zq%2Fh) [n:127.0.0.1:46271_zq%2Fh c:collection1   x:collection1] o.a.s.u.CommitTracker Soft AutoCommit: disabled
   [junit4]   2> 710541 INFO  (coreLoadExecutor-2563-thread-1-processing-n:127.0.0.1:46271_zq%2Fh) [n:127.0.0.1:46271_zq%2Fh c:collection1   x:collection1] o.a.s.u.RandomMergePolicy RandomMergePolicy wrapping class org.apache.lucene.index.LogDocMergePolicy: [LogDocMergePolicy: minMergeSize=1000, mergeFactor=40, maxMergeSize=9223372036854775807, maxMergeSizeForForcedMerge=9223372036854775807, calibrateSizeByDeletes=false, maxMergeDocs=2147483647, maxCFSSegmentSizeMB=8.796093022207999E12, noCFSRatio=0.5119829699318189]
   [junit4]   2> 710542 INFO  (coreLoadExecutor-2563-thread-1-processing-n:127.0.0.1:46271_zq%2Fh) [n:127.0.0.1:46271_zq%2Fh c:collection1   x:collection1] o.a.s.s.SolrIndexSearcher Opening [Searcher@d2a947[collection1] main]
   [junit4]   2> 710543 INFO  (coreLoadExecutor-2563-thread-1-processing-n:127.0.0.1:46271_zq%2Fh) [n:127.0.0.1:46271_zq%2Fh c:collection1   x:collection1] o.a.s.r.ManagedResourceStorage Configured ZooKeeperStorageIO with znodeBase: /configs/conf1
   [junit4]   2> 710543 INFO  (coreLoadExecutor-2563-thread-1-processing-n:127.0.0.1:46271_zq%2Fh) [n:127.0.0.1:46271_zq%2Fh c:collection1   x:collection1] o.a.s.r.ManagedResourceStorage Loaded null at path _rest_managed.json using ZooKeeperStorageIO:path=/configs/conf1
   [junit4]   2> 710543 INFO  (coreLoadExecutor-2563-thread-1-processing-n:127.0.0.1:46271_zq%2Fh) [n:127.0.0.1:46271_zq%2Fh c:collection1   x:collection1] o.a.s.h.ReplicationHandler Commits will be reserved for  10000
   [junit4]   2> 710546 INFO  (searcherExecutor-2564-thread-1-processing-n:127.0.0.1:46271_zq%2Fh x:collection1 c:collection1) [n:127.0.0.1:46271_zq%2Fh c:collection1   x:collection1] o.a.s.c.SolrCore [collection1] Registered new searcher Searcher@d2a947[collection1] main{ExitableDirectoryReader(UninvertingDirectoryReader())}
   [junit4]   2> 710546 INFO  (coreLoadExecutor-2563-thread-1-processing-n:127.0.0.1:46271_zq%2Fh) [n:127.0.0.1:46271_zq%2Fh c:collection1   x:collection1] o.a.s.u.UpdateLog Could not find max version in index or recent updates, using new clock 1553886274419425280
   [junit4]   2> 710550 INFO  (coreZkRegister-2558-thread-1-processing-n:127.0.0.1:46271_zq%2Fh x:collection1 c:collection1) [n:127.0.0.1:46271_zq%2Fh c:collection1 s:shard1 r:core_node4 x:collection1] o.a.s.c.ZkController Core needs to recover:collection1
   [junit4]   2> 710550 INFO  (updateExecutor-868-thread-1-processing-n:127.0.0.1:46271_zq%2Fh x:collection1 s:shard1 c:collection1 r:core_node4) [n:127.0.0.1:46271_zq%2Fh c:collection1 s:shard1 r:core_node4 x:collection1] o.a.s.u.DefaultSolrCoreState Running recovery
   [junit4]   2> 710551 INFO  (recoveryExecutor-869-thread-1-processing-n:127.0.0.1:46271_zq%2Fh x:collection1 s:shard1 c:collection1 r:core_node4) [n:127.0.0.1:46271_zq%2Fh c:collection1 s:shard1 r:core_node4 x:collection1] o.a.s.c.RecoveryStrategy Starting recovery process. recoveringAfterStartup=true
   [junit4]   2> 710551 INFO  (recoveryExecutor-869-thread-1-processing-n:127.0.0.1:46271_zq%2Fh x:collection1 s:shard1 c:collection1 r:core_node4) [n:127.0.0.1:46271_zq%2Fh c:collection1 s:shard1 r:core_node4 x:collection1] o.a.s.c.RecoveryStrategy ###### startupVersions=[[]]
   [junit4]   2> 710551 INFO  (recoveryExecutor-869-thread-1-processing-n:127.0.0.1:46271_zq%2Fh x:collection1 s:shard1 c:collection1 r:core_node4) [n:127.0.0.1:46271_zq%2Fh c:collection1 s:shard1 r:core_node4 x:collection1] o.a.s.c.RecoveryStrategy Begin buffering updates. core=[collection1]
   [junit4]   2> 710551 INFO  (recoveryExecutor-869-thread-1-processing-n:127.0.0.1:46271_zq%2Fh x:collection1 s:shard1 c:collection1 r:core_node4) [n:127.0.0.1:46271_zq%2Fh c:collection1 s:shard1 r:core_node4 x:collection1] o.a.s.u.UpdateLog Starting to buffer updates. FSUpdateLog{state=ACTIVE, tlog=null}
   [junit4]   2> 710551 INFO  (recoveryExecutor-869-thread-1-processing-n:127.0.0.1:46271_zq%2Fh x:collection1 s:shard1 c:collection1 r:core_node4) [n:127.0.0.1:46271_zq%2Fh c:collection1 s:shard1 r:core_node4 x:coll

[...truncated too long message...]

69_zq%2Fh
   [junit4]   2> 726427 INFO  (zkCallback-871-thread-1-processing-n:127.0.0.1:46271_zq%2Fh) [n:127.0.0.1:46271_zq%2Fh    ] o.a.s.c.OverseerElectionContext I am going to be the leader 127.0.0.1:46271_zq%2Fh
   [junit4]   2> 726427 INFO  (zkCallback-871-thread-3-processing-n:127.0.0.1:46271_zq%2Fh) [n:127.0.0.1:46271_zq%2Fh    ] o.a.s.c.c.ZkStateReader Updated live nodes from ZooKeeper... (2) -> (1)
   [junit4]   2> 726428 INFO  (zkCallback-871-thread-1-processing-n:127.0.0.1:46271_zq%2Fh) [n:127.0.0.1:46271_zq%2Fh    ] o.a.s.c.Overseer Overseer (id=97117891553918994-127.0.0.1:46271_zq%2Fh-n_0000000004) starting
   [junit4]   2> 726538 INFO  (zkCallback-871-thread-3-processing-n:127.0.0.1:46271_zq%2Fh) [n:127.0.0.1:46271_zq%2Fh    ] o.a.s.c.c.ZkStateReader A cluster state change: [WatchedEvent state:SyncConnected type:NodeDataChanged path:/collections/collection1/state.json] for collection [collection1] has occurred - updating... (live nodes size: [1])
   [junit4]   2> 727397 WARN  (zkCallback-864-thread-1-processing-n:127.0.0.1:41569_zq%2Fh) [n:127.0.0.1:41569_zq%2Fh c:collection1 s:shard2 r:core_node3 x:collection1] o.a.s.c.SyncStrategy Closed, skipping sync up.
   [junit4]   2> 727397 INFO  (zkCallback-864-thread-1-processing-n:127.0.0.1:41569_zq%2Fh) [n:127.0.0.1:41569_zq%2Fh c:collection1 s:shard2 r:core_node3 x:collection1] o.a.s.c.ShardLeaderElectionContext We failed sync, but we have no versions - we can't sync in that case - we were active before, so become leader anyway
   [junit4]   2> 727397 INFO  (zkCallback-864-thread-1-processing-n:127.0.0.1:41569_zq%2Fh) [n:127.0.0.1:41569_zq%2Fh c:collection1 s:shard2 r:core_node3 x:collection1] o.a.s.c.SolrCore [collection1]  CLOSING SolrCore org.apache.solr.core.SolrCore@1586496
   [junit4]   2> 727420 INFO  (TEST-PKIAuthenticationIntegrationTest.testPkiAuth-seed#[BBB0D8F724242CF]) [    ] o.e.j.s.AbstractConnector Stopped ServerConnector@1354ac8{HTTP/1.1,[http/1.1]}{127.0.0.1:0}
   [junit4]   2> 727420 INFO  (TEST-PKIAuthenticationIntegrationTest.testPkiAuth-seed#[BBB0D8F724242CF]) [    ] o.e.j.s.h.ContextHandler Stopped o.e.j.s.ServletContextHandler@1aca57{/zq/h,null,UNAVAILABLE}
   [junit4]   2> 727421 INFO  (TEST-PKIAuthenticationIntegrationTest.testPkiAuth-seed#[BBB0D8F724242CF]) [    ] o.a.s.c.ChaosMonkey monkey: stop shard! 46271
   [junit4]   2> 727421 INFO  (TEST-PKIAuthenticationIntegrationTest.testPkiAuth-seed#[BBB0D8F724242CF]) [    ] o.a.s.c.CoreContainer Shutting down CoreContainer instance=19892853
   [junit4]   2> 727423 INFO  (TEST-PKIAuthenticationIntegrationTest.testPkiAuth-seed#[BBB0D8F724242CF]) [    ] o.a.s.c.Overseer Overseer (id=97117891553918994-127.0.0.1:46271_zq%2Fh-n_0000000004) closing
   [junit4]   2> 727423 INFO  (OverseerStateUpdate-97117891553918994-127.0.0.1:46271_zq%2Fh-n_0000000004) [n:127.0.0.1:46271_zq%2Fh    ] o.a.s.c.Overseer Overseer Loop exiting : 127.0.0.1:46271_zq%2Fh
   [junit4]   2> 727425 WARN  (zkCallback-871-thread-2-processing-n:127.0.0.1:46271_zq%2Fh) [n:127.0.0.1:46271_zq%2Fh c:collection1 s:shard1 r:core_node4 x:collection1] o.a.s.c.SyncStrategy Closed, skipping sync up.
   [junit4]   2> 727425 INFO  (zkCallback-871-thread-2-processing-n:127.0.0.1:46271_zq%2Fh) [n:127.0.0.1:46271_zq%2Fh c:collection1 s:shard1 r:core_node4 x:collection1] o.a.s.c.ShardLeaderElectionContext We failed sync, but we have no versions - we can't sync in that case - we were active before, so become leader anyway
   [junit4]   2> 727425 INFO  (zkCallback-871-thread-2-processing-n:127.0.0.1:46271_zq%2Fh) [n:127.0.0.1:46271_zq%2Fh c:collection1 s:shard1 r:core_node4 x:collection1] o.a.s.c.SolrCore [collection1]  CLOSING SolrCore org.apache.solr.core.SolrCore@186cc71
   [junit4]   2> 728924 WARN  (zkCallback-871-thread-3-processing-n:127.0.0.1:46271_zq%2Fh) [n:127.0.0.1:46271_zq%2Fh    ] o.a.s.c.c.ZkStateReader ZooKeeper watch triggered, but Solr cannot talk to ZK: [KeeperErrorCode = Session expired for /live_nodes]
   [junit4]   2> 728925 INFO  (TEST-PKIAuthenticationIntegrationTest.testPkiAuth-seed#[BBB0D8F724242CF]) [    ] o.e.j.s.AbstractConnector Stopped ServerConnector@c766f6{HTTP/1.1,[http/1.1]}{127.0.0.1:0}
   [junit4]   2> 728925 INFO  (TEST-PKIAuthenticationIntegrationTest.testPkiAuth-seed#[BBB0D8F724242CF]) [    ] o.e.j.s.h.ContextHandler Stopped o.e.j.s.ServletContextHandler@18ff16a{/zq/h,null,UNAVAILABLE}
   [junit4]   2> 728926 INFO  (TEST-PKIAuthenticationIntegrationTest.testPkiAuth-seed#[BBB0D8F724242CF]) [    ] o.a.s.c.ZkTestServer connecting to 127.0.0.1:35255 35255
   [junit4]   2> 728940 INFO  (Thread-1336) [    ] o.a.s.c.ZkTestServer connecting to 127.0.0.1:35255 35255
   [junit4]   2> 728941 WARN  (Thread-1336) [    ] o.a.s.c.ZkTestServer Watch limit violations: 
   [junit4]   2> Maximum concurrent create/delete watches above limit:
   [junit4]   2> 
   [junit4]   2> 	6	/solr/aliases.json
   [junit4]   2> 	6	/solr/clusterprops.json
   [junit4]   2> 	5	/solr/security.json
   [junit4]   2> 	5	/solr/configs/conf1
   [junit4]   2> 
   [junit4]   2> Maximum concurrent data watches above limit:
   [junit4]   2> 
   [junit4]   2> 	6	/solr/clusterstate.json
   [junit4]   2> 	4	/solr/collections/collection1/state.json
   [junit4]   2> 
   [junit4]   2> Maximum concurrent children watches above limit:
   [junit4]   2> 
   [junit4]   2> 	29	/solr/overseer/queue
   [junit4]   2> 	25	/solr/overseer/collection-queue-work
   [junit4]   2> 	16	/solr/overseer/queue-work
   [junit4]   2> 	6	/solr/live_nodes
   [junit4]   2> 	6	/solr/collections
   [junit4]   2> 
   [junit4]   2> NOTE: reproduce with: ant test  -Dtestcase=PKIAuthenticationIntegrationTest -Dtests.method=testPkiAuth -Dtests.seed=BBB0D8F724242CF -Dtests.multiplier=3 -Dtests.slow=true -Dtests.locale=es-CU -Dtests.timezone=America/Moncton -Dtests.asserts=true -Dtests.file.encoding=US-ASCII
   [junit4] FAILURE 27.5s J1 | PKIAuthenticationIntegrationTest.testPkiAuth <<<
   [junit4]    > Throwable #1: java.lang.AssertionError: There are still nodes recoverying - waited for 10 seconds
   [junit4]    > 	at __randomizedtesting.SeedInfo.seed([BBB0D8F724242CF:3B0594DE92F4C56E]:0)
   [junit4]    > 	at org.apache.solr.cloud.AbstractDistribZkTestBase.waitForRecoveriesToFinish(AbstractDistribZkTestBase.java:184)
   [junit4]    > 	at org.apache.solr.cloud.AbstractFullDistribZkTestBase.waitForRecoveriesToFinish(AbstractFullDistribZkTestBase.java:862)
   [junit4]    > 	at org.apache.solr.cloud.AbstractFullDistribZkTestBase.waitForThingsToLevelOut(AbstractFullDistribZkTestBase.java:1418)
   [junit4]    > 	at org.apache.solr.security.PKIAuthenticationIntegrationTest.testPkiAuth(PKIAuthenticationIntegrationTest.java:50)
   [junit4]    > 	at org.apache.solr.BaseDistributedSearchTestCase$ShardsRepeatRule$ShardsFixedStatement.callStatement(BaseDistributedSearchTestCase.java:985)
   [junit4]    > 	at org.apache.solr.BaseDistributedSearchTestCase$ShardsRepeatRule$ShardsStatement.evaluate(BaseDistributedSearchTestCase.java:960)
   [junit4]    > 	at java.lang.Thread.run(Thread.java:745)
   [junit4]   2> 728946 INFO  (SUITE-PKIAuthenticationIntegrationTest-seed#[BBB0D8F724242CF]-worker) [    ] o.a.s.SolrTestCaseJ4 ###deleteCore
   [junit4]   2> NOTE: leaving temporary files on disk at: /home/jenkins/workspace/Lucene-Solr-master-Linux/solr/build/solr-core/test/J1/temp/solr.security.PKIAuthenticationIntegrationTest_BBB0D8F724242CF-001
   [junit4]   2> Dec 16, 2016 3:17:28 PM com.carrotsearch.randomizedtesting.ThreadLeakControl checkThreadLeaks
   [junit4]   2> WARNING: Will linger awaiting termination of 1 leaked thread(s).
   [junit4]   2> NOTE: test params are: codec=CheapBastard, sim=RandomSimilarity(queryNorm=false): {}, locale=es-CU, timezone=America/Moncton
   [junit4]   2> NOTE: Linux 4.4.0-53-generic i386/Oracle Corporation 1.8.0_112 (32-bit)/cpus=12,threads=1,free=62090056,total=289300480
   [junit4]   2> NOTE: All tests run in this JVM: [OpenExchangeRatesOrgProviderTest, TestSweetSpotSimilarityFactory, TestDistributedGrouping, StressHdfsTest, SimplePostToolTest, HdfsChaosMonkeyNothingIsSafeTest, TestRuleBasedAuthorizationPlugin, TestBM25SimilarityFactory, TimeZoneUtilsTest, StatsReloadRaceTest, SharedFSAutoReplicaFailoverTest, TestCharFilters, DistanceFunctionTest, CachingDirectoryFactoryTest, DirectSolrConnectionTest, JSONWriterTest, TestGraphTermsQParserPlugin, TestReloadAndDeleteDocs, TestNumericTerms32, SortByFunctionTest, TestHighFrequencyDictionaryFactory, BadCopyFieldTest, TestSerializedLuceneMatchVersion, TestLeaderElectionZkExpiry, TestTrie, TestManagedSchemaAPI, ManagedSchemaRoundRobinCloudTest, TestDynamicFieldResource, ChaosMonkeyNothingIsSafeTest, CollectionsAPIDistributedZkTest, SpellCheckComponentTest, DistributedMLTComponentTest, GraphQueryTest, TestSolrFieldCacheMBean, CSVRequestHandlerTest, TestStressRecovery, TestSegmentSorting, ShardRoutingCustomTest, ZkControllerTest, OverseerCollectionConfigSetProcessorTest, TestChildDocTransformer, RecoveryAfterSoftCommitTest, TestTrieFacet, TestCloudPivotFacet, TestOrdValues, DistributedIntervalFacetingTest, RulesTest, HighlighterTest, TestRawResponseWriter, MoreLikeThisHandlerTest, TestQueryTypes, BlockJoinFacetDistribTest, TestExclusionRuleCollectionAccess, TestBlendedInfixSuggestions, AlternateDirectoryTest, CheckHdfsIndexTest, TestSolrDynamicMBean, DirectSolrSpellCheckerTest, TestCloudSchemaless, BasicFunctionalityTest, TestXIncludeConfig, TestPerFieldSimilarity, TestUseDocValuesAsStored, DeleteNodeTest, TestQueryUtils, DocValuesNotIndexedTest, TestFieldCacheSanityChecker, FullHLLTest, TestFiltering, OverseerStatusTest, HdfsRestartWhileUpdatingTest, LoggingHandlerTest, TestMiniSolrCloudClusterSSL, TestFieldCacheVsDocValues, QueryParsingTest, HdfsTlogReplayBufferedWhileIndexingTest, SpellCheckCollatorTest, SolrIndexSplitterTest, ConvertedLegacyTest, ReplicationFactorTest, PKIAuthenticationIntegrationTest]
   [junit4] Completed [225/660 (1!)] on J1 in 27.80s, 1 test, 1 failure <<< FAILURES!

[...truncated 55958 lines...]


Mime
View raw message