lucene-dev mailing list archives

Site index · List index
Message view « Date » · « Thread »
Top « Date » · « Thread »
From Policeman Jenkins Server <jenk...@thetaphi.de>
Subject [JENKINS-EA] Lucene-Solr-master-Linux (64bit/jdk-9-ea+147) - Build # 18647 - Still Unstable!
Date Thu, 29 Dec 2016 16:32:31 GMT
Build: https://jenkins.thetaphi.de/job/Lucene-Solr-master-Linux/18647/
Java: 64bit/jdk-9-ea+147 -XX:+UseCompressedOops -XX:+UseParallelGC

10 tests failed.
FAILED:  org.apache.lucene.codecs.blockterms.TestVarGapFixedIntervalPostingsFormat.testRamBytesUsed

Error Message:
Actual RAM usage 240, but got 2570, -970.8333333333334% error

Stack Trace:
java.lang.AssertionError: Actual RAM usage 240, but got 2570, -970.8333333333334% error
	at __randomizedtesting.SeedInfo.seed([E7C8151E5DAC77AC:156B075E97D368FA]:0)
	at org.junit.Assert.fail(Assert.java:93)
	at org.junit.Assert.assertTrue(Assert.java:43)
	at org.apache.lucene.index.BaseIndexFileFormatTestCase.testRamBytesUsed(BaseIndexFileFormatTestCase.java:279)
	at org.apache.lucene.index.BasePostingsFormatTestCase.testRamBytesUsed(BasePostingsFormatTestCase.java:85)
	at java.base/jdk.internal.reflect.NativeMethodAccessorImpl.invoke0(Native Method)
	at java.base/jdk.internal.reflect.NativeMethodAccessorImpl.invoke(NativeMethodAccessorImpl.java:62)
	at java.base/jdk.internal.reflect.DelegatingMethodAccessorImpl.invoke(DelegatingMethodAccessorImpl.java:43)
	at java.base/java.lang.reflect.Method.invoke(Method.java:538)
	at com.carrotsearch.randomizedtesting.RandomizedRunner.invoke(RandomizedRunner.java:1713)
	at com.carrotsearch.randomizedtesting.RandomizedRunner$8.evaluate(RandomizedRunner.java:907)
	at com.carrotsearch.randomizedtesting.RandomizedRunner$9.evaluate(RandomizedRunner.java:943)
	at com.carrotsearch.randomizedtesting.RandomizedRunner$10.evaluate(RandomizedRunner.java:957)
	at org.apache.lucene.util.TestRuleSetupTeardownChained$1.evaluate(TestRuleSetupTeardownChained.java:49)
	at org.apache.lucene.util.AbstractBeforeAfterRule$1.evaluate(AbstractBeforeAfterRule.java:45)
	at org.apache.lucene.util.TestRuleThreadAndTestName$1.evaluate(TestRuleThreadAndTestName.java:48)
	at org.apache.lucene.util.TestRuleIgnoreAfterMaxFailures$1.evaluate(TestRuleIgnoreAfterMaxFailures.java:64)
	at org.apache.lucene.util.TestRuleMarkFailure$1.evaluate(TestRuleMarkFailure.java:47)
	at com.carrotsearch.randomizedtesting.rules.StatementAdapter.evaluate(StatementAdapter.java:36)
	at com.carrotsearch.randomizedtesting.ThreadLeakControl$StatementRunner.run(ThreadLeakControl.java:367)
	at com.carrotsearch.randomizedtesting.ThreadLeakControl.forkTimeoutingTask(ThreadLeakControl.java:811)
	at com.carrotsearch.randomizedtesting.ThreadLeakControl$3.evaluate(ThreadLeakControl.java:462)
	at com.carrotsearch.randomizedtesting.RandomizedRunner.runSingleTest(RandomizedRunner.java:916)
	at com.carrotsearch.randomizedtesting.RandomizedRunner$5.evaluate(RandomizedRunner.java:802)
	at com.carrotsearch.randomizedtesting.RandomizedRunner$6.evaluate(RandomizedRunner.java:852)
	at com.carrotsearch.randomizedtesting.RandomizedRunner$7.evaluate(RandomizedRunner.java:863)
	at org.apache.lucene.util.AbstractBeforeAfterRule$1.evaluate(AbstractBeforeAfterRule.java:45)
	at com.carrotsearch.randomizedtesting.rules.StatementAdapter.evaluate(StatementAdapter.java:36)
	at org.apache.lucene.util.TestRuleStoreClassName$1.evaluate(TestRuleStoreClassName.java:41)
	at com.carrotsearch.randomizedtesting.rules.NoShadowingOrOverridesOnMethodsRule$1.evaluate(NoShadowingOrOverridesOnMethodsRule.java:40)
	at com.carrotsearch.randomizedtesting.rules.NoShadowingOrOverridesOnMethodsRule$1.evaluate(NoShadowingOrOverridesOnMethodsRule.java:40)
	at com.carrotsearch.randomizedtesting.rules.StatementAdapter.evaluate(StatementAdapter.java:36)
	at com.carrotsearch.randomizedtesting.rules.StatementAdapter.evaluate(StatementAdapter.java:36)
	at org.apache.lucene.util.TestRuleAssertionsRequired$1.evaluate(TestRuleAssertionsRequired.java:53)
	at org.apache.lucene.util.TestRuleMarkFailure$1.evaluate(TestRuleMarkFailure.java:47)
	at org.apache.lucene.util.TestRuleIgnoreAfterMaxFailures$1.evaluate(TestRuleIgnoreAfterMaxFailures.java:64)
	at org.apache.lucene.util.TestRuleIgnoreTestSuites$1.evaluate(TestRuleIgnoreTestSuites.java:54)
	at com.carrotsearch.randomizedtesting.rules.StatementAdapter.evaluate(StatementAdapter.java:36)
	at com.carrotsearch.randomizedtesting.ThreadLeakControl$StatementRunner.run(ThreadLeakControl.java:367)
	at java.base/java.lang.Thread.run(Thread.java:844)


FAILED:  org.apache.lucene.codecs.asserting.TestAssertingNormsFormat.testRamBytesUsed

Error Message:
Actual RAM usage 384, but got 7433, -1835.6770833333333% error

Stack Trace:
java.lang.AssertionError: Actual RAM usage 384, but got 7433, -1835.6770833333333% error
	at __randomizedtesting.SeedInfo.seed([BB53F54EB1E051FB:49F0E70E7B9F4EAD]:0)
	at org.junit.Assert.fail(Assert.java:93)
	at org.junit.Assert.assertTrue(Assert.java:43)
	at org.apache.lucene.index.BaseIndexFileFormatTestCase.testRamBytesUsed(BaseIndexFileFormatTestCase.java:279)
	at org.apache.lucene.index.BaseNormsFormatTestCase.testRamBytesUsed(BaseNormsFormatTestCase.java:52)
	at java.base/jdk.internal.reflect.NativeMethodAccessorImpl.invoke0(Native Method)
	at java.base/jdk.internal.reflect.NativeMethodAccessorImpl.invoke(NativeMethodAccessorImpl.java:62)
	at java.base/jdk.internal.reflect.DelegatingMethodAccessorImpl.invoke(DelegatingMethodAccessorImpl.java:43)
	at java.base/java.lang.reflect.Method.invoke(Method.java:538)
	at com.carrotsearch.randomizedtesting.RandomizedRunner.invoke(RandomizedRunner.java:1713)
	at com.carrotsearch.randomizedtesting.RandomizedRunner$8.evaluate(RandomizedRunner.java:907)
	at com.carrotsearch.randomizedtesting.RandomizedRunner$9.evaluate(RandomizedRunner.java:943)
	at com.carrotsearch.randomizedtesting.RandomizedRunner$10.evaluate(RandomizedRunner.java:957)
	at org.apache.lucene.util.TestRuleSetupTeardownChained$1.evaluate(TestRuleSetupTeardownChained.java:49)
	at org.apache.lucene.util.AbstractBeforeAfterRule$1.evaluate(AbstractBeforeAfterRule.java:45)
	at org.apache.lucene.util.TestRuleThreadAndTestName$1.evaluate(TestRuleThreadAndTestName.java:48)
	at org.apache.lucene.util.TestRuleIgnoreAfterMaxFailures$1.evaluate(TestRuleIgnoreAfterMaxFailures.java:64)
	at org.apache.lucene.util.TestRuleMarkFailure$1.evaluate(TestRuleMarkFailure.java:47)
	at com.carrotsearch.randomizedtesting.rules.StatementAdapter.evaluate(StatementAdapter.java:36)
	at com.carrotsearch.randomizedtesting.ThreadLeakControl$StatementRunner.run(ThreadLeakControl.java:367)
	at com.carrotsearch.randomizedtesting.ThreadLeakControl.forkTimeoutingTask(ThreadLeakControl.java:811)
	at com.carrotsearch.randomizedtesting.ThreadLeakControl$3.evaluate(ThreadLeakControl.java:462)
	at com.carrotsearch.randomizedtesting.RandomizedRunner.runSingleTest(RandomizedRunner.java:916)
	at com.carrotsearch.randomizedtesting.RandomizedRunner$5.evaluate(RandomizedRunner.java:802)
	at com.carrotsearch.randomizedtesting.RandomizedRunner$6.evaluate(RandomizedRunner.java:852)
	at com.carrotsearch.randomizedtesting.RandomizedRunner$7.evaluate(RandomizedRunner.java:863)
	at org.apache.lucene.util.AbstractBeforeAfterRule$1.evaluate(AbstractBeforeAfterRule.java:45)
	at com.carrotsearch.randomizedtesting.rules.StatementAdapter.evaluate(StatementAdapter.java:36)
	at org.apache.lucene.util.TestRuleStoreClassName$1.evaluate(TestRuleStoreClassName.java:41)
	at com.carrotsearch.randomizedtesting.rules.NoShadowingOrOverridesOnMethodsRule$1.evaluate(NoShadowingOrOverridesOnMethodsRule.java:40)
	at com.carrotsearch.randomizedtesting.rules.NoShadowingOrOverridesOnMethodsRule$1.evaluate(NoShadowingOrOverridesOnMethodsRule.java:40)
	at com.carrotsearch.randomizedtesting.rules.StatementAdapter.evaluate(StatementAdapter.java:36)
	at com.carrotsearch.randomizedtesting.rules.StatementAdapter.evaluate(StatementAdapter.java:36)
	at org.apache.lucene.util.TestRuleAssertionsRequired$1.evaluate(TestRuleAssertionsRequired.java:53)
	at org.apache.lucene.util.TestRuleMarkFailure$1.evaluate(TestRuleMarkFailure.java:47)
	at org.apache.lucene.util.TestRuleIgnoreAfterMaxFailures$1.evaluate(TestRuleIgnoreAfterMaxFailures.java:64)
	at org.apache.lucene.util.TestRuleIgnoreTestSuites$1.evaluate(TestRuleIgnoreTestSuites.java:54)
	at com.carrotsearch.randomizedtesting.rules.StatementAdapter.evaluate(StatementAdapter.java:36)
	at com.carrotsearch.randomizedtesting.ThreadLeakControl$StatementRunner.run(ThreadLeakControl.java:367)
	at java.base/java.lang.Thread.run(Thread.java:844)


FAILED:  org.apache.lucene.codecs.blocktreeords.TestOrdsBlockTree.testRamBytesUsed

Error Message:
Actual RAM usage 376, but got 2063, -448.67021276595744% error

Stack Trace:
java.lang.AssertionError: Actual RAM usage 376, but got 2063, -448.67021276595744% error
	at __randomizedtesting.SeedInfo.seed([E7C8151E5DAC77AC:156B075E97D368FA]:0)
	at org.junit.Assert.fail(Assert.java:93)
	at org.junit.Assert.assertTrue(Assert.java:43)
	at org.apache.lucene.index.BaseIndexFileFormatTestCase.testRamBytesUsed(BaseIndexFileFormatTestCase.java:279)
	at org.apache.lucene.index.BasePostingsFormatTestCase.testRamBytesUsed(BasePostingsFormatTestCase.java:85)
	at java.base/jdk.internal.reflect.NativeMethodAccessorImpl.invoke0(Native Method)
	at java.base/jdk.internal.reflect.NativeMethodAccessorImpl.invoke(NativeMethodAccessorImpl.java:62)
	at java.base/jdk.internal.reflect.DelegatingMethodAccessorImpl.invoke(DelegatingMethodAccessorImpl.java:43)
	at java.base/java.lang.reflect.Method.invoke(Method.java:538)
	at com.carrotsearch.randomizedtesting.RandomizedRunner.invoke(RandomizedRunner.java:1713)
	at com.carrotsearch.randomizedtesting.RandomizedRunner$8.evaluate(RandomizedRunner.java:907)
	at com.carrotsearch.randomizedtesting.RandomizedRunner$9.evaluate(RandomizedRunner.java:943)
	at com.carrotsearch.randomizedtesting.RandomizedRunner$10.evaluate(RandomizedRunner.java:957)
	at org.apache.lucene.util.TestRuleSetupTeardownChained$1.evaluate(TestRuleSetupTeardownChained.java:49)
	at org.apache.lucene.util.AbstractBeforeAfterRule$1.evaluate(AbstractBeforeAfterRule.java:45)
	at org.apache.lucene.util.TestRuleThreadAndTestName$1.evaluate(TestRuleThreadAndTestName.java:48)
	at org.apache.lucene.util.TestRuleIgnoreAfterMaxFailures$1.evaluate(TestRuleIgnoreAfterMaxFailures.java:64)
	at org.apache.lucene.util.TestRuleMarkFailure$1.evaluate(TestRuleMarkFailure.java:47)
	at com.carrotsearch.randomizedtesting.rules.StatementAdapter.evaluate(StatementAdapter.java:36)
	at com.carrotsearch.randomizedtesting.ThreadLeakControl$StatementRunner.run(ThreadLeakControl.java:367)
	at com.carrotsearch.randomizedtesting.ThreadLeakControl.forkTimeoutingTask(ThreadLeakControl.java:811)
	at com.carrotsearch.randomizedtesting.ThreadLeakControl$3.evaluate(ThreadLeakControl.java:462)
	at com.carrotsearch.randomizedtesting.RandomizedRunner.runSingleTest(RandomizedRunner.java:916)
	at com.carrotsearch.randomizedtesting.RandomizedRunner$5.evaluate(RandomizedRunner.java:802)
	at com.carrotsearch.randomizedtesting.RandomizedRunner$6.evaluate(RandomizedRunner.java:852)
	at com.carrotsearch.randomizedtesting.RandomizedRunner$7.evaluate(RandomizedRunner.java:863)
	at org.apache.lucene.util.AbstractBeforeAfterRule$1.evaluate(AbstractBeforeAfterRule.java:45)
	at com.carrotsearch.randomizedtesting.rules.StatementAdapter.evaluate(StatementAdapter.java:36)
	at org.apache.lucene.util.TestRuleStoreClassName$1.evaluate(TestRuleStoreClassName.java:41)
	at com.carrotsearch.randomizedtesting.rules.NoShadowingOrOverridesOnMethodsRule$1.evaluate(NoShadowingOrOverridesOnMethodsRule.java:40)
	at com.carrotsearch.randomizedtesting.rules.NoShadowingOrOverridesOnMethodsRule$1.evaluate(NoShadowingOrOverridesOnMethodsRule.java:40)
	at com.carrotsearch.randomizedtesting.rules.StatementAdapter.evaluate(StatementAdapter.java:36)
	at com.carrotsearch.randomizedtesting.rules.StatementAdapter.evaluate(StatementAdapter.java:36)
	at org.apache.lucene.util.TestRuleAssertionsRequired$1.evaluate(TestRuleAssertionsRequired.java:53)
	at org.apache.lucene.util.TestRuleMarkFailure$1.evaluate(TestRuleMarkFailure.java:47)
	at org.apache.lucene.util.TestRuleIgnoreAfterMaxFailures$1.evaluate(TestRuleIgnoreAfterMaxFailures.java:64)
	at org.apache.lucene.util.TestRuleIgnoreTestSuites$1.evaluate(TestRuleIgnoreTestSuites.java:54)
	at com.carrotsearch.randomizedtesting.rules.StatementAdapter.evaluate(StatementAdapter.java:36)
	at com.carrotsearch.randomizedtesting.ThreadLeakControl$StatementRunner.run(ThreadLeakControl.java:367)
	at java.base/java.lang.Thread.run(Thread.java:844)


FAILED:  org.apache.lucene.codecs.lucene53.TestLucene53NormsFormat.testRamBytesUsed

Error Message:
Actual RAM usage 256, but got 5463, -2033.984375% error

Stack Trace:
java.lang.AssertionError: Actual RAM usage 256, but got 5463, -2033.984375% error
	at __randomizedtesting.SeedInfo.seed([FF5AFD76875915D:FD56BD97A20A8E0B]:0)
	at org.junit.Assert.fail(Assert.java:93)
	at org.junit.Assert.assertTrue(Assert.java:43)
	at org.apache.lucene.index.BaseIndexFileFormatTestCase.testRamBytesUsed(BaseIndexFileFormatTestCase.java:279)
	at org.apache.lucene.index.BaseNormsFormatTestCase.testRamBytesUsed(BaseNormsFormatTestCase.java:52)
	at java.base/jdk.internal.reflect.NativeMethodAccessorImpl.invoke0(Native Method)
	at java.base/jdk.internal.reflect.NativeMethodAccessorImpl.invoke(NativeMethodAccessorImpl.java:62)
	at java.base/jdk.internal.reflect.DelegatingMethodAccessorImpl.invoke(DelegatingMethodAccessorImpl.java:43)
	at java.base/java.lang.reflect.Method.invoke(Method.java:538)
	at com.carrotsearch.randomizedtesting.RandomizedRunner.invoke(RandomizedRunner.java:1713)
	at com.carrotsearch.randomizedtesting.RandomizedRunner$8.evaluate(RandomizedRunner.java:907)
	at com.carrotsearch.randomizedtesting.RandomizedRunner$9.evaluate(RandomizedRunner.java:943)
	at com.carrotsearch.randomizedtesting.RandomizedRunner$10.evaluate(RandomizedRunner.java:957)
	at org.apache.lucene.util.TestRuleSetupTeardownChained$1.evaluate(TestRuleSetupTeardownChained.java:49)
	at org.apache.lucene.util.AbstractBeforeAfterRule$1.evaluate(AbstractBeforeAfterRule.java:45)
	at org.apache.lucene.util.TestRuleThreadAndTestName$1.evaluate(TestRuleThreadAndTestName.java:48)
	at org.apache.lucene.util.TestRuleIgnoreAfterMaxFailures$1.evaluate(TestRuleIgnoreAfterMaxFailures.java:64)
	at org.apache.lucene.util.TestRuleMarkFailure$1.evaluate(TestRuleMarkFailure.java:47)
	at com.carrotsearch.randomizedtesting.rules.StatementAdapter.evaluate(StatementAdapter.java:36)
	at com.carrotsearch.randomizedtesting.ThreadLeakControl$StatementRunner.run(ThreadLeakControl.java:367)
	at com.carrotsearch.randomizedtesting.ThreadLeakControl.forkTimeoutingTask(ThreadLeakControl.java:811)
	at com.carrotsearch.randomizedtesting.ThreadLeakControl$3.evaluate(ThreadLeakControl.java:462)
	at com.carrotsearch.randomizedtesting.RandomizedRunner.runSingleTest(RandomizedRunner.java:916)
	at com.carrotsearch.randomizedtesting.RandomizedRunner$5.evaluate(RandomizedRunner.java:802)
	at com.carrotsearch.randomizedtesting.RandomizedRunner$6.evaluate(RandomizedRunner.java:852)
	at com.carrotsearch.randomizedtesting.RandomizedRunner$7.evaluate(RandomizedRunner.java:863)
	at org.apache.lucene.util.AbstractBeforeAfterRule$1.evaluate(AbstractBeforeAfterRule.java:45)
	at com.carrotsearch.randomizedtesting.rules.StatementAdapter.evaluate(StatementAdapter.java:36)
	at org.apache.lucene.util.TestRuleStoreClassName$1.evaluate(TestRuleStoreClassName.java:41)
	at com.carrotsearch.randomizedtesting.rules.NoShadowingOrOverridesOnMethodsRule$1.evaluate(NoShadowingOrOverridesOnMethodsRule.java:40)
	at com.carrotsearch.randomizedtesting.rules.NoShadowingOrOverridesOnMethodsRule$1.evaluate(NoShadowingOrOverridesOnMethodsRule.java:40)
	at com.carrotsearch.randomizedtesting.rules.StatementAdapter.evaluate(StatementAdapter.java:36)
	at com.carrotsearch.randomizedtesting.rules.StatementAdapter.evaluate(StatementAdapter.java:36)
	at org.apache.lucene.util.TestRuleAssertionsRequired$1.evaluate(TestRuleAssertionsRequired.java:53)
	at org.apache.lucene.util.TestRuleMarkFailure$1.evaluate(TestRuleMarkFailure.java:47)
	at org.apache.lucene.util.TestRuleIgnoreAfterMaxFailures$1.evaluate(TestRuleIgnoreAfterMaxFailures.java:64)
	at org.apache.lucene.util.TestRuleIgnoreTestSuites$1.evaluate(TestRuleIgnoreTestSuites.java:54)
	at com.carrotsearch.randomizedtesting.rules.StatementAdapter.evaluate(StatementAdapter.java:36)
	at com.carrotsearch.randomizedtesting.ThreadLeakControl$StatementRunner.run(ThreadLeakControl.java:367)
	at java.base/java.lang.Thread.run(Thread.java:844)


FAILED:  org.apache.lucene.codecs.lucene70.TestLucene70NormsFormat.testRamBytesUsed

Error Message:
Actual RAM usage 536, but got 7633, -1324.0671641791043% error

Stack Trace:
java.lang.AssertionError: Actual RAM usage 536, but got 7633, -1324.0671641791043% error
	at __randomizedtesting.SeedInfo.seed([720A1BFB7D11C350:80A909BBB76EDC06]:0)
	at org.junit.Assert.fail(Assert.java:93)
	at org.junit.Assert.assertTrue(Assert.java:43)
	at org.apache.lucene.index.BaseIndexFileFormatTestCase.testRamBytesUsed(BaseIndexFileFormatTestCase.java:279)
	at org.apache.lucene.index.BaseNormsFormatTestCase.testRamBytesUsed(BaseNormsFormatTestCase.java:52)
	at java.base/jdk.internal.reflect.NativeMethodAccessorImpl.invoke0(Native Method)
	at java.base/jdk.internal.reflect.NativeMethodAccessorImpl.invoke(NativeMethodAccessorImpl.java:62)
	at java.base/jdk.internal.reflect.DelegatingMethodAccessorImpl.invoke(DelegatingMethodAccessorImpl.java:43)
	at java.base/java.lang.reflect.Method.invoke(Method.java:538)
	at com.carrotsearch.randomizedtesting.RandomizedRunner.invoke(RandomizedRunner.java:1713)
	at com.carrotsearch.randomizedtesting.RandomizedRunner$8.evaluate(RandomizedRunner.java:907)
	at com.carrotsearch.randomizedtesting.RandomizedRunner$9.evaluate(RandomizedRunner.java:943)
	at com.carrotsearch.randomizedtesting.RandomizedRunner$10.evaluate(RandomizedRunner.java:957)
	at org.apache.lucene.util.TestRuleSetupTeardownChained$1.evaluate(TestRuleSetupTeardownChained.java:49)
	at org.apache.lucene.util.AbstractBeforeAfterRule$1.evaluate(AbstractBeforeAfterRule.java:45)
	at org.apache.lucene.util.TestRuleThreadAndTestName$1.evaluate(TestRuleThreadAndTestName.java:48)
	at org.apache.lucene.util.TestRuleIgnoreAfterMaxFailures$1.evaluate(TestRuleIgnoreAfterMaxFailures.java:64)
	at org.apache.lucene.util.TestRuleMarkFailure$1.evaluate(TestRuleMarkFailure.java:47)
	at com.carrotsearch.randomizedtesting.rules.StatementAdapter.evaluate(StatementAdapter.java:36)
	at com.carrotsearch.randomizedtesting.ThreadLeakControl$StatementRunner.run(ThreadLeakControl.java:367)
	at com.carrotsearch.randomizedtesting.ThreadLeakControl.forkTimeoutingTask(ThreadLeakControl.java:811)
	at com.carrotsearch.randomizedtesting.ThreadLeakControl$3.evaluate(ThreadLeakControl.java:462)
	at com.carrotsearch.randomizedtesting.RandomizedRunner.runSingleTest(RandomizedRunner.java:916)
	at com.carrotsearch.randomizedtesting.RandomizedRunner$5.evaluate(RandomizedRunner.java:802)
	at com.carrotsearch.randomizedtesting.RandomizedRunner$6.evaluate(RandomizedRunner.java:852)
	at com.carrotsearch.randomizedtesting.RandomizedRunner$7.evaluate(RandomizedRunner.java:863)
	at org.apache.lucene.util.AbstractBeforeAfterRule$1.evaluate(AbstractBeforeAfterRule.java:45)
	at com.carrotsearch.randomizedtesting.rules.StatementAdapter.evaluate(StatementAdapter.java:36)
	at org.apache.lucene.util.TestRuleStoreClassName$1.evaluate(TestRuleStoreClassName.java:41)
	at com.carrotsearch.randomizedtesting.rules.NoShadowingOrOverridesOnMethodsRule$1.evaluate(NoShadowingOrOverridesOnMethodsRule.java:40)
	at com.carrotsearch.randomizedtesting.rules.NoShadowingOrOverridesOnMethodsRule$1.evaluate(NoShadowingOrOverridesOnMethodsRule.java:40)
	at com.carrotsearch.randomizedtesting.rules.StatementAdapter.evaluate(StatementAdapter.java:36)
	at com.carrotsearch.randomizedtesting.rules.StatementAdapter.evaluate(StatementAdapter.java:36)
	at org.apache.lucene.util.TestRuleAssertionsRequired$1.evaluate(TestRuleAssertionsRequired.java:53)
	at org.apache.lucene.util.TestRuleMarkFailure$1.evaluate(TestRuleMarkFailure.java:47)
	at org.apache.lucene.util.TestRuleIgnoreAfterMaxFailures$1.evaluate(TestRuleIgnoreAfterMaxFailures.java:64)
	at org.apache.lucene.util.TestRuleIgnoreTestSuites$1.evaluate(TestRuleIgnoreTestSuites.java:54)
	at com.carrotsearch.randomizedtesting.rules.StatementAdapter.evaluate(StatementAdapter.java:36)
	at com.carrotsearch.randomizedtesting.ThreadLeakControl$StatementRunner.run(ThreadLeakControl.java:367)
	at java.base/java.lang.Thread.run(Thread.java:844)


FAILED:  org.apache.lucene.codecs.memory.TestDirectPostingsFormat.testRamBytesUsed

Error Message:
Actual RAM usage 376, but got 4942400, -1314368.0851063828% error

Stack Trace:
java.lang.AssertionError: Actual RAM usage 376, but got 4942400, -1314368.0851063828% error
	at __randomizedtesting.SeedInfo.seed([E7C8151E5DAC77AC:156B075E97D368FA]:0)
	at org.junit.Assert.fail(Assert.java:93)
	at org.junit.Assert.assertTrue(Assert.java:43)
	at org.apache.lucene.index.BaseIndexFileFormatTestCase.testRamBytesUsed(BaseIndexFileFormatTestCase.java:279)
	at org.apache.lucene.index.BasePostingsFormatTestCase.testRamBytesUsed(BasePostingsFormatTestCase.java:85)
	at java.base/jdk.internal.reflect.NativeMethodAccessorImpl.invoke0(Native Method)
	at java.base/jdk.internal.reflect.NativeMethodAccessorImpl.invoke(NativeMethodAccessorImpl.java:62)
	at java.base/jdk.internal.reflect.DelegatingMethodAccessorImpl.invoke(DelegatingMethodAccessorImpl.java:43)
	at java.base/java.lang.reflect.Method.invoke(Method.java:538)
	at com.carrotsearch.randomizedtesting.RandomizedRunner.invoke(RandomizedRunner.java:1713)
	at com.carrotsearch.randomizedtesting.RandomizedRunner$8.evaluate(RandomizedRunner.java:907)
	at com.carrotsearch.randomizedtesting.RandomizedRunner$9.evaluate(RandomizedRunner.java:943)
	at com.carrotsearch.randomizedtesting.RandomizedRunner$10.evaluate(RandomizedRunner.java:957)
	at org.apache.lucene.util.TestRuleSetupTeardownChained$1.evaluate(TestRuleSetupTeardownChained.java:49)
	at org.apache.lucene.util.AbstractBeforeAfterRule$1.evaluate(AbstractBeforeAfterRule.java:45)
	at org.apache.lucene.util.TestRuleThreadAndTestName$1.evaluate(TestRuleThreadAndTestName.java:48)
	at org.apache.lucene.util.TestRuleIgnoreAfterMaxFailures$1.evaluate(TestRuleIgnoreAfterMaxFailures.java:64)
	at org.apache.lucene.util.TestRuleMarkFailure$1.evaluate(TestRuleMarkFailure.java:47)
	at com.carrotsearch.randomizedtesting.rules.StatementAdapter.evaluate(StatementAdapter.java:36)
	at com.carrotsearch.randomizedtesting.ThreadLeakControl$StatementRunner.run(ThreadLeakControl.java:367)
	at com.carrotsearch.randomizedtesting.ThreadLeakControl.forkTimeoutingTask(ThreadLeakControl.java:811)
	at com.carrotsearch.randomizedtesting.ThreadLeakControl$3.evaluate(ThreadLeakControl.java:462)
	at com.carrotsearch.randomizedtesting.RandomizedRunner.runSingleTest(RandomizedRunner.java:916)
	at com.carrotsearch.randomizedtesting.RandomizedRunner$5.evaluate(RandomizedRunner.java:802)
	at com.carrotsearch.randomizedtesting.RandomizedRunner$6.evaluate(RandomizedRunner.java:852)
	at com.carrotsearch.randomizedtesting.RandomizedRunner$7.evaluate(RandomizedRunner.java:863)
	at org.apache.lucene.util.AbstractBeforeAfterRule$1.evaluate(AbstractBeforeAfterRule.java:45)
	at com.carrotsearch.randomizedtesting.rules.StatementAdapter.evaluate(StatementAdapter.java:36)
	at org.apache.lucene.util.TestRuleStoreClassName$1.evaluate(TestRuleStoreClassName.java:41)
	at com.carrotsearch.randomizedtesting.rules.NoShadowingOrOverridesOnMethodsRule$1.evaluate(NoShadowingOrOverridesOnMethodsRule.java:40)
	at com.carrotsearch.randomizedtesting.rules.NoShadowingOrOverridesOnMethodsRule$1.evaluate(NoShadowingOrOverridesOnMethodsRule.java:40)
	at com.carrotsearch.randomizedtesting.rules.StatementAdapter.evaluate(StatementAdapter.java:36)
	at com.carrotsearch.randomizedtesting.rules.StatementAdapter.evaluate(StatementAdapter.java:36)
	at org.apache.lucene.util.TestRuleAssertionsRequired$1.evaluate(TestRuleAssertionsRequired.java:53)
	at org.apache.lucene.util.TestRuleMarkFailure$1.evaluate(TestRuleMarkFailure.java:47)
	at org.apache.lucene.util.TestRuleIgnoreAfterMaxFailures$1.evaluate(TestRuleIgnoreAfterMaxFailures.java:64)
	at org.apache.lucene.util.TestRuleIgnoreTestSuites$1.evaluate(TestRuleIgnoreTestSuites.java:54)
	at com.carrotsearch.randomizedtesting.rules.StatementAdapter.evaluate(StatementAdapter.java:36)
	at com.carrotsearch.randomizedtesting.ThreadLeakControl$StatementRunner.run(ThreadLeakControl.java:367)
	at java.base/java.lang.Thread.run(Thread.java:844)


FAILED:  org.apache.lucene.codecs.memory.TestFSTOrdPostingsFormat.testRamBytesUsed

Error Message:
Actual RAM usage 376, but got 21300, -5564.893617021276% error

Stack Trace:
java.lang.AssertionError: Actual RAM usage 376, but got 21300, -5564.893617021276% error
	at __randomizedtesting.SeedInfo.seed([E7C8151E5DAC77AC:156B075E97D368FA]:0)
	at org.junit.Assert.fail(Assert.java:93)
	at org.junit.Assert.assertTrue(Assert.java:43)
	at org.apache.lucene.index.BaseIndexFileFormatTestCase.testRamBytesUsed(BaseIndexFileFormatTestCase.java:279)
	at org.apache.lucene.index.BasePostingsFormatTestCase.testRamBytesUsed(BasePostingsFormatTestCase.java:85)
	at java.base/jdk.internal.reflect.NativeMethodAccessorImpl.invoke0(Native Method)
	at java.base/jdk.internal.reflect.NativeMethodAccessorImpl.invoke(NativeMethodAccessorImpl.java:62)
	at java.base/jdk.internal.reflect.DelegatingMethodAccessorImpl.invoke(DelegatingMethodAccessorImpl.java:43)
	at java.base/java.lang.reflect.Method.invoke(Method.java:538)
	at com.carrotsearch.randomizedtesting.RandomizedRunner.invoke(RandomizedRunner.java:1713)
	at com.carrotsearch.randomizedtesting.RandomizedRunner$8.evaluate(RandomizedRunner.java:907)
	at com.carrotsearch.randomizedtesting.RandomizedRunner$9.evaluate(RandomizedRunner.java:943)
	at com.carrotsearch.randomizedtesting.RandomizedRunner$10.evaluate(RandomizedRunner.java:957)
	at org.apache.lucene.util.TestRuleSetupTeardownChained$1.evaluate(TestRuleSetupTeardownChained.java:49)
	at org.apache.lucene.util.AbstractBeforeAfterRule$1.evaluate(AbstractBeforeAfterRule.java:45)
	at org.apache.lucene.util.TestRuleThreadAndTestName$1.evaluate(TestRuleThreadAndTestName.java:48)
	at org.apache.lucene.util.TestRuleIgnoreAfterMaxFailures$1.evaluate(TestRuleIgnoreAfterMaxFailures.java:64)
	at org.apache.lucene.util.TestRuleMarkFailure$1.evaluate(TestRuleMarkFailure.java:47)
	at com.carrotsearch.randomizedtesting.rules.StatementAdapter.evaluate(StatementAdapter.java:36)
	at com.carrotsearch.randomizedtesting.ThreadLeakControl$StatementRunner.run(ThreadLeakControl.java:367)
	at com.carrotsearch.randomizedtesting.ThreadLeakControl.forkTimeoutingTask(ThreadLeakControl.java:811)
	at com.carrotsearch.randomizedtesting.ThreadLeakControl$3.evaluate(ThreadLeakControl.java:462)
	at com.carrotsearch.randomizedtesting.RandomizedRunner.runSingleTest(RandomizedRunner.java:916)
	at com.carrotsearch.randomizedtesting.RandomizedRunner$5.evaluate(RandomizedRunner.java:802)
	at com.carrotsearch.randomizedtesting.RandomizedRunner$6.evaluate(RandomizedRunner.java:852)
	at com.carrotsearch.randomizedtesting.RandomizedRunner$7.evaluate(RandomizedRunner.java:863)
	at org.apache.lucene.util.AbstractBeforeAfterRule$1.evaluate(AbstractBeforeAfterRule.java:45)
	at com.carrotsearch.randomizedtesting.rules.StatementAdapter.evaluate(StatementAdapter.java:36)
	at org.apache.lucene.util.TestRuleStoreClassName$1.evaluate(TestRuleStoreClassName.java:41)
	at com.carrotsearch.randomizedtesting.rules.NoShadowingOrOverridesOnMethodsRule$1.evaluate(NoShadowingOrOverridesOnMethodsRule.java:40)
	at com.carrotsearch.randomizedtesting.rules.NoShadowingOrOverridesOnMethodsRule$1.evaluate(NoShadowingOrOverridesOnMethodsRule.java:40)
	at com.carrotsearch.randomizedtesting.rules.StatementAdapter.evaluate(StatementAdapter.java:36)
	at com.carrotsearch.randomizedtesting.rules.StatementAdapter.evaluate(StatementAdapter.java:36)
	at org.apache.lucene.util.TestRuleAssertionsRequired$1.evaluate(TestRuleAssertionsRequired.java:53)
	at org.apache.lucene.util.TestRuleMarkFailure$1.evaluate(TestRuleMarkFailure.java:47)
	at org.apache.lucene.util.TestRuleIgnoreAfterMaxFailures$1.evaluate(TestRuleIgnoreAfterMaxFailures.java:64)
	at org.apache.lucene.util.TestRuleIgnoreTestSuites$1.evaluate(TestRuleIgnoreTestSuites.java:54)
	at com.carrotsearch.randomizedtesting.rules.StatementAdapter.evaluate(StatementAdapter.java:36)
	at com.carrotsearch.randomizedtesting.ThreadLeakControl$StatementRunner.run(ThreadLeakControl.java:367)
	at java.base/java.lang.Thread.run(Thread.java:844)


FAILED:  org.apache.lucene.codecs.memory.TestFSTPostingsFormat.testRamBytesUsed

Error Message:
Actual RAM usage 376, but got 20857, -5447.074468085107% error

Stack Trace:
java.lang.AssertionError: Actual RAM usage 376, but got 20857, -5447.074468085107% error
	at __randomizedtesting.SeedInfo.seed([E7C8151E5DAC77AC:156B075E97D368FA]:0)
	at org.junit.Assert.fail(Assert.java:93)
	at org.junit.Assert.assertTrue(Assert.java:43)
	at org.apache.lucene.index.BaseIndexFileFormatTestCase.testRamBytesUsed(BaseIndexFileFormatTestCase.java:279)
	at org.apache.lucene.index.BasePostingsFormatTestCase.testRamBytesUsed(BasePostingsFormatTestCase.java:85)
	at java.base/jdk.internal.reflect.NativeMethodAccessorImpl.invoke0(Native Method)
	at java.base/jdk.internal.reflect.NativeMethodAccessorImpl.invoke(NativeMethodAccessorImpl.java:62)
	at java.base/jdk.internal.reflect.DelegatingMethodAccessorImpl.invoke(DelegatingMethodAccessorImpl.java:43)
	at java.base/java.lang.reflect.Method.invoke(Method.java:538)
	at com.carrotsearch.randomizedtesting.RandomizedRunner.invoke(RandomizedRunner.java:1713)
	at com.carrotsearch.randomizedtesting.RandomizedRunner$8.evaluate(RandomizedRunner.java:907)
	at com.carrotsearch.randomizedtesting.RandomizedRunner$9.evaluate(RandomizedRunner.java:943)
	at com.carrotsearch.randomizedtesting.RandomizedRunner$10.evaluate(RandomizedRunner.java:957)
	at org.apache.lucene.util.TestRuleSetupTeardownChained$1.evaluate(TestRuleSetupTeardownChained.java:49)
	at org.apache.lucene.util.AbstractBeforeAfterRule$1.evaluate(AbstractBeforeAfterRule.java:45)
	at org.apache.lucene.util.TestRuleThreadAndTestName$1.evaluate(TestRuleThreadAndTestName.java:48)
	at org.apache.lucene.util.TestRuleIgnoreAfterMaxFailures$1.evaluate(TestRuleIgnoreAfterMaxFailures.java:64)
	at org.apache.lucene.util.TestRuleMarkFailure$1.evaluate(TestRuleMarkFailure.java:47)
	at com.carrotsearch.randomizedtesting.rules.StatementAdapter.evaluate(StatementAdapter.java:36)
	at com.carrotsearch.randomizedtesting.ThreadLeakControl$StatementRunner.run(ThreadLeakControl.java:367)
	at com.carrotsearch.randomizedtesting.ThreadLeakControl.forkTimeoutingTask(ThreadLeakControl.java:811)
	at com.carrotsearch.randomizedtesting.ThreadLeakControl$3.evaluate(ThreadLeakControl.java:462)
	at com.carrotsearch.randomizedtesting.RandomizedRunner.runSingleTest(RandomizedRunner.java:916)
	at com.carrotsearch.randomizedtesting.RandomizedRunner$5.evaluate(RandomizedRunner.java:802)
	at com.carrotsearch.randomizedtesting.RandomizedRunner$6.evaluate(RandomizedRunner.java:852)
	at com.carrotsearch.randomizedtesting.RandomizedRunner$7.evaluate(RandomizedRunner.java:863)
	at org.apache.lucene.util.AbstractBeforeAfterRule$1.evaluate(AbstractBeforeAfterRule.java:45)
	at com.carrotsearch.randomizedtesting.rules.StatementAdapter.evaluate(StatementAdapter.java:36)
	at org.apache.lucene.util.TestRuleStoreClassName$1.evaluate(TestRuleStoreClassName.java:41)
	at com.carrotsearch.randomizedtesting.rules.NoShadowingOrOverridesOnMethodsRule$1.evaluate(NoShadowingOrOverridesOnMethodsRule.java:40)
	at com.carrotsearch.randomizedtesting.rules.NoShadowingOrOverridesOnMethodsRule$1.evaluate(NoShadowingOrOverridesOnMethodsRule.java:40)
	at com.carrotsearch.randomizedtesting.rules.StatementAdapter.evaluate(StatementAdapter.java:36)
	at com.carrotsearch.randomizedtesting.rules.StatementAdapter.evaluate(StatementAdapter.java:36)
	at org.apache.lucene.util.TestRuleAssertionsRequired$1.evaluate(TestRuleAssertionsRequired.java:53)
	at org.apache.lucene.util.TestRuleMarkFailure$1.evaluate(TestRuleMarkFailure.java:47)
	at org.apache.lucene.util.TestRuleIgnoreAfterMaxFailures$1.evaluate(TestRuleIgnoreAfterMaxFailures.java:64)
	at org.apache.lucene.util.TestRuleIgnoreTestSuites$1.evaluate(TestRuleIgnoreTestSuites.java:54)
	at com.carrotsearch.randomizedtesting.rules.StatementAdapter.evaluate(StatementAdapter.java:36)
	at com.carrotsearch.randomizedtesting.ThreadLeakControl$StatementRunner.run(ThreadLeakControl.java:367)
	at java.base/java.lang.Thread.run(Thread.java:844)


FAILED:  org.apache.lucene.codecs.memory.TestMemoryPostingsFormat.testRamBytesUsed

Error Message:
Actual RAM usage 376, but got 602473, -160132.1808510638% error

Stack Trace:
java.lang.AssertionError: Actual RAM usage 376, but got 602473, -160132.1808510638% error
	at __randomizedtesting.SeedInfo.seed([E7C8151E5DAC77AC:156B075E97D368FA]:0)
	at org.junit.Assert.fail(Assert.java:93)
	at org.junit.Assert.assertTrue(Assert.java:43)
	at org.apache.lucene.index.BaseIndexFileFormatTestCase.testRamBytesUsed(BaseIndexFileFormatTestCase.java:279)
	at org.apache.lucene.index.BasePostingsFormatTestCase.testRamBytesUsed(BasePostingsFormatTestCase.java:85)
	at java.base/jdk.internal.reflect.NativeMethodAccessorImpl.invoke0(Native Method)
	at java.base/jdk.internal.reflect.NativeMethodAccessorImpl.invoke(NativeMethodAccessorImpl.java:62)
	at java.base/jdk.internal.reflect.DelegatingMethodAccessorImpl.invoke(DelegatingMethodAccessorImpl.java:43)
	at java.base/java.lang.reflect.Method.invoke(Method.java:538)
	at com.carrotsearch.randomizedtesting.RandomizedRunner.invoke(RandomizedRunner.java:1713)
	at com.carrotsearch.randomizedtesting.RandomizedRunner$8.evaluate(RandomizedRunner.java:907)
	at com.carrotsearch.randomizedtesting.RandomizedRunner$9.evaluate(RandomizedRunner.java:943)
	at com.carrotsearch.randomizedtesting.RandomizedRunner$10.evaluate(RandomizedRunner.java:957)
	at org.apache.lucene.util.TestRuleSetupTeardownChained$1.evaluate(TestRuleSetupTeardownChained.java:49)
	at org.apache.lucene.util.AbstractBeforeAfterRule$1.evaluate(AbstractBeforeAfterRule.java:45)
	at org.apache.lucene.util.TestRuleThreadAndTestName$1.evaluate(TestRuleThreadAndTestName.java:48)
	at org.apache.lucene.util.TestRuleIgnoreAfterMaxFailures$1.evaluate(TestRuleIgnoreAfterMaxFailures.java:64)
	at org.apache.lucene.util.TestRuleMarkFailure$1.evaluate(TestRuleMarkFailure.java:47)
	at com.carrotsearch.randomizedtesting.rules.StatementAdapter.evaluate(StatementAdapter.java:36)
	at com.carrotsearch.randomizedtesting.ThreadLeakControl$StatementRunner.run(ThreadLeakControl.java:367)
	at com.carrotsearch.randomizedtesting.ThreadLeakControl.forkTimeoutingTask(ThreadLeakControl.java:811)
	at com.carrotsearch.randomizedtesting.ThreadLeakControl$3.evaluate(ThreadLeakControl.java:462)
	at com.carrotsearch.randomizedtesting.RandomizedRunner.runSingleTest(RandomizedRunner.java:916)
	at com.carrotsearch.randomizedtesting.RandomizedRunner$5.evaluate(RandomizedRunner.java:802)
	at com.carrotsearch.randomizedtesting.RandomizedRunner$6.evaluate(RandomizedRunner.java:852)
	at com.carrotsearch.randomizedtesting.RandomizedRunner$7.evaluate(RandomizedRunner.java:863)
	at org.apache.lucene.util.AbstractBeforeAfterRule$1.evaluate(AbstractBeforeAfterRule.java:45)
	at com.carrotsearch.randomizedtesting.rules.StatementAdapter.evaluate(StatementAdapter.java:36)
	at org.apache.lucene.util.TestRuleStoreClassName$1.evaluate(TestRuleStoreClassName.java:41)
	at com.carrotsearch.randomizedtesting.rules.NoShadowingOrOverridesOnMethodsRule$1.evaluate(NoShadowingOrOverridesOnMethodsRule.java:40)
	at com.carrotsearch.randomizedtesting.rules.NoShadowingOrOverridesOnMethodsRule$1.evaluate(NoShadowingOrOverridesOnMethodsRule.java:40)
	at com.carrotsearch.randomizedtesting.rules.StatementAdapter.evaluate(StatementAdapter.java:36)
	at com.carrotsearch.randomizedtesting.rules.StatementAdapter.evaluate(StatementAdapter.java:36)
	at org.apache.lucene.util.TestRuleAssertionsRequired$1.evaluate(TestRuleAssertionsRequired.java:53)
	at org.apache.lucene.util.TestRuleMarkFailure$1.evaluate(TestRuleMarkFailure.java:47)
	at org.apache.lucene.util.TestRuleIgnoreAfterMaxFailures$1.evaluate(TestRuleIgnoreAfterMaxFailures.java:64)
	at org.apache.lucene.util.TestRuleIgnoreTestSuites$1.evaluate(TestRuleIgnoreTestSuites.java:54)
	at com.carrotsearch.randomizedtesting.rules.StatementAdapter.evaluate(StatementAdapter.java:36)
	at com.carrotsearch.randomizedtesting.ThreadLeakControl$StatementRunner.run(ThreadLeakControl.java:367)
	at java.base/java.lang.Thread.run(Thread.java:844)


FAILED:  org.apache.lucene.codecs.simpletext.TestSimpleTextNormsFormat.testRamBytesUsed

Error Message:
Actual RAM usage 315904, but got 693304, -119.4666734197731% error

Stack Trace:
java.lang.AssertionError: Actual RAM usage 315904, but got 693304, -119.4666734197731% error
	at __randomizedtesting.SeedInfo.seed([E7C8151E5DAC77AC:156B075E97D368FA]:0)
	at org.junit.Assert.fail(Assert.java:93)
	at org.junit.Assert.assertTrue(Assert.java:43)
	at org.apache.lucene.index.BaseIndexFileFormatTestCase.testRamBytesUsed(BaseIndexFileFormatTestCase.java:279)
	at org.apache.lucene.index.BaseNormsFormatTestCase.testRamBytesUsed(BaseNormsFormatTestCase.java:52)
	at java.base/jdk.internal.reflect.NativeMethodAccessorImpl.invoke0(Native Method)
	at java.base/jdk.internal.reflect.NativeMethodAccessorImpl.invoke(NativeMethodAccessorImpl.java:62)
	at java.base/jdk.internal.reflect.DelegatingMethodAccessorImpl.invoke(DelegatingMethodAccessorImpl.java:43)
	at java.base/java.lang.reflect.Method.invoke(Method.java:538)
	at com.carrotsearch.randomizedtesting.RandomizedRunner.invoke(RandomizedRunner.java:1713)
	at com.carrotsearch.randomizedtesting.RandomizedRunner$8.evaluate(RandomizedRunner.java:907)
	at com.carrotsearch.randomizedtesting.RandomizedRunner$9.evaluate(RandomizedRunner.java:943)
	at com.carrotsearch.randomizedtesting.RandomizedRunner$10.evaluate(RandomizedRunner.java:957)
	at org.apache.lucene.util.TestRuleSetupTeardownChained$1.evaluate(TestRuleSetupTeardownChained.java:49)
	at org.apache.lucene.util.AbstractBeforeAfterRule$1.evaluate(AbstractBeforeAfterRule.java:45)
	at org.apache.lucene.util.TestRuleThreadAndTestName$1.evaluate(TestRuleThreadAndTestName.java:48)
	at org.apache.lucene.util.TestRuleIgnoreAfterMaxFailures$1.evaluate(TestRuleIgnoreAfterMaxFailures.java:64)
	at org.apache.lucene.util.TestRuleMarkFailure$1.evaluate(TestRuleMarkFailure.java:47)
	at com.carrotsearch.randomizedtesting.rules.StatementAdapter.evaluate(StatementAdapter.java:36)
	at com.carrotsearch.randomizedtesting.ThreadLeakControl$StatementRunner.run(ThreadLeakControl.java:367)
	at com.carrotsearch.randomizedtesting.ThreadLeakControl.forkTimeoutingTask(ThreadLeakControl.java:811)
	at com.carrotsearch.randomizedtesting.ThreadLeakControl$3.evaluate(ThreadLeakControl.java:462)
	at com.carrotsearch.randomizedtesting.RandomizedRunner.runSingleTest(RandomizedRunner.java:916)
	at com.carrotsearch.randomizedtesting.RandomizedRunner$5.evaluate(RandomizedRunner.java:802)
	at com.carrotsearch.randomizedtesting.RandomizedRunner$6.evaluate(RandomizedRunner.java:852)
	at com.carrotsearch.randomizedtesting.RandomizedRunner$7.evaluate(RandomizedRunner.java:863)
	at org.apache.lucene.util.AbstractBeforeAfterRule$1.evaluate(AbstractBeforeAfterRule.java:45)
	at com.carrotsearch.randomizedtesting.rules.StatementAdapter.evaluate(StatementAdapter.java:36)
	at org.apache.lucene.util.TestRuleStoreClassName$1.evaluate(TestRuleStoreClassName.java:41)
	at com.carrotsearch.randomizedtesting.rules.NoShadowingOrOverridesOnMethodsRule$1.evaluate(NoShadowingOrOverridesOnMethodsRule.java:40)
	at com.carrotsearch.randomizedtesting.rules.NoShadowingOrOverridesOnMethodsRule$1.evaluate(NoShadowingOrOverridesOnMethodsRule.java:40)
	at com.carrotsearch.randomizedtesting.rules.StatementAdapter.evaluate(StatementAdapter.java:36)
	at com.carrotsearch.randomizedtesting.rules.StatementAdapter.evaluate(StatementAdapter.java:36)
	at org.apache.lucene.util.TestRuleAssertionsRequired$1.evaluate(TestRuleAssertionsRequired.java:53)
	at org.apache.lucene.util.TestRuleMarkFailure$1.evaluate(TestRuleMarkFailure.java:47)
	at org.apache.lucene.util.TestRuleIgnoreAfterMaxFailures$1.evaluate(TestRuleIgnoreAfterMaxFailures.java:64)
	at org.apache.lucene.util.TestRuleIgnoreTestSuites$1.evaluate(TestRuleIgnoreTestSuites.java:54)
	at com.carrotsearch.randomizedtesting.rules.StatementAdapter.evaluate(StatementAdapter.java:36)
	at com.carrotsearch.randomizedtesting.ThreadLeakControl$StatementRunner.run(ThreadLeakControl.java:367)
	at java.base/java.lang.Thread.run(Thread.java:844)




Build Log:
[...truncated 458 lines...]
   [junit4] Suite: org.apache.lucene.codecs.lucene70.TestLucene70NormsFormat
   [junit4] IGNOR/A 0.00s J0 | TestLucene70NormsFormat.testSparseNCommonBig
   [junit4]    > Assumption #1: 'nightly' test group is disabled (@Nightly())
   [junit4] IGNOR/A 0.00s J0 | TestLucene70NormsFormat.testNCommonBig
   [junit4]    > Assumption #1: 'nightly' test group is disabled (@Nightly())
   [junit4] IGNOR/A 0.00s J0 | TestLucene70NormsFormat.testMergeStability
   [junit4]    > Assumption #1: The MockRandom PF randomizes content on the fly, so we can't check it
   [junit4]   2> NOTE: reproduce with: ant test  -Dtestcase=TestLucene70NormsFormat -Dtests.method=testRamBytesUsed -Dtests.seed=720A1BFB7D11C350 -Dtests.multiplier=3 -Dtests.slow=true -Dtests.locale=fr-RE -Dtests.timezone=America/Maceio -Dtests.asserts=true -Dtests.file.encoding=US-ASCII
   [junit4] FAILURE 0.29s J0 | TestLucene70NormsFormat.testRamBytesUsed <<<
   [junit4]    > Throwable #1: java.lang.AssertionError: Actual RAM usage 536, but got 7633, -1324.0671641791043% error
   [junit4]    > 	at __randomizedtesting.SeedInfo.seed([720A1BFB7D11C350:80A909BBB76EDC06]:0)
   [junit4]    > 	at org.apache.lucene.index.BaseIndexFileFormatTestCase.testRamBytesUsed(BaseIndexFileFormatTestCase.java:279)
   [junit4]    > 	at org.apache.lucene.index.BaseNormsFormatTestCase.testRamBytesUsed(BaseNormsFormatTestCase.java:52)
   [junit4]    > 	at java.base/jdk.internal.reflect.NativeMethodAccessorImpl.invoke0(Native Method)
   [junit4]    > 	at java.base/jdk.internal.reflect.NativeMethodAccessorImpl.invoke(NativeMethodAccessorImpl.java:62)
   [junit4]    > 	at java.base/jdk.internal.reflect.DelegatingMethodAccessorImpl.invoke(DelegatingMethodAccessorImpl.java:43)
   [junit4]    > 	at java.base/java.lang.reflect.Method.invoke(Method.java:538)
   [junit4]    > 	at java.base/java.lang.Thread.run(Thread.java:844)
   [junit4]   2> NOTE: leaving temporary files on disk at: /home/jenkins/workspace/Lucene-Solr-master-Linux/lucene/build/core/test/J0/temp/lucene.codecs.lucene70.TestLucene70NormsFormat_720A1BFB7D11C350-001
   [junit4]   2> NOTE: test params are: codec=Asserting(Lucene70): {}, docValues:{}, maxPointsInLeafNode=1985, maxMBSortInHeap=7.266663988835056, sim=RandomSimilarity(queryNorm=false): {foobar=DFR I(ne)B2, content=DFR I(ne)B3(800.0)}, locale=fr-RE, timezone=America/Maceio
   [junit4]   2> NOTE: Linux 4.4.0-53-generic amd64/Oracle Corporation 9-ea (64-bit)/cpus=12,threads=1,free=440101904,total=527433728
   [junit4]   2> NOTE: All tests run in this JVM: [LimitedFiniteStringsIteratorTest, TestMaxPosition, TestCustomSearcherSort, TestSimilarityBase, TestTopFieldCollector, TestSizeBoundedForceMerge, TestSegmentReader, TestNumericDocValuesUpdates, TestBufferedIndexInput, Test2BPoints, TestDelegatingAnalyzerWrapper, TestDirectory, TestSimpleAttributeImpl, TestIndexWriterOnDiskFull, TestNGramPhraseQuery, TestRecyclingByteBlockAllocator, TestSloppyPhraseQuery2, TestFilterSpans, TestRegExp, TestCrash, TestMmapDirectory, TestSimilarityProvider, TestPersistentSnapshotDeletionPolicy, TestTermScorer, TestConcurrentMergeScheduler, TestCharFilter, TestBinaryDocument, TestDuelingCodecsAtNight, TestMSBRadixSorter, TestDoc, TestLucene70NormsFormat]
   [junit4] Completed [53/440 (1!)] on J0 in 20.34s, 29 tests, 1 failure, 3 skipped <<< FAILURES!

[...truncated 1570 lines...]
   [junit4] Suite: org.apache.lucene.codecs.asserting.TestAssertingNormsFormat
   [junit4] IGNOR/A 0.01s J0 | TestAssertingNormsFormat.testNCommonBig
   [junit4]    > Assumption #1: 'nightly' test group is disabled (@Nightly())
   [junit4] IGNOR/A 0.01s J0 | TestAssertingNormsFormat.testMergeStability
   [junit4]    > Assumption #1: The MockRandom PF randomizes content on the fly, so we can't check it
   [junit4] IGNOR/A 0.00s J0 | TestAssertingNormsFormat.testSparseNCommonBig
   [junit4]    > Assumption #1: 'nightly' test group is disabled (@Nightly())
   [junit4]   2> NOTE: reproduce with: ant test  -Dtestcase=TestAssertingNormsFormat -Dtests.method=testRamBytesUsed -Dtests.seed=BB53F54EB1E051FB -Dtests.multiplier=3 -Dtests.slow=true -Dtests.locale=es-VE -Dtests.timezone=Asia/Muscat -Dtests.asserts=true -Dtests.file.encoding=UTF-8
   [junit4] FAILURE 0.79s J0 | TestAssertingNormsFormat.testRamBytesUsed <<<
   [junit4]    > Throwable #1: java.lang.AssertionError: Actual RAM usage 384, but got 7433, -1835.6770833333333% error
   [junit4]    > 	at __randomizedtesting.SeedInfo.seed([BB53F54EB1E051FB:49F0E70E7B9F4EAD]:0)
   [junit4]    > 	at org.apache.lucene.index.BaseIndexFileFormatTestCase.testRamBytesUsed(BaseIndexFileFormatTestCase.java:279)
   [junit4]    > 	at org.apache.lucene.index.BaseNormsFormatTestCase.testRamBytesUsed(BaseNormsFormatTestCase.java:52)
   [junit4]    > 	at java.base/jdk.internal.reflect.NativeMethodAccessorImpl.invoke0(Native Method)
   [junit4]    > 	at java.base/jdk.internal.reflect.NativeMethodAccessorImpl.invoke(NativeMethodAccessorImpl.java:62)
   [junit4]    > 	at java.base/jdk.internal.reflect.DelegatingMethodAccessorImpl.invoke(DelegatingMethodAccessorImpl.java:43)
   [junit4]    > 	at java.base/java.lang.reflect.Method.invoke(Method.java:538)
   [junit4]    > 	at java.base/java.lang.Thread.run(Thread.java:844)
   [junit4]   2> NOTE: leaving temporary files on disk at: /home/jenkins/workspace/Lucene-Solr-master-Linux/lucene/build/test-framework/test/J0/temp/lucene.codecs.asserting.TestAssertingNormsFormat_BB53F54EB1E051FB-001
   [junit4]   2> NOTE: test params are: codec=FastCompressingStoredFields(storedFieldsFormat=CompressingStoredFieldsFormat(compressionMode=FAST, chunkSize=7, maxDocsPerChunk=807, blockSize=103), termVectorsFormat=CompressingTermVectorsFormat(compressionMode=FAST, chunkSize=7, blockSize=103)), sim=RandomSimilarity(queryNorm=true): {foobar=DFR GB3(800.0), content=DFR I(n)2}, locale=es-VE, timezone=Asia/Muscat
   [junit4]   2> NOTE: Linux 4.4.0-53-generic amd64/Oracle Corporation 9-ea (64-bit)/cpus=12,threads=1,free=384960008,total=525860864
   [junit4]   2> NOTE: All tests run in this JVM: [TestWorstCaseTestBehavior, TestForceMergePolicy, TestMockSynonymFilter, TestAssertingNormsFormat]
   [junit4] Completed [14/42 (1!)] on J0 in 27.70s, 29 tests, 1 failure, 3 skipped <<< FAILURES!

[...truncated 2535 lines...]
   [junit4] Suite: org.apache.lucene.codecs.lucene53.TestLucene53NormsFormat
   [junit4] IGNOR/A 0.01s J1 | TestLucene53NormsFormat.testFewSparseLargeValues
   [junit4]    > Assumption #1: Requires sparse norms support
   [junit4] IGNOR/A 0.00s J1 | TestLucene53NormsFormat.testSparseNCommonBig
   [junit4]    > Assumption #1: 'nightly' test group is disabled (@Nightly())
   [junit4] IGNOR/A 0.00s J1 | TestLucene53NormsFormat.testSparseLongRange
   [junit4]    > Assumption #1: Requires sparse norms support
   [junit4] IGNOR/A 0.00s J1 | TestLucene53NormsFormat.testSparseAllZeros
   [junit4]    > Assumption #1: Requires sparse norms support
   [junit4] IGNOR/A 0.00s J1 | TestLucene53NormsFormat.testNCommonBig
   [junit4]    > Assumption #1: 'nightly' test group is disabled (@Nightly())
   [junit4] IGNOR/A 0.00s J1 | TestLucene53NormsFormat.testFewSparseValues
   [junit4]    > Assumption #1: Requires sparse norms support
   [junit4] IGNOR/A 0.00s J1 | TestLucene53NormsFormat.testMergeStability
   [junit4]    > Assumption #1: The MockRandom PF randomizes content on the fly, so we can't check it
   [junit4] IGNOR/A 0.00s J1 | TestLucene53NormsFormat.testSparseFullLongRange
   [junit4]    > Assumption #1: Requires sparse norms support
   [junit4] IGNOR/A 0.00s J1 | TestLucene53NormsFormat.testSparseOutliers
   [junit4]    > Assumption #1: Requires sparse norms support
   [junit4] IGNOR/A 0.00s J1 | TestLucene53NormsFormat.testSparseOutliers2
   [junit4]    > Assumption #1: Requires sparse norms support
   [junit4] IGNOR/A 0.00s J1 | TestLucene53NormsFormat.testSparseShortRange
   [junit4]    > Assumption #1: Requires sparse norms support
   [junit4] IGNOR/A 0.00s J1 | TestLucene53NormsFormat.testSparseNCommon
   [junit4]    > Assumption #1: Requires sparse norms support
   [junit4]   2> NOTE: reproduce with: ant test  -Dtestcase=TestLucene53NormsFormat -Dtests.method=testRamBytesUsed -Dtests.seed=FF5AFD76875915D -Dtests.multiplier=3 -Dtests.slow=true -Dtests.locale=wae-CH -Dtests.timezone=America/Santarem -Dtests.asserts=true -Dtests.file.encoding=UTF-8
   [junit4] FAILURE 0.88s J1 | TestLucene53NormsFormat.testRamBytesUsed <<<
   [junit4]    > Throwable #1: java.lang.AssertionError: Actual RAM usage 256, but got 5463, -2033.984375% error
   [junit4]    > 	at __randomizedtesting.SeedInfo.seed([FF5AFD76875915D:FD56BD97A20A8E0B]:0)
   [junit4]    > 	at org.apache.lucene.index.BaseIndexFileFormatTestCase.testRamBytesUsed(BaseIndexFileFormatTestCase.java:279)
   [junit4]    > 	at org.apache.lucene.index.BaseNormsFormatTestCase.testRamBytesUsed(BaseNormsFormatTestCase.java:52)
   [junit4]    > 	at java.base/jdk.internal.reflect.NativeMethodAccessorImpl.invoke0(Native Method)
   [junit4]    > 	at java.base/jdk.internal.reflect.NativeMethodAccessorImpl.invoke(NativeMethodAccessorImpl.java:62)
   [junit4]    > 	at java.base/jdk.internal.reflect.DelegatingMethodAccessorImpl.invoke(DelegatingMethodAccessorImpl.java:43)
   [junit4]    > 	at java.base/java.lang.reflect.Method.invoke(Method.java:538)
   [junit4]    > 	at java.base/java.lang.Thread.run(Thread.java:844)
   [junit4] IGNOR/A 0.01s J1 | TestLucene53NormsFormat.testSparseByteRange
   [junit4]    > Assumption #1: Requires sparse norms support
   [junit4]   2> NOTE: leaving temporary files on disk at: /home/jenkins/workspace/Lucene-Solr-master-Linux/lucene/build/backward-codecs/test/J1/temp/lucene.codecs.lucene53.TestLucene53NormsFormat_FF5AFD76875915D-001
   [junit4]   2> NOTE: test params are: codec=FastDecompressionCompressingStoredFields(storedFieldsFormat=CompressingStoredFieldsFormat(compressionMode=FAST_DECOMPRESSION, chunkSize=18139, maxDocsPerChunk=3, blockSize=95), termVectorsFormat=CompressingTermVectorsFormat(compressionMode=FAST_DECOMPRESSION, chunkSize=18139, blockSize=95)), sim=RandomSimilarity(queryNorm=true): {foobar=DFR I(F)L2, content=DFI(ChiSquared)}, locale=wae-CH, timezone=America/Santarem
   [junit4]   2> NOTE: Linux 4.4.0-53-generic amd64/Oracle Corporation 9-ea (64-bit)/cpus=12,threads=1,free=376458136,total=521666560
   [junit4]   2> NOTE: All tests run in this JVM: [TestLegacyTerms, TestLegacyField, TestLucene53NormsFormat]
   [junit4] Completed [7/13 (1!)] on J1 in 11.91s, 29 tests, 1 failure, 13 skipped <<< FAILURES!

[...truncated 1722 lines...]
   [junit4] Suite: org.apache.lucene.codecs.blocktreeords.TestOrdsBlockTree
   [junit4]   2> NOTE: reproduce with: ant test  -Dtestcase=TestOrdsBlockTree -Dtests.method=testRamBytesUsed -Dtests.seed=E7C8151E5DAC77AC -Dtests.multiplier=3 -Dtests.slow=true -Dtests.locale=os-GE -Dtests.timezone=America/Los_Angeles -Dtests.asserts=true -Dtests.file.encoding=US-ASCII
   [junit4] FAILURE 0.81s J2 | TestOrdsBlockTree.testRamBytesUsed <<<
   [junit4]    > Throwable #1: java.lang.AssertionError: Actual RAM usage 376, but got 2063, -448.67021276595744% error
   [junit4]    > 	at __randomizedtesting.SeedInfo.seed([E7C8151E5DAC77AC:156B075E97D368FA]:0)
   [junit4]    > 	at org.apache.lucene.index.BaseIndexFileFormatTestCase.testRamBytesUsed(BaseIndexFileFormatTestCase.java:279)
   [junit4]    > 	at org.apache.lucene.index.BasePostingsFormatTestCase.testRamBytesUsed(BasePostingsFormatTestCase.java:85)
   [junit4]    > 	at java.base/jdk.internal.reflect.NativeMethodAccessorImpl.invoke0(Native Method)
   [junit4]    > 	at java.base/jdk.internal.reflect.NativeMethodAccessorImpl.invoke(NativeMethodAccessorImpl.java:62)
   [junit4]    > 	at java.base/jdk.internal.reflect.DelegatingMethodAccessorImpl.invoke(DelegatingMethodAccessorImpl.java:43)
   [junit4]    > 	at java.base/java.lang.reflect.Method.invoke(Method.java:538)
   [junit4]    > 	at java.base/java.lang.Thread.run(Thread.java:844)
   [junit4]   2> NOTE: leaving temporary files on disk at: /home/jenkins/workspace/Lucene-Solr-master-Linux/lucene/build/codecs/test/J2/temp/lucene.codecs.blocktreeords.TestOrdsBlockTree_E7C8151E5DAC77AC-001
   [junit4]   2> NOTE: test params are: codec=Asserting(Lucene70): {}, docValues:{}, maxPointsInLeafNode=339, maxMBSortInHeap=5.360885975312459, sim=RandomSimilarity(queryNorm=false): {f_DOCS_AND_FREQS=DFR I(n)Z(0.3), field=DFR I(F)B2, f_DOCS_AND_FREQS_AND_POSITIONS_AND_OFFSETS=DFR I(F)L1, f_DOCS_AND_FREQS_AND_POSITIONS=IB SPL-LZ(0.3), body=DFR GL3(800.0), f_DOCS=IB SPL-D2}, locale=os-GE, timezone=America/Los_Angeles
   [junit4]   2> NOTE: Linux 4.4.0-53-generic amd64/Oracle Corporation 9-ea (64-bit)/cpus=12,threads=1,free=365302432,total=491782144
   [junit4]   2> NOTE: All tests run in this JVM: [TestFixedGapPostingsFormat, TestSimpleTextFieldInfoFormat, TestSimpleTextPostingsFormat, TestOrdsBlockTree]
   [junit4] Completed [4/20 (1!)] on J2 in 4.92s, 32 tests, 1 failure <<< FAILURES!

[...truncated 1 lines...]
   [junit4] Suite: org.apache.lucene.codecs.memory.TestMemoryPostingsFormat
   [junit4]   2> NOTE: reproduce with: ant test  -Dtestcase=TestMemoryPostingsFormat -Dtests.method=testRamBytesUsed -Dtests.seed=E7C8151E5DAC77AC -Dtests.multiplier=3 -Dtests.slow=true -Dtests.locale=kok -Dtests.timezone=SystemV/YST9 -Dtests.asserts=true -Dtests.file.encoding=US-ASCII
   [junit4] FAILURE 0.84s J2 | TestMemoryPostingsFormat.testRamBytesUsed <<<
   [junit4]    > Throwable #1: java.lang.AssertionError: Actual RAM usage 376, but got 602473, -160132.1808510638% error
   [junit4]    > 	at __randomizedtesting.SeedInfo.seed([E7C8151E5DAC77AC:156B075E97D368FA]:0)
   [junit4]    > 	at org.apache.lucene.index.BaseIndexFileFormatTestCase.testRamBytesUsed(BaseIndexFileFormatTestCase.java:279)
   [junit4]    > 	at org.apache.lucene.index.BasePostingsFormatTestCase.testRamBytesUsed(BasePostingsFormatTestCase.java:85)
   [junit4]    > 	at java.base/jdk.internal.reflect.NativeMethodAccessorImpl.invoke0(Native Method)
   [junit4]    > 	at java.base/jdk.internal.reflect.NativeMethodAccessorImpl.invoke(NativeMethodAccessorImpl.java:62)
   [junit4]    > 	at java.base/jdk.internal.reflect.DelegatingMethodAccessorImpl.invoke(DelegatingMethodAccessorImpl.java:43)
   [junit4]    > 	at java.base/java.lang.reflect.Method.invoke(Method.java:538)
   [junit4]    > 	at java.base/java.lang.Thread.run(Thread.java:844)
   [junit4]   2> NOTE: leaving temporary files on disk at: /home/jenkins/workspace/Lucene-Solr-master-Linux/lucene/build/codecs/test/J2/temp/lucene.codecs.memory.TestMemoryPostingsFormat_E7C8151E5DAC77AC-001
   [junit4]   2> NOTE: test params are: codec=CheapBastard, sim=RandomSimilarity(queryNorm=true): {f_DOCS_AND_FREQS=DFI(ChiSquared), field=DFR I(F)B3(800.0), f_DOCS_AND_FREQS_AND_POSITIONS_AND_OFFSETS=DFR I(F)L3(800.0), f_DOCS_AND_FREQS_AND_POSITIONS=DFI(Standardized), body=DFR GB3(800.0), f_DOCS=DFR I(F)LZ(0.3)}, locale=kok, timezone=SystemV/YST9
   [junit4]   2> NOTE: Linux 4.4.0-53-generic amd64/Oracle Corporation 9-ea (64-bit)/cpus=12,threads=1,free=374241088,total=473432064
   [junit4]   2> NOTE: All tests run in this JVM: [TestFixedGapPostingsFormat, TestSimpleTextFieldInfoFormat, TestSimpleTextPostingsFormat, TestOrdsBlockTree, TestMemoryPostingsFormat]
   [junit4] Completed [5/20 (2!)] on J2 in 5.17s, 25 tests, 1 failure <<< FAILURES!

[...truncated 4 lines...]
   [junit4] Suite: org.apache.lucene.codecs.memory.TestDirectPostingsFormat
   [junit4]   2> NOTE: reproduce with: ant test  -Dtestcase=TestDirectPostingsFormat -Dtests.method=testRamBytesUsed -Dtests.seed=E7C8151E5DAC77AC -Dtests.multiplier=3 -Dtests.slow=true -Dtests.locale=af-NA -Dtests.timezone=VST -Dtests.asserts=true -Dtests.file.encoding=US-ASCII
   [junit4] FAILURE 0.71s J2 | TestDirectPostingsFormat.testRamBytesUsed <<<
   [junit4]    > Throwable #1: java.lang.AssertionError: Actual RAM usage 376, but got 4942400, -1314368.0851063828% error
   [junit4]    > 	at __randomizedtesting.SeedInfo.seed([E7C8151E5DAC77AC:156B075E97D368FA]:0)
   [junit4]    > 	at org.apache.lucene.index.BaseIndexFileFormatTestCase.testRamBytesUsed(BaseIndexFileFormatTestCase.java:279)
   [junit4]    > 	at org.apache.lucene.index.BasePostingsFormatTestCase.testRamBytesUsed(BasePostingsFormatTestCase.java:85)
   [junit4]    > 	at java.base/jdk.internal.reflect.NativeMethodAccessorImpl.invoke0(Native Method)
   [junit4]    > 	at java.base/jdk.internal.reflect.NativeMethodAccessorImpl.invoke(NativeMethodAccessorImpl.java:62)
   [junit4]    > 	at java.base/jdk.internal.reflect.DelegatingMethodAccessorImpl.invoke(DelegatingMethodAccessorImpl.java:43)
   [junit4]    > 	at java.base/java.lang.reflect.Method.invoke(Method.java:538)
   [junit4]    > 	at java.base/java.lang.Thread.run(Thread.java:844)
   [junit4]   2> NOTE: leaving temporary files on disk at: /home/jenkins/workspace/Lucene-Solr-master-Linux/lucene/build/codecs/test/J2/temp/lucene.codecs.memory.TestDirectPostingsFormat_E7C8151E5DAC77AC-001
   [junit4]   2> NOTE: test params are: codec=Asserting(Lucene70): {}, docValues:{}, maxPointsInLeafNode=1908, maxMBSortInHeap=5.051978683643619, sim=RandomSimilarity(queryNorm=false): {f_DOCS_AND_FREQS=DFI(Standardized), field=DFR I(ne)B3(800.0), f_DOCS_AND_FREQS_AND_POSITIONS_AND_OFFSETS=DFR I(n)3(800.0), f_DOCS_AND_FREQS_AND_POSITIONS=IB SPL-LZ(0.3), body=DFR I(ne)B3(800.0), f_DOCS=DFR I(F)BZ(0.3)}, locale=af-NA, timezone=VST
   [junit4]   2> NOTE: Linux 4.4.0-53-generic amd64/Oracle Corporation 9-ea (64-bit)/cpus=12,threads=1,free=428075440,total=477102080
   [junit4]   2> NOTE: All tests run in this JVM: [TestFixedGapPostingsFormat, TestSimpleTextFieldInfoFormat, TestSimpleTextPostingsFormat, TestOrdsBlockTree, TestMemoryPostingsFormat, TestBloomPostingsFormat, TestDirectPostingsFormat]
   [junit4] Completed [7/20 (3!)] on J2 in 3.87s, 25 tests, 1 failure <<< FAILURES!

[...truncated 4 lines...]
   [junit4] Suite: org.apache.lucene.codecs.blockterms.TestVarGapFixedIntervalPostingsFormat
   [junit4]   2> NOTE: reproduce with: ant test  -Dtestcase=TestVarGapFixedIntervalPostingsFormat -Dtests.method=testRamBytesUsed -Dtests.seed=E7C8151E5DAC77AC -Dtests.multiplier=3 -Dtests.slow=true -Dtests.locale=kam-KE -Dtests.timezone=America/Yellowknife -Dtests.asserts=true -Dtests.file.encoding=US-ASCII
   [junit4] FAILURE 0.66s J2 | TestVarGapFixedIntervalPostingsFormat.testRamBytesUsed <<<
   [junit4]    > Throwable #1: java.lang.AssertionError: Actual RAM usage 240, but got 2570, -970.8333333333334% error
   [junit4]    > 	at __randomizedtesting.SeedInfo.seed([E7C8151E5DAC77AC:156B075E97D368FA]:0)
   [junit4]    > 	at org.apache.lucene.index.BaseIndexFileFormatTestCase.testRamBytesUsed(BaseIndexFileFormatTestCase.java:279)
   [junit4]    > 	at org.apache.lucene.index.BasePostingsFormatTestCase.testRamBytesUsed(BasePostingsFormatTestCase.java:85)
   [junit4]    > 	at java.base/jdk.internal.reflect.NativeMethodAccessorImpl.invoke0(Native Method)
   [junit4]    > 	at java.base/jdk.internal.reflect.NativeMethodAccessorImpl.invoke(NativeMethodAccessorImpl.java:62)
   [junit4]    > 	at java.base/jdk.internal.reflect.DelegatingMethodAccessorImpl.invoke(DelegatingMethodAccessorImpl.java:43)
   [junit4]    > 	at java.base/java.lang.reflect.Method.invoke(Method.java:538)
   [junit4]    > 	at java.base/java.lang.Thread.run(Thread.java:844)
   [junit4]   2> NOTE: leaving temporary files on disk at: /home/jenkins/workspace/Lucene-Solr-master-Linux/lucene/build/codecs/test/J2/temp/lucene.codecs.blockterms.TestVarGapFixedIntervalPostingsFormat_E7C8151E5DAC77AC-001
   [junit4]   2> NOTE: test params are: codec=Asserting(Lucene70): {}, docValues:{}, maxPointsInLeafNode=1353, maxMBSortInHeap=6.4034629931321305, sim=RandomSimilarity(queryNorm=true): {f_DOCS_AND_FREQS=DFR I(ne)L3(800.0), field=DFR I(ne)B1, f_DOCS_AND_FREQS_AND_POSITIONS_AND_OFFSETS=DFI(ChiSquared), f_DOCS_AND_FREQS_AND_POSITIONS=DFR I(ne)LZ(0.3), body=DFR GLZ(0.3), f_DOCS=DFR I(F)L1}, locale=kam-KE, timezone=America/Yellowknife
   [junit4]   2> NOTE: Linux 4.4.0-53-generic amd64/Oracle Corporation 9-ea (64-bit)/cpus=12,threads=1,free=397589848,total=480247808
   [junit4]   2> NOTE: All tests run in this JVM: [TestFixedGapPostingsFormat, TestSimpleTextFieldInfoFormat, TestSimpleTextPostingsFormat, TestOrdsBlockTree, TestMemoryPostingsFormat, TestBloomPostingsFormat, TestDirectPostingsFormat, TestVarGapDocFreqIntervalPostingsFormat, TestVarGapFixedIntervalPostingsFormat]
   [junit4] Completed [9/20 (4!)] on J2 in 3.31s, 25 tests, 1 failure <<< FAILURES!

[...truncated 1 lines...]
   [junit4] Suite: org.apache.lucene.codecs.memory.TestFSTPostingsFormat
   [junit4]   2> NOTE: reproduce with: ant test  -Dtestcase=TestFSTPostingsFormat -Dtests.method=testRamBytesUsed -Dtests.seed=E7C8151E5DAC77AC -Dtests.multiplier=3 -Dtests.slow=true -Dtests.locale=en-CY -Dtests.timezone=America/Denver -Dtests.asserts=true -Dtests.file.encoding=US-ASCII
   [junit4] FAILURE 0.63s J2 | TestFSTPostingsFormat.testRamBytesUsed <<<
   [junit4]    > Throwable #1: java.lang.AssertionError: Actual RAM usage 376, but got 20857, -5447.074468085107% error
   [junit4]    > 	at __randomizedtesting.SeedInfo.seed([E7C8151E5DAC77AC:156B075E97D368FA]:0)
   [junit4]    > 	at org.apache.lucene.index.BaseIndexFileFormatTestCase.testRamBytesUsed(BaseIndexFileFormatTestCase.java:279)
   [junit4]    > 	at org.apache.lucene.index.BasePostingsFormatTestCase.testRamBytesUsed(BasePostingsFormatTestCase.java:85)
   [junit4]    > 	at java.base/jdk.internal.reflect.NativeMethodAccessorImpl.invoke0(Native Method)
   [junit4]    > 	at java.base/jdk.internal.reflect.NativeMethodAccessorImpl.invoke(NativeMethodAccessorImpl.java:62)
   [junit4]    > 	at java.base/jdk.internal.reflect.DelegatingMethodAccessorImpl.invoke(DelegatingMethodAccessorImpl.java:43)
   [junit4]    > 	at java.base/java.lang.reflect.Method.invoke(Method.java:538)
   [junit4]    > 	at java.base/java.lang.Thread.run(Thread.java:844)
   [junit4]   2> NOTE: leaving temporary files on disk at: /home/jenkins/workspace/Lucene-Solr-master-Linux/lucene/build/codecs/test/J2/temp/lucene.codecs.memory.TestFSTPostingsFormat_E7C8151E5DAC77AC-001
   [junit4]   2> NOTE: test params are: codec=Asserting(Lucene70): {}, docValues:{}, maxPointsInLeafNode=327, maxMBSortInHeap=7.040859264838712, sim=RandomSimilarity(queryNorm=false): {f_DOCS_AND_FREQS=DFR GB1, field=DFR I(ne)L3(800.0), f_DOCS_AND_FREQS_AND_POSITIONS_AND_OFFSETS=DFR I(F)B2, f_DOCS_AND_FREQS_AND_POSITIONS=DFI(ChiSquared), body=DFR I(n)B2, f_DOCS=DFR I(ne)L1}, locale=en-CY, timezone=America/Denver
   [junit4]   2> NOTE: Linux 4.4.0-53-generic amd64/Oracle Corporation 9-ea (64-bit)/cpus=12,threads=1,free=367576424,total=468713472
   [junit4]   2> NOTE: All tests run in this JVM: [TestFixedGapPostingsFormat, TestSimpleTextFieldInfoFormat, TestSimpleTextPostingsFormat, TestOrdsBlockTree, TestMemoryPostingsFormat, TestBloomPostingsFormat, TestDirectPostingsFormat, TestVarGapDocFreqIntervalPostingsFormat, TestVarGapFixedIntervalPostingsFormat, TestFSTPostingsFormat]
   [junit4] Completed [10/20 (5!)] on J2 in 3.32s, 25 tests, 1 failure <<< FAILURES!

[...truncated 4 lines...]
   [junit4] Suite: org.apache.lucene.codecs.memory.TestFSTOrdPostingsFormat
   [junit4]   2> NOTE: reproduce with: ant test  -Dtestcase=TestFSTOrdPostingsFormat -Dtests.method=testRamBytesUsed -Dtests.seed=E7C8151E5DAC77AC -Dtests.multiplier=3 -Dtests.slow=true -Dtests.locale=sn -Dtests.timezone=America/Detroit -Dtests.asserts=true -Dtests.file.encoding=US-ASCII
   [junit4] FAILURE 1.17s J1 | TestFSTOrdPostingsFormat.testRamBytesUsed <<<
   [junit4]    > Throwable #1: java.lang.AssertionError: Actual RAM usage 376, but got 21300, -5564.893617021276% error
   [junit4]    > 	at __randomizedtesting.SeedInfo.seed([E7C8151E5DAC77AC:156B075E97D368FA]:0)
   [junit4]    > 	at org.apache.lucene.index.BaseIndexFileFormatTestCase.testRamBytesUsed(BaseIndexFileFormatTestCase.java:279)
   [junit4]    > 	at org.apache.lucene.index.BasePostingsFormatTestCase.testRamBytesUsed(BasePostingsFormatTestCase.java:85)
   [junit4]    > 	at java.base/jdk.internal.reflect.NativeMethodAccessorImpl.invoke0(Native Method)
   [junit4]    > 	at java.base/jdk.internal.reflect.NativeMethodAccessorImpl.invoke(NativeMethodAccessorImpl.java:62)
   [junit4]    > 	at java.base/jdk.internal.reflect.DelegatingMethodAccessorImpl.invoke(DelegatingMethodAccessorImpl.java:43)
   [junit4]    > 	at java.base/java.lang.reflect.Method.invoke(Method.java:538)
   [junit4]    > 	at java.base/java.lang.Thread.run(Thread.java:844)
   [junit4]   2> NOTE: leaving temporary files on disk at: /home/jenkins/workspace/Lucene-Solr-master-Linux/lucene/build/codecs/test/J1/temp/lucene.codecs.memory.TestFSTOrdPostingsFormat_E7C8151E5DAC77AC-001
   [junit4]   2> NOTE: test params are: codec=Asserting(Lucene70), sim=RandomSimilarity(queryNorm=false): {f_DOCS_AND_FREQS=DFR GL2, field=DFR I(ne)LZ(0.3), f_DOCS_AND_FREQS_AND_POSITIONS_AND_OFFSETS=DFR I(n)B1, f_DOCS_AND_FREQS_AND_POSITIONS=DFR I(n)BZ(0.3), body=DFR I(F)L1, f_DOCS=IB LL-D3(800.0)}, locale=sn, timezone=America/Detroit
   [junit4]   2> NOTE: Linux 4.4.0-53-generic amd64/Oracle Corporation 9-ea (64-bit)/cpus=12,threads=1,free=348828024,total=480772096
   [junit4]   2> NOTE: All tests run in this JVM: [TestSimpleTextDocValuesFormat, TestFSTOrdPostingsFormat]
   [junit4] Completed [12/20 (6!)] on J1 in 6.36s, 25 tests, 1 failure <<< FAILURES!

[...truncated 25 lines...]
   [junit4] Suite: org.apache.lucene.codecs.simpletext.TestSimpleTextNormsFormat
   [junit4] IGNOR/A 0.00s J1 | TestSimpleTextNormsFormat.testSparseNCommonBig
   [junit4]    > Assumption #1: 'nightly' test group is disabled (@Nightly())
   [junit4] IGNOR/A 0.00s J1 | TestSimpleTextNormsFormat.testMergeStability
   [junit4]    > Assumption #1: The MockRandom PF randomizes content on the fly, so we can't check it
   [junit4]   2> NOTE: reproduce with: ant test  -Dtestcase=TestSimpleTextNormsFormat -Dtests.method=testRamBytesUsed -Dtests.seed=E7C8151E5DAC77AC -Dtests.multiplier=3 -Dtests.slow=true -Dtests.locale=pa-PK -Dtests.timezone=America/Inuvik -Dtests.asserts=true -Dtests.file.encoding=US-ASCII
   [junit4] FAILURE 1.48s J1 | TestSimpleTextNormsFormat.testRamBytesUsed <<<
   [junit4]    > Throwable #1: java.lang.AssertionError: Actual RAM usage 315904, but got 693304, -119.4666734197731% error
   [junit4]    > 	at __randomizedtesting.SeedInfo.seed([E7C8151E5DAC77AC:156B075E97D368FA]:0)
   [junit4]    > 	at org.apache.lucene.index.BaseIndexFileFormatTestCase.testRamBytesUsed(BaseIndexFileFormatTestCase.java:279)
   [junit4]    > 	at org.apache.lucene.index.BaseNormsFormatTestCase.testRamBytesUsed(BaseNormsFormatTestCase.java:52)
   [junit4]    > 	at java.base/jdk.internal.reflect.NativeMethodAccessorImpl.invoke0(Native Method)
   [junit4]    > 	at java.base/jdk.internal.reflect.NativeMethodAccessorImpl.invoke(NativeMethodAccessorImpl.java:62)
   [junit4]    > 	at java.base/jdk.internal.reflect.DelegatingMethodAccessorImpl.invoke(DelegatingMethodAccessorImpl.java:43)
   [junit4]    > 	at java.base/java.lang.reflect.Method.invoke(Method.java:538)
   [junit4]    > 	at java.base/java.lang.Thread.run(Thread.java:844)
   [junit4] IGNOR/A 0.00s J1 | TestSimpleTextNormsFormat.testNCommonBig
   [junit4]    > Assumption #1: 'nightly' test group is disabled (@Nightly())
   [junit4]   2> NOTE: leaving temporary files on disk at: /home/jenkins/workspace/Lucene-Solr-master-Linux/lucene/build/codecs/test/J1/temp/lucene.codecs.simpletext.TestSimpleTextNormsFormat_E7C8151E5DAC77AC-001
   [junit4]   2> NOTE: test params are: codec=Asserting(Lucene70): {}, docValues:{}, maxPointsInLeafNode=1056, maxMBSortInHeap=7.322614958707484, sim=RandomSimilarity(queryNorm=false): {foobar=DFR I(n)BZ(0.3), content=DFR I(ne)L2}, locale=pa-PK, timezone=America/Inuvik
   [junit4]   2> NOTE: Linux 4.4.0-53-generic amd64/Oracle Corporation 9-ea (64-bit)/cpus=12,threads=1,free=306820912,total=498073600
   [junit4]   2> NOTE: All tests run in this JVM: [TestSimpleTextDocValuesFormat, TestFSTOrdPostingsFormat, TestSimpleTextPointsFormat, TestSimpleTextNormsFormat]
   [junit4] Completed [19/20 (7!)] on J1 in 20.12s, 29 tests, 1 failure, 3 skipped <<< FAILURES!

[...truncated 58147 lines...]


Mime
View raw message