lucene-dev mailing list archives

Site index · List index
Message view « Date » · « Thread »
Top « Date » · « Thread »
From Policeman Jenkins Server <jenk...@thetaphi.de>
Subject [JENKINS-EA] Lucene-Solr-6.x-Linux (64bit/jdk-9-ea+140) - Build # 2337 - Still Unstable!
Date Sun, 04 Dec 2016 11:55:03 GMT
Build: https://jenkins.thetaphi.de/job/Lucene-Solr-6.x-Linux/2337/
Java: 64bit/jdk-9-ea+140 -XX:+UseCompressedOops -XX:+UseSerialGC

1 tests failed.
FAILED:  org.apache.solr.handler.component.SpellCheckComponentTest.testThresholdTokenFrequency

Error Message:
Path not found: /spellcheck/suggestions/[1]/suggestion

Stack Trace:
java.lang.RuntimeException: Path not found: /spellcheck/suggestions/[1]/suggestion
	at __randomizedtesting.SeedInfo.seed([2C9C5343D42D65FE:A63BDCB25BC65C85]:0)
	at org.apache.solr.SolrTestCaseJ4.assertJQ(SolrTestCaseJ4.java:900)
	at org.apache.solr.SolrTestCaseJ4.assertJQ(SolrTestCaseJ4.java:847)
	at org.apache.solr.handler.component.SpellCheckComponentTest.testThresholdTokenFrequency(SpellCheckComponentTest.java:277)
	at jdk.internal.reflect.NativeMethodAccessorImpl.invoke0(java.base@9-ea/Native Method)
	at jdk.internal.reflect.NativeMethodAccessorImpl.invoke(java.base@9-ea/NativeMethodAccessorImpl.java:62)
	at jdk.internal.reflect.DelegatingMethodAccessorImpl.invoke(java.base@9-ea/DelegatingMethodAccessorImpl.java:43)
	at java.lang.reflect.Method.invoke(java.base@9-ea/Method.java:535)
	at com.carrotsearch.randomizedtesting.RandomizedRunner.invoke(RandomizedRunner.java:1713)
	at com.carrotsearch.randomizedtesting.RandomizedRunner$8.evaluate(RandomizedRunner.java:907)
	at com.carrotsearch.randomizedtesting.RandomizedRunner$9.evaluate(RandomizedRunner.java:943)
	at com.carrotsearch.randomizedtesting.RandomizedRunner$10.evaluate(RandomizedRunner.java:957)
	at com.carrotsearch.randomizedtesting.rules.SystemPropertiesRestoreRule$1.evaluate(SystemPropertiesRestoreRule.java:57)
	at org.apache.lucene.util.TestRuleSetupTeardownChained$1.evaluate(TestRuleSetupTeardownChained.java:49)
	at org.apache.lucene.util.AbstractBeforeAfterRule$1.evaluate(AbstractBeforeAfterRule.java:45)
	at org.apache.lucene.util.TestRuleThreadAndTestName$1.evaluate(TestRuleThreadAndTestName.java:48)
	at org.apache.lucene.util.TestRuleIgnoreAfterMaxFailures$1.evaluate(TestRuleIgnoreAfterMaxFailures.java:64)
	at org.apache.lucene.util.TestRuleMarkFailure$1.evaluate(TestRuleMarkFailure.java:47)
	at com.carrotsearch.randomizedtesting.rules.StatementAdapter.evaluate(StatementAdapter.java:36)
	at com.carrotsearch.randomizedtesting.ThreadLeakControl$StatementRunner.run(ThreadLeakControl.java:367)
	at com.carrotsearch.randomizedtesting.ThreadLeakControl.forkTimeoutingTask(ThreadLeakControl.java:811)
	at com.carrotsearch.randomizedtesting.ThreadLeakControl$3.evaluate(ThreadLeakControl.java:462)
	at com.carrotsearch.randomizedtesting.RandomizedRunner.runSingleTest(RandomizedRunner.java:916)
	at com.carrotsearch.randomizedtesting.RandomizedRunner$5.evaluate(RandomizedRunner.java:802)
	at com.carrotsearch.randomizedtesting.RandomizedRunner$6.evaluate(RandomizedRunner.java:852)
	at com.carrotsearch.randomizedtesting.RandomizedRunner$7.evaluate(RandomizedRunner.java:863)
	at com.carrotsearch.randomizedtesting.rules.StatementAdapter.evaluate(StatementAdapter.java:36)
	at com.carrotsearch.randomizedtesting.rules.SystemPropertiesRestoreRule$1.evaluate(SystemPropertiesRestoreRule.java:57)
	at org.apache.lucene.util.AbstractBeforeAfterRule$1.evaluate(AbstractBeforeAfterRule.java:45)
	at com.carrotsearch.randomizedtesting.rules.StatementAdapter.evaluate(StatementAdapter.java:36)
	at org.apache.lucene.util.TestRuleStoreClassName$1.evaluate(TestRuleStoreClassName.java:41)
	at com.carrotsearch.randomizedtesting.rules.NoShadowingOrOverridesOnMethodsRule$1.evaluate(NoShadowingOrOverridesOnMethodsRule.java:40)
	at com.carrotsearch.randomizedtesting.rules.NoShadowingOrOverridesOnMethodsRule$1.evaluate(NoShadowingOrOverridesOnMethodsRule.java:40)
	at com.carrotsearch.randomizedtesting.rules.StatementAdapter.evaluate(StatementAdapter.java:36)
	at com.carrotsearch.randomizedtesting.rules.StatementAdapter.evaluate(StatementAdapter.java:36)
	at com.carrotsearch.randomizedtesting.rules.StatementAdapter.evaluate(StatementAdapter.java:36)
	at org.apache.lucene.util.TestRuleAssertionsRequired$1.evaluate(TestRuleAssertionsRequired.java:53)
	at org.apache.lucene.util.TestRuleMarkFailure$1.evaluate(TestRuleMarkFailure.java:47)
	at org.apache.lucene.util.TestRuleIgnoreAfterMaxFailures$1.evaluate(TestRuleIgnoreAfterMaxFailures.java:64)
	at org.apache.lucene.util.TestRuleIgnoreTestSuites$1.evaluate(TestRuleIgnoreTestSuites.java:54)
	at com.carrotsearch.randomizedtesting.rules.StatementAdapter.evaluate(StatementAdapter.java:36)
	at com.carrotsearch.randomizedtesting.ThreadLeakControl$StatementRunner.run(ThreadLeakControl.java:367)
	at java.lang.Thread.run(java.base@9-ea/Thread.java:843)




Build Log:
[...truncated 11735 lines...]
   [junit4] Suite: org.apache.solr.handler.component.SpellCheckComponentTest
   [junit4]   2> Creating dataDir: /home/jenkins/workspace/Lucene-Solr-6.x-Linux/solr/build/solr-core/test/J1/temp/solr.handler.component.SpellCheckComponentTest_2C9C5343D42D65FE-001/init-core-data-001
   [junit4]   2> 1006120 INFO  (SUITE-SpellCheckComponentTest-seed#[2C9C5343D42D65FE]-worker) [    ] o.a.s.SolrTestCaseJ4 Randomized ssl (true) and clientAuth (true) via: @org.apache.solr.util.RandomizeSSL(reason="", ssl=0.0/0.0, value=0.0/0.0, clientAuth=0.0/0.0)
   [junit4]   2> 1006122 INFO  (SUITE-SpellCheckComponentTest-seed#[2C9C5343D42D65FE]-worker) [    ] o.a.s.SolrTestCaseJ4 ####initCore
   [junit4]   2> 1006123 INFO  (SUITE-SpellCheckComponentTest-seed#[2C9C5343D42D65FE]-worker) [    ] o.a.s.c.SolrResourceLoader [null] Added 2 libs to classloader, from paths: [/home/jenkins/workspace/Lucene-Solr-6.x-Linux/solr/core/src/test-files/solr/collection1/lib, /home/jenkins/workspace/Lucene-Solr-6.x-Linux/solr/core/src/test-files/solr/collection1/lib/classes]
   [junit4]   2> 1006178 WARN  (SUITE-SpellCheckComponentTest-seed#[2C9C5343D42D65FE]-worker) [    ] o.a.s.c.Config Beginning with Solr 5.5, <mergePolicy> is deprecated, use <mergePolicyFactory> instead.
   [junit4]   2> 1006179 INFO  (SUITE-SpellCheckComponentTest-seed#[2C9C5343D42D65FE]-worker) [    ] o.a.s.c.SolrConfig Using Lucene MatchVersion: 6.4.0
   [junit4]   2> 1006187 INFO  (SUITE-SpellCheckComponentTest-seed#[2C9C5343D42D65FE]-worker) [    ] o.a.s.s.IndexSchema [null] Schema name=test
   [junit4]   2> 1006246 WARN  (SUITE-SpellCheckComponentTest-seed#[2C9C5343D42D65FE]-worker) [    ] o.a.s.s.IndexSchema [null] default search field in schema is text. WARNING: Deprecated, please use 'df' on request instead.
   [junit4]   2> 1006248 INFO  (SUITE-SpellCheckComponentTest-seed#[2C9C5343D42D65FE]-worker) [    ] o.a.s.s.IndexSchema Loaded schema test/1.0 with uniqueid field id
   [junit4]   2> 1006266 INFO  (SUITE-SpellCheckComponentTest-seed#[2C9C5343D42D65FE]-worker) [    ] o.a.s.u.UpdateShardHandler Creating UpdateShardHandler HTTP client with params: socketTimeout=30000&connTimeout=30000&retry=true
   [junit4]   2> 1006268 INFO  (coreLoadExecutor-4807-thread-1) [    ] o.a.s.c.SolrResourceLoader [null] Added 2 libs to classloader, from paths: [/home/jenkins/workspace/Lucene-Solr-6.x-Linux/solr/core/src/test-files/solr/collection1/lib, /home/jenkins/workspace/Lucene-Solr-6.x-Linux/solr/core/src/test-files/solr/collection1/lib/classes]
   [junit4]   2> 1006327 WARN  (coreLoadExecutor-4807-thread-1) [    ] o.a.s.c.Config Beginning with Solr 5.5, <mergePolicy> is deprecated, use <mergePolicyFactory> instead.
   [junit4]   2> 1006328 INFO  (coreLoadExecutor-4807-thread-1) [    ] o.a.s.c.SolrConfig Using Lucene MatchVersion: 6.4.0
   [junit4]   2> 1006337 INFO  (coreLoadExecutor-4807-thread-1) [    ] o.a.s.s.IndexSchema [collection1] Schema name=test
   [junit4]   2> 1006395 WARN  (coreLoadExecutor-4807-thread-1) [    ] o.a.s.s.IndexSchema [collection1] default search field in schema is text. WARNING: Deprecated, please use 'df' on request instead.
   [junit4]   2> 1006396 INFO  (coreLoadExecutor-4807-thread-1) [    ] o.a.s.s.IndexSchema Loaded schema test/1.0 with uniqueid field id
   [junit4]   2> 1006411 INFO  (coreLoadExecutor-4807-thread-1) [    ] o.a.s.c.CoreContainer Creating SolrCore 'collection1' using configuration from instancedir /home/jenkins/workspace/Lucene-Solr-6.x-Linux/solr/core/src/test-files/solr/collection1
   [junit4]   2> 1006411 INFO  (coreLoadExecutor-4807-thread-1) [    ] o.a.s.c.SolrCore [[collection1] ] Opening new SolrCore at [/home/jenkins/workspace/Lucene-Solr-6.x-Linux/solr/core/src/test-files/solr/collection1], dataDir=[/home/jenkins/workspace/Lucene-Solr-6.x-Linux/solr/build/solr-core/test/J1/temp/solr.handler.component.SpellCheckComponentTest_2C9C5343D42D65FE-001/init-core-data-001/]
   [junit4]   2> 1006411 INFO  (coreLoadExecutor-4807-thread-1) [    ] o.a.s.u.RandomMergePolicy RandomMergePolicy wrapping class org.apache.lucene.index.LogDocMergePolicy: [LogDocMergePolicy: minMergeSize=1000, mergeFactor=19, maxMergeSize=9223372036854775807, maxMergeSizeForForcedMerge=9223372036854775807, calibrateSizeByDeletes=false, maxMergeDocs=2147483647, maxCFSSegmentSizeMB=8.796093022207999E12, noCFSRatio=0.888085046317938]
   [junit4]   2> 1006416 INFO  (coreLoadExecutor-4807-thread-1) [    ] o.a.s.u.CommitTracker Hard AutoCommit: disabled
   [junit4]   2> 1006416 INFO  (coreLoadExecutor-4807-thread-1) [    ] o.a.s.u.CommitTracker Soft AutoCommit: disabled
   [junit4]   2> 1006416 INFO  (coreLoadExecutor-4807-thread-1) [    ] o.a.s.u.RandomMergePolicy RandomMergePolicy wrapping class org.apache.lucene.index.AlcoholicMergePolicy: [AlcoholicMergePolicy: minMergeSize=0, mergeFactor=10, maxMergeSize=182741207, maxMergeSizeForForcedMerge=9223372036854775807, calibrateSizeByDeletes=true, maxMergeDocs=2147483647, maxCFSSegmentSizeMB=8.796093022207999E12, noCFSRatio=0.1]
   [junit4]   2> 1006416 INFO  (coreLoadExecutor-4807-thread-1) [    ] o.a.s.s.SolrIndexSearcher Opening [Searcher@23ec24ec[collection1] main]
   [junit4]   2> 1006417 WARN  (coreLoadExecutor-4807-thread-1) [    ] o.a.s.r.ManagedResourceStorage Cannot write to config directory /home/jenkins/workspace/Lucene-Solr-6.x-Linux/solr/core/src/test-files/solr/collection1/conf; switching to use InMemory storage instead.
   [junit4]   2> 1006417 INFO  (coreLoadExecutor-4807-thread-1) [    ] o.a.s.h.c.SpellCheckComponent Initializing spell checkers
   [junit4]   2> 1006452 INFO  (coreLoadExecutor-4807-thread-1) [    ] o.a.s.h.c.SpellCheckComponent Registering newSearcher listener for spellchecker: default
   [junit4]   2> 1006483 INFO  (coreLoadExecutor-4807-thread-1) [    ] o.a.s.h.c.SpellCheckComponent Registering newSearcher listener for spellchecker: default_teststop
   [junit4]   2> 1006483 INFO  (coreLoadExecutor-4807-thread-1) [    ] o.a.s.s.DirectSolrSpellChecker init: {name=direct,classname=solr.DirectSolrSpellChecker,minQueryLength=3,maxQueryFrequency=100.0,field=teststop}
   [junit4]   2> 1006483 INFO  (coreLoadExecutor-4807-thread-1) [    ] o.a.s.s.DirectSolrSpellChecker init: {name=direct_lowerfilt,classname=solr.DirectSolrSpellChecker,minQueryLength=3,maxQueryFrequency=100.0,field=lowerfilt}
   [junit4]   2> 1006519 INFO  (coreLoadExecutor-4807-thread-1) [    ] o.a.s.h.c.SpellCheckComponent Registering newSearcher listener for spellchecker: threshold
   [junit4]   2> 1006519 INFO  (coreLoadExecutor-4807-thread-1) [    ] o.a.s.s.DirectSolrSpellChecker init: {name=threshold_direct,classname=solr.DirectSolrSpellChecker,field=lowerfilt,spellcheckIndexDir=spellcheckerThreshold,buildOnCommit=true,thresholdTokenFrequency=0.29}
   [junit4]   2> 1006520 INFO  (coreLoadExecutor-4807-thread-1) [    ] o.a.s.h.c.SpellCheckComponent Registering newSearcher listener for spellchecker: threshold_direct
   [junit4]   2> 1006563 INFO  (coreLoadExecutor-4807-thread-1) [    ] o.a.s.h.c.SpellCheckComponent Registering newSearcher listener for spellchecker: multipleFields
   [junit4]   2> 1006746 INFO  (coreLoadExecutor-4807-thread-1) [    ] o.a.s.h.c.SpellCheckComponent Registering newSearcher listener for spellchecker: freq
   [junit4]   2> 1006799 INFO  (coreLoadExecutor-4807-thread-1) [    ] o.a.s.h.c.SpellCheckComponent Registering newSearcher listener for spellchecker: fqcn
   [junit4]   2> 1006799 INFO  (coreLoadExecutor-4807-thread-1) [    ] o.a.s.h.ReplicationHandler Commits will be reserved for  10000
   [junit4]   2> 1006799 INFO  (searcherExecutor-4808-thread-1) [    ] o.a.s.h.c.SpellCheckComponent Loading spell index for spellchecker: default
   [junit4]   2> 1006801 INFO  (SUITE-SpellCheckComponentTest-seed#[2C9C5343D42D65FE]-worker) [    ] o.a.s.SolrTestCaseJ4 ####initCore end
   [junit4]   2> 1006803 INFO  (TEST-SpellCheckComponentTest.testThresholdTokenFrequency-seed#[2C9C5343D42D65FE]) [    ] o.a.s.SolrTestCaseJ4 ###Starting testThresholdTokenFrequency
   [junit4]   2> 1006803 INFO  (searcherExecutor-4808-thread-1) [    ] o.a.s.h.c.SpellCheckComponent Loading spell index for spellchecker: default_teststop
   [junit4]   2> 1006804 INFO  (TEST-SpellCheckComponentTest.testThresholdTokenFrequency-seed#[2C9C5343D42D65FE]) [    ] o.a.s.u.p.LogUpdateProcessorFactory [collection1]  webapp=null path=null params={}{add=[0]} 0 0
   [junit4]   2> 1006805 INFO  (TEST-SpellCheckComponentTest.testThresholdTokenFrequency-seed#[2C9C5343D42D65FE]) [    ] o.a.s.u.p.LogUpdateProcessorFactory [collection1]  webapp=null path=null params={}{add=[1]} 0 0
   [junit4]   2> 1006805 INFO  (searcherExecutor-4808-thread-1) [    ] o.a.s.h.c.SpellCheckComponent Loading spell index for spellchecker: direct
   [junit4]   2> 1006805 INFO  (searcherExecutor-4808-thread-1) [    ] o.a.s.h.c.SpellCheckComponent Loading spell index for spellchecker: direct_lowerfilt
   [junit4]   2> 1006805 INFO  (searcherExecutor-4808-thread-1) [    ] o.a.s.h.c.SpellCheckComponent Loading spell index for spellchecker: wordbreak
   [junit4]   2> 1006805 INFO  (searcherExecutor-4808-thread-1) [    ] o.a.s.h.c.SpellCheckComponent Loading spell index for spellchecker: threshold
   [junit4]   2> 1006805 INFO  (TEST-SpellCheckComponentTest.testThresholdTokenFrequency-seed#[2C9C5343D42D65FE]) [    ] o.a.s.u.p.LogUpdateProcessorFactory [collection1]  webapp=null path=null params={}{add=[2]} 0 0
   [junit4]   2> 1006806 INFO  (TEST-SpellCheckComponentTest.testThresholdTokenFrequency-seed#[2C9C5343D42D65FE]) [    ] o.a.s.u.p.LogUpdateProcessorFactory [collection1]  webapp=null path=null params={}{add=[3]} 0 0
   [junit4]   2> 1006806 INFO  (TEST-SpellCheckComponentTest.testThresholdTokenFrequency-seed#[2C9C5343D42D65FE]) [    ] o.a.s.u.p.LogUpdateProcessorFactory [collection1]  webapp=null path=null params={}{add=[4]} 0 0
   [junit4]   2> 1006806 INFO  (TEST-SpellCheckComponentTest.testThresholdTokenFrequency-seed#[2C9C5343D42D65FE]) [    ] o.a.s.u.p.LogUpdateProcessorFactory [collection1]  webapp=null path=null params={}{add=[5]} 0 0
   [junit4]   2> 1006806 INFO  (TEST-SpellCheckComponentTest.testThresholdTokenFrequency-seed#[2C9C5343D42D65FE]) [    ] o.a.s.u.p.LogUpdateProcessorFactory [collection1]  webapp=null path=null params={}{add=[6]} 0 0
   [junit4]   2> 1006807 INFO  (TEST-SpellCheckComponentTest.testThresholdTokenFrequency-seed#[2C9C5343D42D65FE]) [    ] o.a.s.u.p.LogUpdateProcessorFactory [collection1]  webapp=null path=null params={}{add=[7]} 0 0
   [junit4]   2> 1006807 INFO  (TEST-SpellCheckComponentTest.testThresholdTokenFrequency-seed#[2C9C5343D42D65FE]) [    ] o.a.s.u.p.LogUpdateProcessorFactory [collection1]  webapp=null path=null params={}{add=[8]} 0 0
   [junit4]   2> 1006807 INFO  (TEST-SpellCheckComponentTest.testThresholdTokenFrequency-seed#[2C9C5343D42D65FE]) [    ] o.a.s.u.p.LogUpdateProcessorFactory [collection1]  webapp=null path=null params={}{add=[9]} 0 0
   [junit4]   2> 1006807 INFO  (TEST-SpellCheckComponentTest.testThresholdTokenFrequency-seed#[2C9C5343D42D65FE]) [    ] o.a.s.u.DirectUpdateHandler2 start commit{,optimize=false,openSearcher=true,waitSearcher=true,expungeDeletes=false,softCommit=false,prepareCommit=false}
   [junit4]   2> 1006807 INFO  (TEST-SpellCheckComponentTest.testThresholdTokenFrequency-seed#[2C9C5343D42D65FE]) [    ] o.a.s.u.SolrIndexWriter Calling setCommitData with IW:org.apache.solr.update.SolrIndexWriter@39de961a
   [junit4]   2> 1006808 INFO  (searcherExecutor-4808-thread-1) [    ] o.a.s.h.c.SpellCheckComponent Loading spell index for spellchecker: threshold_direct
   [junit4]   2> 1006808 INFO  (searcherExecutor-4808-thread-1) [    ] o.a.s.h.c.SpellCheckComponent Loading spell index for spellchecker: multipleFields
   [junit4]   2> 1006810 WARN  (TEST-SpellCheckComponentTest.testThresholdTokenFrequency-seed#[2C9C5343D42D65FE]) [    ] o.a.s.c.SolrCore [collection1] PERFORMANCE WARNING: Overlapping onDeckSearchers=2
   [junit4]   2> 1006810 INFO  (searcherExecutor-4808-thread-1) [    ] o.a.s.h.c.SpellCheckComponent Loading spell index for spellchecker: jarowinkler
   [junit4]   2> 1006811 INFO  (TEST-SpellCheckComponentTest.testThresholdTokenFrequency-seed#[2C9C5343D42D65FE]) [    ] o.a.s.s.SolrIndexSearcher Opening [Searcher@59c04ae8[collection1] main]
   [junit4]   2> 1006812 INFO  (TEST-SpellCheckComponentTest.testThresholdTokenFrequency-seed#[2C9C5343D42D65FE]) [    ] o.a.s.u.DirectUpdateHandler2 end_commit_flush
   [junit4]   2> 1006812 INFO  (searcherExecutor-4808-thread-1) [    ] o.a.s.h.c.SpellCheckComponent Loading spell index for spellchecker: external
   [junit4]   2> 1006815 INFO  (searcherExecutor-4808-thread-1) [    ] o.a.s.h.c.SpellCheckComponent Loading spell index for spellchecker: freq
   [junit4]   2> 1006817 INFO  (searcherExecutor-4808-thread-1) [    ] o.a.s.h.c.SpellCheckComponent Loading spell index for spellchecker: fqcn
   [junit4]   2> 1006819 INFO  (searcherExecutor-4808-thread-1) [    ] o.a.s.h.c.SpellCheckComponent Loading spell index for spellchecker: perDict
   [junit4]   2> 1006819 INFO  (searcherExecutor-4808-thread-1) [    ] o.a.s.c.SolrCore [collection1] Registered new searcher Searcher@23ec24ec[collection1] main{ExitableDirectoryReader(UninvertingDirectoryReader())}
   [junit4]   2> 1006819 INFO  (searcherExecutor-4808-thread-1) [    ] o.a.s.h.c.SpellCheckComponent Loading spell index for spellchecker: default
   [junit4]   2> 1006822 INFO  (searcherExecutor-4808-thread-1) [    ] o.a.s.h.c.SpellCheckComponent Loading spell index for spellchecker: default_teststop
   [junit4]   2> 1006824 INFO  (searcherExecutor-4808-thread-1) [    ] o.a.s.h.c.SpellCheckComponent Loading spell index for spellchecker: direct
   [junit4]   2> 1006824 INFO  (searcherExecutor-4808-thread-1) [    ] o.a.s.h.c.SpellCheckComponent Loading spell index for spellchecker: direct_lowerfilt
   [junit4]   2> 1006824 INFO  (searcherExecutor-4808-thread-1) [    ] o.a.s.h.c.SpellCheckComponent Loading spell index for spellchecker: wordbreak
   [junit4]   2> 1006824 INFO  (searcherExecutor-4808-thread-1) [    ] o.a.s.h.c.SpellCheckComponent Loading spell index for spellchecker: threshold
   [junit4]   2> 1006826 INFO  (searcherExecutor-4808-thread-1) [    ] o.a.s.h.c.SpellCheckComponent Loading spell index for spellchecker: threshold_direct
   [junit4]   2> 1006826 INFO  (searcherExecutor-4808-thread-1) [    ] o.a.s.h.c.SpellCheckComponent Loading spell index for spellchecker: multipleFields
   [junit4]   2> 1006829 INFO  (searcherExecutor-4808-thread-1) [    ] o.a.s.h.c.SpellCheckComponent Loading spell index for spellchecker: jarowinkler
   [junit4]   2> 1006831 INFO  (searcherExecutor-4808-thread-1) [    ] o.a.s.h.c.SpellCheckComponent Loading spell index for spellchecker: external
   [junit4]   2> 1006843 INFO  (searcherExecutor-4808-thread-1) [    ] o.a.s.h.c.SpellCheckComponent Loading spell index for spellchecker: freq
   [junit4]   2> 1006845 INFO  (searcherExecutor-4808-thread-1) [    ] o.a.s.h.c.SpellCheckComponent Loading spell index for spellchecker: fqcn
   [junit4]   2> 1006847 INFO  (searcherExecutor-4808-thread-1) [    ] o.a.s.h.c.SpellCheckComponent Loading spell index for spellchecker: perDict
   [junit4]   2> 1006847 INFO  (searcherExecutor-4808-thread-1) [    ] o.a.s.c.SolrCore [collection1] Registered new searcher Searcher@59c04ae8[collection1] main{ExitableDirectoryReader(UninvertingDirectoryReader(Uninverting(_0(6.4.0):C10)))}
   [junit4]   2> 1006847 INFO  (TEST-SpellCheckComponentTest.testThresholdTokenFrequency-seed#[2C9C5343D42D65FE]) [    ] o.a.s.u.p.LogUpdateProcessorFactory [collection1]  webapp=null path=null params={}{commit=} 0 40
   [junit4]   2> 1006849 INFO  (TEST-SpellCheckComponentTest.testThresholdTokenFrequency-seed#[2C9C5343D42D65FE]) [    ] o.a.s.c.S.Request [collection1]  webapp=null path=null params={q=documenq&qt=spellCheckCompRH&spellcheck.dictionary=threshold&spellcheck=true&spellcheck.count=5&wt=xml&spellcheck.extendedResults=true} hits=0 status=0 QTime=0
   [junit4]   2> 1006849 ERROR (TEST-SpellCheckComponentTest.testThresholdTokenFrequency-seed#[2C9C5343D42D65FE]) [    ] o.a.s.SolrTestCaseJ4 query failed JSON validation. error=Path not found: /spellcheck/suggestions/[1]/suggestion
   [junit4]   2>  expected =/spellcheck/suggestions/[1]/suggestion==[{'word':'document','freq':2}]
   [junit4]   2>  response = {
   [junit4]   2>   "responseHeader":{
   [junit4]   2>     "status":0,
   [junit4]   2>     "QTime":0},
   [junit4]   2>   "response":{"numFound":0,"start":0,"docs":[]
   [junit4]   2>   },
   [junit4]   2>   "spellcheck":{
   [junit4]   2>     "suggestions":[],
   [junit4]   2>     "correctlySpelled":false}}
   [junit4]   2> 
   [junit4]   2>  request = q=documenq&qt=spellCheckCompRH&spellcheck.dictionary=threshold&spellcheck=true&spellcheck.count=5&wt=xml&spellcheck.extendedResults=true
   [junit4]   2> 1006849 INFO  (TEST-SpellCheckComponentTest.testThresholdTokenFrequency-seed#[2C9C5343D42D65FE]) [    ] o.a.s.SolrTestCaseJ4 ###Ending testThresholdTokenFrequency
   [junit4]   2> 1006849 INFO  (TEST-SpellCheckComponentTest.testThresholdTokenFrequency-seed#[2C9C5343D42D65FE]) [    ] o.a.s.u.DirectUpdateHandler2 [collection1] REMOVING ALL DOCUMENTS FROM INDEX
   [junit4]   2> 1006850 INFO  (TEST-SpellCheckComponentTest.testThresholdTokenFrequency-seed#[2C9C5343D42D65FE]) [    ] o.a.s.u.p.LogUpdateProcessorFactory [collection1]  webapp=null path=null params={}{deleteByQuery=*:*} 0 0
   [junit4]   2> 1006850 INFO  (TEST-SpellCheckComponentTest.testThresholdTokenFrequency-seed#[2C9C5343D42D65FE]) [    ] o.a.s.u.DirectUpdateHandler2 start commit{,optimize=false,openSearcher=true,waitSearcher=true,expungeDeletes=false,softCommit=false,prepareCommit=false}
   [junit4]   2> 1006850 INFO  (TEST-SpellCheckComponentTest.testThresholdTokenFrequency-seed#[2C9C5343D42D65FE]) [    ] o.a.s.u.SolrIndexWriter Calling setCommitData with IW:org.apache.solr.update.SolrIndexWriter@39de961a
   [junit4]   2> 1006851 INFO  (TEST-SpellCheckComponentTest.testThresholdTokenFrequency-seed#[2C9C5343D42D65FE]) [    ] o.a.s.s.SolrIndexSearcher Opening [Searcher@2eb48459[collection1] main]
   [junit4]   2> 1006851 INFO  (TEST-SpellCheckComponentTest.testThresholdTokenFrequency-seed#[2C9C5343D42D65FE]) [    ] o.a.s.u.DirectUpdateHandler2 end_commit_flush
   [junit4]   2> 1006851 INFO  (searcherExecutor-4808-thread-1) [    ] o.a.s.h.c.SpellCheckComponent Building spell index for spell checker: default
   [junit4]   2> 1006922 INFO  (searcherExecutor-4808-thread-1) [    ] o.a.s.h.c.SpellCheckComponent Building spell index for spell checker: default_teststop
   [junit4]   2> 1006981 INFO  (searcherExecutor-4808-thread-1) [    ] o.a.s.h.c.SpellCheckComponent Building spell index for spell checker: threshold
   [junit4]   2> 1007027 INFO  (searcherExecutor-4808-thread-1) [    ] o.a.s.h.c.SpellCheckComponent Building spell index for spell checker: threshold_direct
   [junit4]   2> 1007027 INFO  (searcherExecutor-4808-thread-1) [    ] o.a.s.h.c.SpellCheckComponent Building spell index for spell checker: multipleFields
   [junit4]   2> 1007059 INFO  (searcherExecutor-4808-thread-1) [    ] o.a.s.h.c.SpellCheckComponent Building spell index for spell checker: freq
   [junit4]   2> 1007127 INFO  (searcherExecutor-4808-thread-1) [    ] o.a.s.h.c.SpellCheckComponent Building spell index for spell checker: fqcn
   [junit4]   2> 1007179 INFO  (searcherExecutor-4808-thread-1) [    ] o.a.s.c.SolrCore [collection1] Registered new searcher Searcher@2eb48459[collection1] main{ExitableDirectoryReader(UninvertingDirectoryReader())}
   [junit4]   2> 1007179 INFO  (TEST-SpellCheckComponentTest.testThresholdTokenFrequency-seed#[2C9C5343D42D65FE]) [    ] o.a.s.u.p.LogUpdateProcessorFactory [collection1]  webapp=null path=null params={}{commit=} 0 328
   [junit4]   2> NOTE: reproduce with: ant test  -Dtestcase=SpellCheckComponentTest -Dtests.method=testThresholdTokenFrequency -Dtests.seed=2C9C5343D42D65FE -Dtests.multiplier=3 -Dtests.slow=true -Dtests.locale=sw-CD -Dtests.timezone=America/Mendoza -Dtests.asserts=true -Dtests.file.encoding=ISO-8859-1
   [junit4] ERROR   0.38s J1 | SpellCheckComponentTest.testThresholdTokenFrequency <<<
   [junit4]    > Throwable #1: java.lang.RuntimeException: Path not found: /spellcheck/suggestions/[1]/suggestion
   [junit4]    > 	at __randomizedtesting.SeedInfo.seed([2C9C5343D42D65FE:A63BDCB25BC65C85]:0)
   [junit4]    > 	at org.apache.solr.SolrTestCaseJ4.assertJQ(SolrTestCaseJ4.java:900)
   [junit4]    > 	at org.apache.solr.SolrTestCaseJ4.assertJQ(SolrTestCaseJ4.java:847)
   [junit4]    > 	at org.apache.solr.handler.component.SpellCheckComponentTest.testThresholdTokenFrequency(SpellCheckComponentTest.java:277)
   [junit4]    > 	at jdk.internal.reflect.NativeMethodAccessorImpl.invoke0(java.base@9-ea/Native Method)
   [junit4]    > 	at jdk.internal.reflect.NativeMethodAccessorImpl.invoke(java.base@9-ea/NativeMethodAccessorImpl.java:62)
   [junit4]    > 	at jdk.internal.reflect.DelegatingMethodAccessorImpl.invoke(java.base@9-ea/DelegatingMethodAccessorImpl.java:43)
   [junit4]    > 	at java.lang.Thread.run(java.base@9-ea/Thread.java:843)
   [junit4]   2> 1007181 INFO  (TEST-SpellCheckComponentTest.testCollate-seed#[2C9C5343D42D65FE]) [    ] o.a.s.SolrTestCaseJ4 ###Starting testCollate
   [junit4]   2> 1007182 INFO  (TEST-SpellCheckComponentTest.testCollate-seed#[2C9C5343D42D65FE]) [    ] o.a.s.u.p.LogUpdateProcessorFactory [collection1]  webapp=null path=null params={}{add=[0]} 0 0
   [junit4]   2> 1007182 INFO  (TEST-SpellCheckComponentTest.testCollate-seed#[2C9C5343D42D65FE]) [    ] o.a.s.u.p.LogUpdateProcessorFactory [collection1]  webapp=null path=null params={}{add=[1]} 0 0
   [junit4]   2> 1007182 INFO  (TEST-SpellCheckComponentTest.testCollate-seed#[2C9C5343D42D65FE]) [    ] o.a.s.u.p.LogUpdateProcessorFactory [collection1]  webapp=null path=null params={}{add=[2]} 0 0
   [junit4]   2> 1007182 INFO  (TEST-SpellCheckComponentTest.testCollate-seed#[2C9C5343D42D65FE]) [    ] o.a.s.u.p.LogUpdateProcessorFactory [collection1]  webapp=null path=null params={}{add=[3]} 0 0
   [junit4]   2> 1007183 INFO  (TEST-SpellCheckComponentTest.testCollate-seed#[2C9C5343D42D65FE]) [    ] o.a.s.u.p.LogUpdateProcessorFactory [collection1]  webapp=null path=null params={}{add=[4]} 0 0
   [junit4]   2> 1007183 INFO  (TEST-SpellCheckComponentTest.testCollate-seed#[2C9C5343D42D65FE]) [    ] o.a.s.u.p.LogUpdateProcessorFactory [collection1]  webapp=null path=null params={}{add=[5]} 0 0
   [junit4]   2> 1007183 INFO  (TEST-SpellCheckComponentTest.testCollate-seed#[2C9C5343D42D65FE]) [    ] o.a.s.u.p.LogUpdateProcessorFactory [collection1]  webapp=null path=null params={}{add=[6]} 0 0
   [junit4]   2> 1007183 INFO  (TEST-SpellCheckComponentTest.testCollate-seed#[2C9C5343D42D65FE]) [    ] o.a.s.u.p.LogUpdateProcessorFactory [collection1]  webapp=null path=null params={}{add=[7]} 0 0
   [junit4]   2> 1007183 INFO  (TEST-SpellCheckComponentTest.testCollate-seed#[2C9C5343D42D65FE]) [    ] o.a.s.u.p.LogUpdateProcessorFactory [collection1]  webapp=null path=null params={}{add=[8]} 0 0
   [junit4]   2> 1007183 INFO  (TEST-SpellCheckComponentTest.testCollate-seed#[2C9C5343D42D65FE]) [    ] o.a.s.u.p.LogUpdateProcessorFactory [collection1]  webapp=null path=null params={}{add=[9]} 0 0
   [junit4]   2> 1007184 INFO  (TEST-SpellCheckComponentTest.testCollate-seed#[2C9C5343D42D65FE]) [    ] o.a.s.u.DirectUpdateHandler2 start commit{,optimize=false,openSearcher=true,waitSearcher=true,expungeDeletes=false,softCommit=false,prepareCommit=false}
   [junit4]   2> 1007184 INFO  (TEST-SpellCheckComponentTest.testCollate-seed#[2C9C5343D42D65FE]) [    ] o.a.s.u.SolrIndexWriter Calling setCommitData with IW:org.apache.solr.update.SolrIndexWriter@39de961a
   [junit4]   2> 1007186 INFO  (TEST-SpellCheckComponentTest.testCollate-seed#[2C9C5343D42D65FE]) [    ] o.a.s.s.SolrIndexSearcher Opening [Searcher@4f99a908[collection1] main]
   [junit4]   2> 1007186 INFO  (TEST-SpellCheckComponentTest.testCollate-seed#[2C9C5343D42D65FE]) [    ] o.a.s.u.DirectUpdateHandler2 end_commit_flush
   [junit4]   2> 1007186 INFO  (searcherExecutor-4808-thread-1) [    ] o.a.s.h.c.SpellCheckComponent Building spell index for spell checker: default
   [junit4]   2> 1007369 INFO  (searcherExecutor-4808-thread-1) [    ] o.a.s.h.c.SpellCheckComponent Building spell index for spell checker: default_teststop
   [junit4]   2> 1007433 INFO  (searcherExecutor-4808-thread-1) [    ] o.a.s.h.c.SpellCheckComponent Building spell index for spell checker: threshold
   [junit4]   2> 1007596 INFO  (searcherExecutor-4808-thread-1) [    ] o.a.s.h.c.SpellCheckComponent Building spell index for spell checker: threshold_direct
   [junit4]   2> 1007596 INFO  (searcherExecutor-4808-thread-1) [    ] o.a.s.h.c.SpellCheckComponent Building spell index for spell checker: multipleFields
   [junit4]   2> 1007710 INFO  (searcherExecutor-4808-thread-1) [    ] o.a.s.h.c.SpellCheckComponent Building spell index for spell checker: freq
   [junit4]   2> 1007832 INFO  (searcherExecutor-4808-thread-1) [    ] o.a.s.h.c.SpellCheckComponent Building spell index for spell checker: fqcn
   [junit4]   2> 1007995 INFO  (searcherExecutor-4808-thread-1) [    ] o.a.s.c.SolrCore [collection1] Registered new searcher Searcher@4f99a908[collection1] main{ExitableDirectoryReader(UninvertingDirectoryReader(Uninverting(_1(6.4.0):C10)))}
   [junit4]   2> 1007995 INFO  (TEST-SpellCheckComponentTest.testCollate-seed#[2C9C5343D42D65FE]) [    ] o.a.s.u.p.LogUpdateProcessorFactory [collection1]  webapp=null path=null params={}{commit=} 0 811
   [junit4]   2> 1008151 INFO  (TEST-SpellCheckComponentTest.testCollate-seed#[2C9C5343D42D65FE]) [    ] o.a.s.c.S.Request [collection1]  webapp=null path=null params={q=documemt&qt=spellCheckCompRH&json.nl=map&spellcheck=true&wt=xml&spellcheck.build=true&spellcheck.collate=true} hits=0 status=0 QTime=155
   [junit4]   2> 1008152 INFO  (TEST-SpellCheckComponentTest.testCollate-seed#[2C9C5343D42D65FE]) [    ] o.a.s.c.S.Request [collection1]  webapp=null path=null params={q=documemt+lowerfilt:broen^4&qt=spellCheckCompRH&json.nl=map&spellcheck=true&wt=xml&spellcheck.collate=true} hits=0 status=0 QTime=0
   [junit4]   2> 1008152 INFO  (TEST-SpellCheckComponentTest.testCollate-seed#[2C9C5343D42D65FE]) [    ] o.a.s.c.S.Request [collection1]  webapp=null path=null params={q=documemtsss+broens&qt=spellCheckCompRH&json.nl=map&spellcheck=true&wt=xml&spellcheck.collate=true} hits=0 status=0 QTime=0
   [junit4]   2> 1008153 INFO  (TEST-SpellCheckComponentTest.testCollate-seed#[2C9C5343D42D65FE]) [    ] o.a.s.c.S.Request [collection1]  webapp=null path=null params={q=pixma&qt=spellCheckCompRH&json.nl=map&spellcheck=true&wt=xml&spellcheck.collate=true} hits=0 status=0 QTime=0
   [junit4]   2> 1008153 INFO  (TEST-SpellCheckComponentTest.testCollate-seed#[2C9C5343D42D65FE]) [    ] o.a.s.SolrTestCaseJ4 ###Ending testCollate
   [junit4]   2> 1008153 INFO  (TEST-SpellCheckComponentTest.testCollate-seed#[2C9C5343D42D65FE]) [    ] o.a.s.u.DirectUpdateHandler2 [collection1] REMOVING ALL DOCUMENTS FROM INDEX
   [junit4]   2> 1008153 INFO  (TEST-SpellCheckComponentTest.testCollate-seed#[2C9C5343D42D65FE]) [    ] o.a.s.u.p.LogUpdateProcessorFactory [collection1]  webapp=null path=null params={}{deleteByQuery=*:*} 0 0
   [junit4]   2> 1008153 INFO  (TEST-SpellCheckComponentTest.testCollate-seed#[2C9C5343D42D65FE]) [    ] o.a.s.u.DirectUpdateHandler2 start commit{,optimize=false,openSearcher=true,waitSearcher=true,expungeDeletes=false,softCommit=false,prepareCommit=false}
   [junit4]   2> 1008154 INFO  (TEST-SpellCheckComponentTest.testCollate-seed#[2C9C5343D42D65FE]) [    ] o.a.s.u.SolrIndexWriter Calling setCommitData with IW:org.apache.solr.update.SolrIndexWriter@39de961a
   [junit4]   2> 1008154 INFO  (TEST-SpellCheckComponentTest.testCollate-seed#[2C9C5343D42D65FE]) [    ] o.a.s.s.SolrIndexSearcher Opening [Searcher@796f03cc[collection1] main]
   [junit4]   2> 1008154 INFO  (TEST-SpellCheckComponentTest.testCollate-seed#[2C9C5343D42D65FE]) [    ] o.a.s.u.DirectUpdateHandler2 end_commit_flush
   [junit4]   2> 1008154 INFO  (searcherExecutor-4808-thread-1) [    ] o.a.s.h.c.SpellCheckComponent Building spell index for spell checker: default
   [junit4]   2> 1008209 INFO  (searcherExecutor-4808-thread-1) [    ] o.a.s.h.c.SpellCheckComponent Building spell index for spell checker: default_teststop
   [junit4]   2> 1008254 INFO  (searcherExecutor-4808-thread-1) [    ] o.a.s.h.c.SpellCheckComponent Building spell index for spell checker: threshold
   [junit4]   2> 1008289 INFO  (searcherExecutor-4808-thread-1) [    ] o.a.s.h.c.SpellCheckComponent Building spell index for spell checker: threshold_direct
   [junit4]   2> 1008289 INFO  (searcherExecutor-4808-thread-1) [    ] o.a.s.h.c.SpellCheckComponent Building spell index for spell checker: multipleFields
   [junit4]   2> 1008356 INFO  (searcherExecutor-4808-thread-1) [    ] o.a.s.h.c.SpellCheckComponent Building spell index for spell checker: freq
   [junit4]   2> 1008406 INFO  (searcherExecutor-4808-thread-1) [    ] o.a.s.h.c.SpellCheckComponent Building spell index for spell checker: fqcn
   [junit4]   2> 1008448 INFO  (searcherExecutor-4808-thread-1) [    ] o.a.s.c.SolrCore [collection1] Registered new searcher Searcher@796f03cc[collection1] main{ExitableDirectoryReader(UninvertingDirectoryReader())}
   [junit4]   2> 1008448 INFO  (TEST-SpellCheckComponentTest.testCollate-seed#[2C9C5343D42D65FE]) [    ] o.a.s.u.p.LogUpdateProcessorFactory [collection1]  webapp=null path=null params={}{commit=} 0 294
   [junit4]   2> 1008449 INFO  (TEST-SpellCheckComponentTest.testRelativeIndexDirLocation-seed#[2C9C5343D42D65FE]) [    ] o.a.s.SolrTestCaseJ4 ###Starting testRelativeIndexDirLocation
   [junit4]   2> 1008450 INFO  (TEST-SpellCheckComponentTest.testRelativeIndexDirLocation-seed#[2C9C5343D42D65FE]) [    ] o.a.s.u.p.LogUpdateProcessorFactory [collection1]  webapp=null path=null params={}{add=[0]} 0 0
   [junit4]   2> 1008450 INFO  (TEST-SpellCheckComponentTest.testRelativeIndexDirLocation-seed#[2C9C5343D42D65FE]) [    ] o.a.s.u.p.LogUpdateProcessorFactory [collection1]  webapp=null path=null params={}{add=[1]} 0 0
   [junit4]   2> 1008450 INFO  (TEST-SpellCheckComponentTest.testRelativeIndexDirLocation-seed#[2C9C5343D42D65FE]) [    ] o.a.s.u.p.LogUpdateProcessorFactory [collection1]  webapp=null path=null params={}{add=[2]} 0 0
   [junit4]   2> 1008450 INFO  (TEST-SpellCheckComponentTest.testRelativeIndexDirLocation-seed#[2C9C5343D42D65FE]) [    ] o.a.s.u.p.LogUpdateProcessorFactory [collection1]  webapp=null path=null params={}{add=[3]} 0 0
   [junit4]   2> 1008450 INFO  (TEST-SpellCheckComponentTest.testRelativeIndexDirLocation-seed#[2C9C5343D42D65FE]) [    ] o.a.s.u.p.LogUpdateProcessorFactory [collection1]  webapp=null path=null params={}{add=[4]} 0 0
   [junit4]   2> 1008451 INFO  (TEST-SpellCheckComponentTest.testRelativeIndexDirLocation-seed#[2C9C5343D42D65FE]) [    ] o.a.s.u.p.LogUpdateProcessorFactory [collection1]  webapp=null path=null params={}{add=[5]} 0 0
   [junit4]   2> 1008451 INFO  (TEST-SpellCheckComponentTest.testRelativeIndexDirLocation-seed#[2C9C5343D42D65FE]) [    ] o.a.s.u.p.LogUpdateProcessorFactory [collection1]  webapp=null path=null params={}{add=[6]} 0 0
   [junit4]   2> 1008451 INFO  (TEST-SpellCheckComponentTest.testRelativeIndexDirLocation-seed#[2C9C5343D42D65FE]) [    ] o.a.s.u.p.LogUpdateProcessorFactory [collection1]  webapp=null path=null params={}{add=[7]} 0 0
   [junit4]   2> 1008451 INFO  (TEST-SpellCheckComponentTest.testRelativeIndexDirLocation-seed#[2C9C5343D42D65FE]) [    ] o.a.s.u.p.LogUpdateProcessorFactory [collection1]  webapp=null path=null params={}{add=[8]} 0 0
   [junit4]   2> 1008451 INFO  (TEST-SpellCheckComponentTest.testRelativeIndexDirLocation-seed#[2C9C5343D42D65FE]) [    ] o.a.s.u.p.LogUpdateProcessorFactory [collection1]  webapp=null path=null params={}{add=[9]} 0 0
   [junit4]   2> 1008451 INFO  (TEST-SpellCheckComponentTest.testRelativeIndexDirLocation-seed#[2C9C5343D42D65FE]) [    ] o.a.s.u.DirectUpdateHandler2 start commit{,optimize=false,openSearcher=true,waitSearcher=true,expungeDeletes=false,softCommit=false,prepareCommit=false}
   [junit4]   2> 1008451 INFO  (TEST-SpellCheckComponentTest.testRelativeIndexDirLocation-seed#[2C9C5343D42D65FE]) [    ] o.a.s.u.SolrIndexWriter Calling setCommitData with IW:org.apache.solr.update.SolrIndexWriter@39de961a
   [junit4]   2> 1008453 INFO  (TEST-SpellCheckComponentTest.testRelativeIndexDirLocation-seed#[2C9C5343D42D65FE]) [    ] o.a.s.s.SolrIndexSearcher Opening [Searcher@7ad443c8[collection1] main]
   [junit4]   2> 1008453 INFO  (TEST-SpellCheckComponentTest.testRelativeIndexDirLocation-seed#[2C9C5343D42D65FE]) [    ] o.a.s.u.DirectUpdateHandler2 end_commit_flush
   [junit4]   2> 1008453 INFO  (searcherExecutor-4808-thread-1) [    ] o.a.s.h.c.SpellCheckComponent Building spell index for spell checker: default
   [junit4]   2> 1008641 INFO  (searcherExecutor-4808-thread-1) [    ] o.a.s.h.c.SpellCheckComponent Building spell index for spell checker: default_teststop
   [junit4]   2> 1008693 INFO  (searcherExecutor-4808-thread-1) [    ] o.a.s.h.c.SpellCheckComponent Building spell index for spell checker: threshold
   [junit4]   2> 1008857 INFO  (searcherExecutor-4808-thread-1) [    ] o.a.s.h.c.SpellCheckComponent Building spell index for spell checker: threshold_direct
   [junit4]   2> 1008858 INFO  (searcherExecutor-4808-thread-1) [    ] o.a.s.h.c.SpellCheckComponent Building spell index for spell checker: multipleFields
   [junit4]   2> 1009013 INFO  (searcherExecutor-4808-thread-1) [    ] o.a.s.h.c.SpellCheckComponent Building spell index for spell checker: freq
   [junit4]   2> 1009179 INFO  (searcherExecutor-4808-thread-1) [    ] o.a.s.h.c.SpellCheckComponent Building spell index for spell checker: fqcn
   [junit4]   2> 1009362 INFO  (searcherExecutor-4808-thread-1) [    ] o.a.s.c.SolrCore [collection1] Registered new searcher Searcher@7ad443c8[collection1] main{ExitableDirectoryReader(UninvertingDirectoryReader(Uninverting(_2(6.4.0):C10)))}
   [junit4]   2> 1009362 INFO  (TEST-SpellCheckComponentTest.testRelativeIndexDirLocation-seed#[2C9C5343D42D65FE]) [    ] o.a.s.u.p.LogUpdateProcessorFactory [collection1]  webapp=null path=null params={}{commit=} 0 910
   [junit4]   2> 1009363 INFO  (TEST-SpellCheckComponentTest.testRelativeIndexDirLocation-seed#[2C9C5343D42D65FE]) [    ] o.a.s.SolrTestCaseJ4 ###Ending testRelativeIndexDirLocation
   [junit4]   2> 1009363 INFO  (TEST-SpellCheckComponentTest.testRelativeIndexDirLocation-seed#[2C9C5343D42D65FE]) [    ] o.a.s.u.DirectUpdateHandler2 [collection1] REMOVING ALL DOCUMENTS FROM INDEX
   [junit4]   2> 1009363 INFO  (TEST-SpellCheckComponentTest.testRelativeIndexDirLocation-seed#[2C9C5343D42D65FE]) [    ] o.a.s.u.p.LogUpdateProcessorFactory [collection1]  webapp=null path=null params={}{deleteByQuery=*:*} 0 0
   [junit4]   2> 1009363 INFO  (TEST-SpellCheckComponentTest.testRelativeIndexDirLocation-seed#[2C9C5343D42D65FE]) [    ] o.a.s.u.DirectUpdateHandler2 start commit{,optimize=false,openSearcher=true,waitSearcher=true,expungeDeletes=false,softCommit=false,prepareCommit=false}
   [junit4]   2> 1009363 INFO  (TEST-SpellCheckComponentTest.testRelativeIndexDirLocation-seed#[2C9C5343D42D65FE]) [    ] o.a.s.u.SolrIndexWriter Calling setCommitData with IW:org.apache.solr.update.SolrIndexWriter@39de961a
   [junit4]   2> 1009363 INFO  (TEST-SpellCheckComponentTest.testRelativeIndexDirLocation-seed#[2C9C5343D42D65FE]) [    ] o.a.s.s.SolrIndexSearcher Opening [Searcher@34e9aa73[collection1] main]
   [junit4]   2> 1009364 INFO  (TEST-SpellCheckComponentTest.testRelativeIndexDirLocation-seed#[2C9C5343D42D65FE]) [    ] o.a.s.u.DirectUpdateHandler2 end_commit_flush
   [junit4]   2> 1009364 INFO  (searcherExecutor-4808-thread-1) [    ] o.a.s.h.c.SpellCheckComponent Building spell index for spell checker: default
   [junit4]   2> 1009417 INFO  (searcherExecutor-4808-thread-1) [    ] o.a.s.h.c.SpellCheckComponent Building spell index for spell checker: default_teststop
   [junit4]   2> 1009467 INFO  (searcherExecutor-4808-thread-1) [    ] o.a.s.h.c.SpellCheckComponent Building spell index for spell checker: threshold
   [junit4]   2> 1009532 INFO  (searcherExecutor-4808-thread-1) [    ] o.a.s.h.c.SpellCheckComponent Building spell index for spell checker: threshold_direct
   [junit4]   2> 1009532 INFO  (searcherExecutor-4808-thread-1) [    ] o.a.s.h.c.SpellCheckComponent Building spell index for spell checker: multipleFields
   [junit4]   2> 1009589 INFO  (searcherExecutor-4808-thread-1) [    ] o.a.s.h.c.SpellCheckComponent Building spell index for spell checker: freq
   [junit4]   2> 1009631 INFO  (searcherExecutor-4808-thread-1) [    ] o.a.s.h.c.SpellCheckComponent Building spell index for spell checker: fqcn
   [junit4]   2> 1009679 INFO  (searcherExecutor-4808-thread-1) [    ] o.a.s.c.SolrCore [collection1] Registered new searcher Searcher@34e9aa73[collection1] main{ExitableDirectoryReader(UninvertingDirectoryReader())}
   [junit4]   2> 1009679 INFO  (TEST-SpellCheckComponentTest.testRelativeIndexDirLocation-seed#[2C9C5343D42D65FE]) [    ] o.a.s.u.p.LogUpdateProcessorFactory [collection1]  webapp=null path=null params={}{commit=} 0 315
   [junit4]   2> 1009680 INFO  (TEST-SpellCheckComponentTest.testCorrectSpelling-seed#[2C9C5343D42D65FE]) [    ] o.a.s.SolrTestCaseJ4 ###Starting testCorrectSpelling
   [junit4]   2> 1009681 INFO  (TEST-SpellCheckComponentTest.testCorrectSpelling-seed#[2C9C5343D42D65FE]) [    ] o.a.s.u.p.LogUpdateProcessorFactory [collection1]  webapp=null path=null params={}{add=[0]} 0 0
   [junit4]   2> 1009681 INFO  (TEST-SpellCheckComponentTest.testCorrectSpelling-seed#[2C9C5343D42D65FE]) [    ] o.a.s.u.p.LogUpdateProcessorFactory [collection1]  webapp=null path=null params={}{add=[1]} 0 0
   [junit4]   2> 1009681 INFO  (TEST-SpellCheckComponentTest.testCorrectSpelling-seed#[2C9C5343D42D65FE]) [    ] o.a.s.u.p.LogUpdateProcessorFactory [collection1]  webapp=null path=null params={}{add=[2]} 0 0
   [junit4]   2> 1009682 INFO  (TEST-SpellCheckComponentTest.testCorrectSpelling-seed#[2C9C5343D42D65FE]) [    ] o.a.s.u.p.LogUpdateProcessorFactory [collection1]  webapp=null path=null params={}{add=[3]} 0 0
   [junit4]   2> 1009682 INFO  (TEST-SpellCheckComponentTest.testCorrectSpelling-seed#[2C9C5343D42D65FE]) [    ] o.a.s.u.p.LogUpdateProcessorFactory [collection1]  webapp=null path=null params={}{add=[4]} 0 0
   [junit4]   2> 1009682 INFO  (TEST-SpellCheckComponentTest.testCorrectSpelling-seed#[2C9C5343D42D65FE]) [    ] o.a.s.u.p.LogUpdateProcessorFactory [collection1]  webapp=null path=null params={}{add=[5]} 0 0
   [junit4]   2> 1009682 INFO  (TEST-SpellCheckComponentTest.testCorrectSpelling-seed#[2C9C5343D42D65FE]) [    ] o.a.s.u.p.LogUpdateProcessorFactory [collection1]  webapp=null path=null params={}{add=[6]} 0 0
   [junit4]   2> 1009682 INFO  (TEST-SpellCheckComponentTest.testCorrectSpelling-seed#[2C9C5343D42D65FE]) [    ] o.a.s.u.p.LogUpdateProcessorFactory [collection1]  webapp=null path=null params={}{add=[7]} 0 0
   [junit4]   2> 1009683 INFO  (TEST-SpellCheckComponentTest.testCorrectSpelling-seed#[2C9C5343D42D65FE]) [    ] o.a.s.u.p.LogUpdateProcessorFactory [collection1]  webapp=null path=null params={}{add=[8]} 0 0
   [junit4]   2> 1009683 INFO  (TEST-SpellCheckComponentTest.testCorrectSpelling-seed#[2C9C5343D42D65FE]) [    ] o.a.s.u.p.LogUpdateProcessorFactory [collection1]  webapp=null path=null params={}{add=[9]} 0 0
   [junit4]   2> 1009683 INFO  (TEST-SpellCheckComponentTest.testCorrectSpelling-seed#[2C9C5343D42D65FE]) [    ] o.a.s.u.DirectUpdateHandler2 start commit{,optimize=false,openSearcher=true,waitSearcher=true,expungeDeletes=false,softCommit=false,prepareCommit=false}
   [junit4]   2> 1009683 INFO  (TEST-SpellCheckComponentTest.testCorrectSpelling-seed#[2C9C5343D42D65FE]) [    ] o.a.s.u.SolrIndexWriter Calling setCommitData with IW:org.apache.solr.update.SolrIndexWriter@39de961a
   [junit4]   2> 1009685 INFO  (TEST-SpellCheckComponentTest.testCorrectSpelling-seed#[2C9C5343D42D65FE]) [    ] o.a.s.s.SolrIndexSearcher Opening [Searcher@463f974a[collection1] main]
   [junit4]   2> 1009685 INFO  (TEST-SpellCheckComponentTest.testCorrectSpelling-seed#[2C9C5343D42D65FE]) [    ] o.a.s.u.DirectUpdateHandler2 end_commit_flush
   [junit4]   2> 1009685 INFO  (searcherExecutor-4808-thread-1) [    ] o.a.s.h.c.SpellCheckComponent Building spell index for spell checker: default
   [junit4]   2> 1009843 INFO  (searcherExecutor-4808-thread-1) [    ] o.a.s.h.c.SpellCheckComponent Building spell index for spell checker: default_teststop
   [junit4]   2> 1009914 INFO  (searcherExecutor-4808-thread-1) [    ] o.a.s.h.c.SpellCheckComponent Building spell index for spell checker: threshold
   [junit4]   2> 1010099 INFO  (searcherExecutor-4808-thread-1) [    ] o.a.s.h.c.SpellCheckComponent Building spell index for spell checker: threshold_direct
   [junit4]   2> 1010099 INFO  (searcherExecutor-4808-thread-1) [    ] o.a.s.h.c.SpellCheckComponent Building spell index for spell checker: multipleFields
   [junit4]   2> 1010242 INFO  (searcherExecutor-4808-thread-1) [    ] o.a.s.h.c.SpellCheckComponent Building spell index for spell checker: freq
   [junit4]   2> 1010360 INFO  (searcherExecutor-4808-thread-1) [    ] o.a.s.h.c.SpellCheckComponent Building spell index for spell checker: fqcn
   [junit4]   2> 1010522 INFO  (searcherExecutor-4808-thread-1) [    ] o.a.s.c.SolrCore [collection1] Registered new searcher Searcher@463f974a[collection1] main{ExitableDirectoryReader(UninvertingDirectoryReader(Uninverting(_3(6.4.0):C10)))}
   [junit4]   2> 1010530 INFO  (TEST-SpellCheckComponentTest.testCorrectSpelling-seed#[2C9C5343D42D65FE]) [    ] o.a.s.u.p.LogUpdateProcessorFactory [collection1]  webapp=null path=null params={}{commit=} 0 847
   [junit4]   2> 1010531 INFO  (TEST-SpellCheckComponentTest.testCorrectSpelling-seed#[2C9C5343D42D65FE]) [    ] o.a.s.c.S.Request [collection1]  webapp=null path=null params={q=lowerfilt:lazy+lowerfilt:brown&qt=spellCheckCompRH&json.nl=map&spellcheck=true&wt=xml&spellcheck.extendedResults=true} hits=1 status=0 QTime=0
   [junit4]   2> 1010531 INFO  (TEST-SpellCheckComponentTest.testCorrectSpelling-seed#[2C9C5343D42D65FE]) [    ] o.a.s.c.S.Request [collection1]  webapp=null path=null params={q=lowerfilt:lazy+lowerfilt:brown&qt=spellCheckCompRH&spellcheck.dictionary=direct_lowerfilt&json.nl=map&spellcheck=true&wt=xml&spellcheck.extendedResults=true} hits=1 status=0 QTime=0
   [junit4]   2> 1010533 INFO  (TEST-SpellCheckComponentTest.testCorrectSpelling-seed#[2C9C5343D42D65FE]) [    ] o.a.s.c.S.Request [collection1]  webapp=null path=null params={q=lakkle&qt=spellCheckCompRH&spellcheck.dictionary=direct_lowerfilt&json.nl=map&spellcheck=true&wt=xml&spellcheck.extendedResults=true} hits=0 status=0 QTime=1
   [junit4]   2> 1010533 INFO  (TEST-SpellCheckComponentTest.testCorrectSpelling-seed#[2C9C5343D42D65FE]) [    ] o.a.s.SolrTestCaseJ4 ###Ending testCorrectSpelling
   [junit4]   2> 1010533 INFO  (TEST-SpellCheckComponentTest.testCorrectSpelling-seed#[2C9C5343D42D65FE]) [    ] o.a.s.u.DirectUpdateHandler2 [collection1] REMOVING ALL DOCUMENTS FROM INDEX
   [junit4]   2> 1010533 INFO  (TEST-SpellCheckComponentTest.testCorrectSpelling-seed#[2C9C5343D42D65FE]) [    ] o.a.s.u.p.LogUpdateProcessorFactory [collection1]  webapp=null path=null params={}{deleteByQuery=*:*} 0 0
   [junit4]   2> 1010533 INFO  (TEST-SpellCheckComponentTest.testCorrectSpelling-seed#[2C9C5343D42D65FE]) [    ] o.a.s.u.DirectUpdateHandler2 start commit{,optimize=false,openSearcher=true,waitSearcher=true,expungeDeletes=false,softCommit=false,prepareCommit=false}
   [junit4]   2> 1010533 INFO  (TEST-SpellCheckComponentTest.testCorrectSpelling-seed#[2C9C5343D42D65FE]) [    ] o.a.s.u.SolrIndexWriter Calling setCommitData with IW:org.apache.solr.update.SolrIndexWriter@39de961a
   [junit4]   2> 1010533 INFO  (TEST-SpellCheckComponentTest.testCorrectSpelling-seed#[2C9C5343D42D65FE]) [    ] o.a.s.s.SolrIndexSearcher Opening [Searcher@1be6b924[collection1] main]
   [junit4]   2> 1010534 INFO  (TEST-SpellCheckComponentTest.testCorrectSpelling-seed#[2C9C5343D42D65FE]) [    ] o.a.s.u.DirectUpdateHandler2 end_commit_flush
   [junit4]   2> 1010534 INFO  (searcherExecutor-4808-thread-1) [    ] o.a.s.h.c.SpellCheckComponent Building spell index for spell checker: default
   [junit4]   2> 1010576 INFO  (searcherExecutor-4808-thread-1) [    ] o.a.s.h.c.SpellCheckComponent Building spell index for spell checker: default_teststop
   [junit4]   2> 1010642 INFO  (searcherExecutor-4808-thread-1) [    ] o.a.s.h.c.SpellCheckComponent Building spell index for spell checker: threshold
   [junit4]   2> 1010694 INFO  (searcherExecutor-4808-thread-1) [    ] o.a.s.h.c.SpellCheckComponent Building spell index for spell checker: threshold_direct
   [junit4]   2> 1010694 INFO  (searcherExecutor-4808-thread-1) [    ] o.a.s.h.c.SpellCheckComponent Building spell index for spell checker: multipleFields
   [junit4]   2> 1010745 INFO  (searcherExecutor-4808-thread-1) [    ] o.a.s.h.c.SpellCheckComponent Building spell index for spell checker: freq
   [junit4]   2> 1010808 INFO  (searcherExecutor-4808-thread-1) [    ] o.a.s.h.c.SpellCheckComponent Building spell index for spell checker: fqcn
   [junit4]   2> 1010849 INFO  (searcherExecutor-4808-thread-1) [    ] o.a.s.c.SolrCore [collection1] Registered new searcher Searcher@1be6b924[collection1] main{ExitableDirectoryReader(UninvertingDirectoryReader())}
   [junit4]   2> 1010849 INFO  (TEST-SpellCheckComponentTest.testCorrectSpelling-seed#[2C9C5343D42D65FE]) [    ] o.a.s.u.p.LogUpdateProcessorFactory [collection1]  webapp=null path=null params={}{commit=} 0 316
   [junit4]   2> 1010851 INFO  (TEST-SpellCheckComponentTest.test-seed#[2C9C5343D42D65FE]) [    ] o.a.s.SolrTestCaseJ4 ###Starting test
   [junit4]   2> 1010851 INFO  (TEST-SpellCheckComponentTest.test-seed#[2C9C5343D42D65FE]) [    ] o.a.s.u.p.LogUpdateProcessorFactory [collection1]  webapp=null path=null params={}{add=[0]} 0 0
   [junit4]   2> 1010852 INFO  (TEST-SpellCheckComponentTest.test-seed#[2C9C5343D42D65FE]) [    ] o.a.s.u.p.LogUpdateProcessorFactory [collection1]  webapp=null path=null params={}{add=[1]} 0 0
   [junit4]   2> 1010852 INFO  (TEST-SpellCheckComponentTest.test-seed#[2C9C5343D42D65FE]) [    ] o.a.s.u.p.LogUpdateProcessorFactory [collection1]  webapp=null path=null params={}{add=[2]} 0 0
   [junit4]   2> 1010852 INFO  (TEST-SpellCheckComponentTest.test-seed#[2C9C5343D42D65FE]) [    ] o.a.s.u.p.LogUpdateProcessorFactory [collection1]  webapp=null path=null params={}{add=[3]} 0 0
   [junit4]   2> 1010852 INFO  (TEST-SpellCheckComponentTest.test-seed#[2C9C5343D42D65FE]) [    ] o.a.s.u.p.LogUpdateProcessorFactory [collection1]  webapp=null path=null params={}{add=[4]} 0 0
   [junit4]   2> 1010852 INFO  (TEST-SpellCheckComponentTest.test-seed#[2C9C5343D42D65FE]) [    ] o.a.s.u.p.LogUpdateProcessorFactory [collection1]  webapp=null path=null params={}{add=[5]} 0 0
   [junit4]   2> 1010852 INFO  (TEST-SpellCheckComponentTest.test-seed#[2C9C5343D42D65FE]) [    ] o.a.s.u.p.LogUpdateProcessorFactory [collection1]  webapp=null path=null params={}{add=[6]} 0 0
   [junit4]   2> 1010853 INFO  (TEST-SpellCheckComponentTest.test-seed#[2C9C5343D42D65FE]) [    ] o.a.s.u.p.LogUpdateProcessorFactory [collection1]  webapp=null path=null params={}{add=[7]} 0 0
   [junit4]   2> 1010853 INFO  (TEST-SpellCheckComponentTest.test-seed#[2C9C5343D42D65FE]) [    ] o.a.s.u.p.LogUpdateProcessorFactory [collection1]  webapp=null path=null params={}{add=[8]} 0 0
   [junit4]   2> 1010853 INFO  (TEST-SpellCheckComponentTest.test-seed#[2C9C5343D42D65FE]) [    ] o.a.s.u.p.LogUpdateProcessorFactory [collection1]  webapp=null path=null params={}{add=[9]} 0 0
   [junit4]   2> 1010853 INFO  (TEST-SpellCheckComponentTest.test-seed#[2C9C5343D42D65FE]) [    ] o.a.s.u.DirectUpdateHandler2 start commit{,optimize=false,openSearcher=true,waitSearcher=true,expungeDeletes=false,softCommit=false,prepareCommit=false}
   [junit4]   2> 1010853 INFO  (TEST-SpellCheckComponentTest.test-seed#[2C9C5343D42D65FE]) [    ] o.a.s.u.SolrIndexWriter Calling setCommitData with IW:org.apache.solr.update.SolrIndexWriter@39de961a
   [junit4]   2> 1010855 INFO  (TEST-SpellCheckComponentTest.test-seed#[2C9C5343D42D65FE]) [    ] o.a.s.s.SolrIndexSearcher Opening [Searcher@95a7518[collection1] main]
   [junit4]   2> 1010856 INFO  (TEST-SpellCheckComponentTest.test-seed#[2C9C5343D42D65FE]) [    ] o.a.s.u.DirectUpdateHandler2 end_commit_flush
   [junit4]   2> 1010856 INFO  (searcherExecutor-4808-thread-1) [    ] o.a.s.h.c.SpellCheckComponent Building spell index for spell checker: default
   [junit4]   2> 1011058 INFO  (searcherExecutor-4808-thread-1) [    ] o.a.s.h.c.SpellCheckComponent Building spell index for spell checker: default_teststop
   [junit4]   2> 1011163 INFO  (searcherExecutor-4808-thread-1) [    ] o.a.s.h.c.SpellCheckComponent Building spell index for spell checker: threshold
   [junit4]   2> 1011686 INFO  (searcherExecutor-4808-thread-1) [    ] o.a.s.h.c.SpellCheckComponent Building spell index for spell checker: threshold_direct
   [junit4]   2> 1011686 INFO  (searcherExecutor-4808-thread-1) [    ] o.a.s.h.c.SpellCheckComponent Building spell index for spell checker: multipleFields
   [junit4]   2> 1011900 INFO  (searcherExecutor-4808-thread-1) [    ] o.a.s.h.c.SpellCheckComponent Building spell index for spell checker: freq
   [junit4]   2> 1012120 INFO  (searcherExecutor-4808-thread-1) [    ] o.a.s.h.c.SpellCheckComponent Building spell index for spell checker: fqcn
   [junit4]   2> 1012251 INFO  (searcherExecutor-4808-thread-1) [    ] o.a.s.c.SolrCore [collection1] Registered new searcher Searcher@95a7518[collection1] main{ExitableDirectoryReader(UninvertingDirectoryReader(Uninverting(_4(6.4.0):C10)))}
   [junit4]   2> 1012252 INFO  (TEST-SpellCheckComponentTest.test-seed#[2C9C5343D42D65FE]) [    ] o.a.s.u.p.LogUpdateProcessorFactory [collection1]  webapp=null path=null params={}{commit=} 0 1398
   [junit4]   2> 1012252 INFO  (TEST-SpellCheckComponentTest.test-seed#[2C9C5343D42D65FE]) [    ] o.a.s.c.S.Request [collection1]  webapp=null path=null params={q=documemt&qt=spellCheckCompRH&spellcheck=true&wt=xml} hits=0 status=0 QTime=0
   [junit4]   2> 1012253 INFO  (TEST-SpellCheckComponentTest.test-seed#[2C9C5343D42D65FE]) [    ] o.a.s.SolrTestCaseJ4 ###Ending test
   [junit4]   2> 1012253 INFO  (TEST-SpellCheckComponentTest.test-seed#[2C9C5343D42D65FE]) [    ] o.a.s.u.DirectUpdateHandler2 [collection1] REMOVING ALL DOCUMENTS FROM INDEX
   [junit4]   2> 1012253 INFO  (TEST-SpellCheckComponentTest.test-seed#[2C9C5343D42D65FE]) [    ] o.a.s.u.p.LogUpdateProcessorFactory [collection1]  webapp=null path=null params={}{deleteByQuery=*:*} 0 0
   [junit4]   2> 1012253 INFO  (TEST-SpellCheckComponentTest.test-seed#[2C9C5343D42D65FE]) [    ] o.a.s.u.DirectUpdateHandler2 start commit{,optimize=false,openSearcher=true,waitSearcher=true,expungeDeletes=false,softCommit=false,prepareCommit=false}
   [junit4]   2> 1012253 INFO  (TEST-SpellCheckComponentTest.test-seed#[2C9C5343D42D65FE]) [    ] o.a.s.u.SolrIndexWriter Calling setCommitData with IW:org.apache.solr.update.SolrIndexWriter@39de961a
   [junit4]   2> 1012253 INFO  (TEST-SpellCheckComponentTest.test-seed#[2C9C5343D42D65FE]) [    ] o.a.s.s.SolrIndexSearcher Opening [Searcher@d56717a[collection1] main]
   [junit4]   2> 1012253 INFO  (TEST-SpellCheckComponentTest.test-seed#[2C9C5343D42D65FE]) [    ] o.a.s.u.DirectUpdateHandler2 end_commit_flush
   [junit4]   2> 1012253 INFO  (searcherExecutor-4808-thread-1) [    ] o.a.s.h.c.SpellCheckComponent Building spell index for spell checker: default
   [junit4]   2> 1012333 INFO  (searcherExecutor-4808-thread-1) [    ] o.a.s.h.c.SpellCheckComponent Building spell index for spell checker: default_teststop
   [junit4]   2> 1012385 INFO  (searcherExecutor-4808-thread-1) [    ] o.a.s.h.c.SpellCheckComponent Building spell index for spell checker: threshold
   [junit4]   2> 1012433 INFO  (searcherExecutor-4808-thread-1) [    ] o.a.s.h.c.SpellCheckComponent Building spell index for spell checker: threshold_direct
   [junit4]   2> 1012433 INFO  (searcherExecutor-4808-thread-1) [    ] o.a.s.h.c.SpellCheckComponent Building spell index for spell checker: multipleFields
   [junit4]   2> 1012487 INFO  (searcherExecutor-4808-thread-1) [    ] o.a.s.h.c.SpellCheckComponent Building spell index for spell checker: freq
   [junit4]   2> 1012535 INFO  (searcherExecutor-4808-thread-1) [    ] o.a.s.h.c.SpellCheckComponent Building spell index for spell checker: fqcn
   [junit4]   2> 1012583 INFO  (searcherExecutor-4808-thread-1) [    ] o.a.s.c.SolrCore [collection1] Registered new searcher Searcher@d56717a[collection1] main{ExitableDirectoryReader(UninvertingDirectoryReader())}
   [junit4]   2> 1012583 INFO  (TEST-SpellCheckComponentTest.test-seed#[2C9C5343D42D65FE]) [    ] o.a.s.u.p.LogUpdateProcessorFactory [collection1]  webapp=null path=null params={}{commit=} 0 330
   [junit4]   2> 1012584 INFO  (TEST-SpellCheckComponentTest.testPerDictionary-seed#[2C9C5343D42D65FE]) [    ] o.a.s.SolrTestCaseJ4 ###Starting testPerDictionary
   [junit4]   2> 1012585 INFO  (TEST-SpellCheckComponentTest.testPerDictionary-seed#[2C9C5343D42D65FE]) [    ] o.a.s.u.p.LogUpdateProcessorFactory [collection1]  webapp=null path=null params={}{add=[0]} 0 0
   [junit4]   2> 1012585 INFO  (TEST-SpellCheckComponentTest.testPerDictionary-seed#[2C9C5343D42D65FE]) [    ] o.a.s.u.p.LogUpdateProcessorFactory [collection1]  webapp=null path=null params={}{add=[1]} 0 0
   [junit4]   2> 1012585 INFO  (TEST-SpellCheckComponentTest.testPerDictionary-seed#[2C9C5343D42D65FE]) [    ] o.a.s.u.p.LogUpdateProcessorFactory [collection1]  webapp=null path=null params={}{add=[2]} 0 0
   [junit4]   2> 1012586 INFO  (TEST-SpellCheckComponentTest.testPerDictionary-seed#[2C9C5343D42D65FE]) [    ] o.a.s.u.p.LogUpdateProcessorFactory [collection1]  webapp=null path=null params={}{add=[3]} 0 0
   [junit4]   2> 1012586 INFO  (TEST-SpellCheckComponentTest.testPerDictionary-seed#[2C9C5343D42D65FE]) [    ] o.a.s.u.p.LogUpdateProcessorFactory [collection1]  webapp=null path=null params={}{add=[4]} 0 0
   [junit4]   2> 1012586 INFO  (TEST-SpellCheckComponentTest.testPerDictionary-seed#[2C9C5343D42D65FE]) [    ] o.a.s.u.p.LogUpdateProcessorFactory [collection1]  webapp=null path=null params={}{add=[5]} 0 0
   [junit4]   2> 1012586 INFO  (TEST-SpellCheckComponentTest.testPerDictionary-seed#[2C9C5343D42D65FE]) [    ] o.a.s.u.p.LogUpdateProcessorFactory [collection1]  webapp=null path=null params={}{add=[6]} 0 0
   [junit4]   2> 1012586 INFO  (TEST-SpellCheckComponentTest.testPerDictionary-seed#[2C9C5343D42D65FE]) [    ] o.a.s.u.p.LogUpdateProcessorFactory [collection1]  webapp=null path=null params={}{add=[7]} 0 0
   [junit4]   2> 1012586 INFO  (TEST-SpellCheckComponentTest.testPerDictionary-seed#[2C9C5343D42D65FE]) [    ] o.a.s.u.p.LogUpdateProcessorFactory [collection1]  webapp=null path=null params={}{add=[8]} 0 0
   [junit4]   2> 1012587 INFO  (TEST-SpellCheckComponentTest.testPerDictionary-seed#[2C9C5343D42D65FE]) [    ] o.a.s.u.p.LogUpdateProcessorFactory [collection1]  webapp=null path=null params={}{add=[9]} 0 0
   [junit4]   2> 1012587 INFO  (TEST-SpellCheckComponentTest.testPerDictionary-seed#[2C9C5343D42D65FE]) [    ] o.a.s.u.DirectUpdateHandler2 start commit{,optimize=false,openSearcher=true,waitSearcher=true,expungeDeletes=false,softCommit=false,prepareCommit=false}
   [junit4]   2> 1012587 INFO  (TEST-SpellCheckComponentTest.testPerDictionary-seed#[2C9C5343D42D65FE]) [    ] o.a.s.u.SolrIndexWriter Calling setCommitData with IW:org.apache.solr.update.SolrIndexWriter@39de961a
   [junit4]   2> 1012589 INFO  (TEST-SpellCheckComponentTest.testPerDictionary-seed#[2C9C5343D42D65FE]) [    ] o.a.s.s.SolrIndexSearcher Opening [Searcher@1d64997d[collection1] main]
   [junit4]   2> 1012589 INFO  (TEST-SpellCheckComponentTest.testPerDictionary-seed#[2C9C5343D42D65FE]) [    ] o.a.s.u.DirectUpdateHandler2 end_commit_flush
   [junit4]   2> 1012589 INFO  (searcherExecutor-4808-thread-1) [    ] o.a.s.h.c.SpellCheckComponent Building spell index for spell checker: default
   [junit4]   2> 1012741 INFO  (searcherExecutor-4808-thread-1) [    ] o.a.s.h.c.SpellCheckComponent Building spell index for spell checker: default_teststop
   [junit4]   2> 1012785 INFO  (searcherExecutor-4808-thread-1) [    ] o.a.s.h.c.SpellCheckComponent Building spell index for spell checker: threshold
   [junit4]   2> 1012911 INFO  (searcherExecutor-4808-thread-1) [    ] o.a.s.h.c.SpellCheckComponent Building spell index for spell checker: threshold_direct
   [junit4]   2> 1012911 INFO  (searcherExecutor-4808-thread-1) [    ] o.a.s.h.c.SpellCheckComponent Building spell index for spell checker: multipleFields
   [junit4]   2> 1013081 INFO  (searcherExecutor-4808-thread-1) [    ] o.a.s.h.c.SpellCheckComponent Building spell index for spell checker: freq
   [junit4]   2> 1013237 INFO  (searcherExecutor-4808-thread-1) [    ] o.a.s.h.c.SpellCheckComponent Building spell index for spell checker: fqcn
   [junit4]   2> 1013481 INFO  (searcherExecutor-4808-thread-1) [    ] o.a.s.c.SolrCore [collection1] Registered new searcher Searcher@1d64997d[collection1] main{ExitableDirectoryReader(UninvertingDirectoryReader(Uninverting(_5(6.4.0):C10)))}
   [junit4]   2> 1013481 INFO  (TEST-SpellCheckComponentTest.testPerDictionary-seed#[2C9C5343D42D65FE]) [    ] o.a.s.u.p.LogUpdateProcessorFactory [collection1]  webapp=null path=null params={}{commit=} 0 894
   [junit4]   2> 1013482 INFO  (TEST-SpellCheckComponentTest.testPerDictionary-seed#[2C9C5343D42D65FE]) [    ] o.a.s.c.S.Request [collection1]  webapp=null path=null params={q=documemt&qt=spellCheckCompRH&spellcheck.dictionary=perDict&json.nl=map&spellcheck..perDict.foo=bar&spellcheck=true&spellcheck..perDict.bar=foo&wt=xml&spellcheck.build=true} hits=0 status=0 QTime=0
   [junit4]   2> 1013482 INFO  (TEST-SpellCheckComponentTest.testPerDictionary-seed#[2C9C5343D42D65FE]) [    ] o.a.s.SolrTestCaseJ4 ###Ending testPerDictionary
   [junit4]   2> 1013482 INFO  (TEST-SpellCheckComponentTest.testPerDictionary-seed#[2C9C5343D42D65FE]) [    ] o.a.s.u.DirectUpdateHandler2 [collection1] REMOVING ALL DOCUMENTS FROM INDEX
   [junit4]   2> 1013482 INFO  (TEST-SpellCheckComponentTest.testPerDictionary-seed#[2C9C5343D42D65FE]) [    ] o.a.s.u.p.LogUpdateProcessorFactory [collection1]  webapp=null path=null params={}{deleteByQuery=*:*} 0 0
   [junit4]   2> 1013482 INFO  (TEST-SpellCheckComponentTest.testPerDictionary-seed#[2C9C5343D42D65FE]) [    ] o.a.s.u.DirectUpdateHandler2 start commit{,optimize=false,openSearcher=true,waitSearcher=true,expungeDeletes=false,softCommit=false,prepareCommit=false}
   [junit4]   2> 1013482 INFO  (TEST-SpellCheckComponentTest.testPerDictionary-seed#[2C9C5343D42D65FE]) [    ] o.a.s.u.SolrIndexWriter Calling setCommitData with IW:org.apache.solr.update.SolrIndexWriter@39de961a
   [junit4]   2> 1013483 INFO  (TEST-SpellCheckComponentTest.testPerDictionary-seed#[2C9C5343D42D65FE]) [    ] o.a.s.s.SolrIndexSearcher Opening [Searcher@7ce5241d[collection1] main]
   [junit4]   2> 1013483 INFO  (TEST-SpellCheckComponentTest.testPerDictionary-seed#[2C9C5343D42D65FE]) [    ] o.a.s.u.DirectUpdateHandler2 end_commit_flush
   [junit4]   2> 1013483 INFO  (searcherExecutor-4808-thread-1) [    ] o.a.s.h.c.SpellCheckComponent Building spell index for spell checker: default
   [junit4]   2> 1013550 INFO  (searcherExecutor-4808-thread-1) [    ] o.a.s.h.c.SpellCheckComponent Building spell index for spell checker: default_teststop
   [junit4]   2> 1013620 INFO  (searcherExecutor-4808-thread-1) [    ] o.a.s.h.c.SpellCheckComponent Building spell index for spell checker: threshold
   [junit4]   2> 1013680 INFO  (searcherExecutor-4808-thread-1) [    ] o.a.s.h.c.SpellCheckComponent Building spell index for spell checker: threshold_direct
   [junit4]   2> 1013680 INFO  (searcherExecutor-4808-thread-1) [    ] o.a.s.h.c.SpellCheckComponent Building spell index for spell checker: multipleFields
   [junit4]   2> 1013721 INFO  (searcherExecutor-4808-thread-1) [    ] o.a.s.h.c.SpellCheckComponent Building spell index for spell checker: freq
   [junit4]   2> 1013769 INFO  (searcherExecutor-4808-thread-1) [    ] o.a.s.h.c.SpellCheckComponent Building spell index for spell checker: fqcn
   [junit4]   2> 1013831 INFO  (searcherExecutor-4808-thread-1) [    ] o.a.s.c.SolrCore [collection1] Registered new searcher Searcher@7ce5241d[collection1] main{ExitableDirectoryReader(UninvertingDirectoryReader())}
   [junit4]   2> 1013831 INFO  (TEST-SpellCheckComponentTest.testPerDictionary-seed#[2C9C5343D42D65FE]) [    ] o.a.s.u.p.LogUpdateProcessorFactory [collection1]  webapp=null path=null params={}{commit=} 0 348
   [junit4]   2> 1013832 INFO  (TEST-SpellCheckComponentTest.testReloadOnStart-seed#[2C9C5343D42D65FE]) [    ] o.a.s.SolrTestCaseJ4 ###Starting testReloadOnStart
   [junit4]   2> 1013833 INFO  (TEST-SpellCheckComponentTest.testReloadOnStart-seed#[2C9C5343D42D65FE]) [    ] o.a.s.u.p.LogUpdateProcessorFactory [collection1]  webapp=null path=null params={}{add=[0]} 0 0
   [junit4]   2> 1013833 INFO  (TEST-SpellCheckComponentTest.testReloadOnStart-seed#[2C9C5343D42D65FE]) [    ] o.a.s.u.p.LogUpdateProcessorFactory [collection1]  webapp=null path=null params={}{add=[1]} 0 0
   [junit4]   2> 1013833 INFO  (TEST-SpellCheckComponentTest.testReloadOnStart-seed#[2C9C5343D42D65FE]) [    ] o.a.s.u.p.LogUpdateProcessorFactory [collection1]  webapp=null path=null params={}{add=[2]} 0 0
   [junit4]   2> 1013833 INFO  (TEST-SpellCheckComponentTest.testReloadOnStart-seed#[2C9C5343D42D65FE]) [    ] o.a.s.u.p.LogUpdateProcessorFactory [collection1]  webapp=null path=null params={}{add=[3]} 0 0
   [junit4]   2> 1013834 INFO  (TEST-SpellCheckComponentTest.testReloadOnStart-seed#[2C9C5343D42D65FE]) [    ] o.a.s.u.p.LogUpdateProcessorFactory [collection1]  webapp=null path=null params={}{add=[4]} 0 0
   [junit4]   2> 1013834 INFO  (TEST-SpellCheckComponentTest.testReloadOnStart-seed#[2C9C5343D42D65FE]) [    ] o.a.s.u.p.LogUpdateProcessorFactory [collection1]  webapp=null path=null params={}{add=[5]} 0 0
   [junit4]   2> 1013834 INFO  (TEST-SpellCheckComponentTest.testReloadOnStart-seed#[2C9C5343D42D65FE]) [    ] o.a.s.u.p.LogUpdateProcessorFactory [collection1]  webapp=null path=null params={}{add=[6]} 0 0
   [junit4]   2> 1013834 INFO  (TEST-SpellCheckComponentTest.testReloadOnStart-seed#[2C9C5343D42D65FE]) [    ] o.a.s.u.p.LogUpdateProcessorFactory [collection1]  webapp=null path=null params={}{add=[7]} 0 0
   [junit4]   2> 1013835 INFO  (TEST-SpellCheckComponentTest.testReloadOnStart-seed#[2C9C5343D42D65FE]) [    ] o.a.s.u.p.LogUpdateProcessorFactory [collection1]  webapp=null path=null params={}{add=[8]} 0 0
   [junit4]   2> 1013835 INFO  (TEST-SpellCheckComponentTest.testReloadOnStart-seed#[2C9C5343D42D65FE]) [    ] o.a.s.u.p.LogUpdateProcessorFactory [collection1]  webapp=null path=null params={}{add=[9]} 0 0
   [junit4]   2> 1013835 INFO  (TEST-SpellCheckComponentTest.testReloadOnStart-seed#[2C9C5343D42D65FE]) [    ] o.a.s.u.DirectUpdateHandler2 start commit{,optimize=false,openSearcher=true,waitSearcher=true,expungeDeletes=false,softCommit=false,prepareCommit=false}
   [junit4]   2> 1013835 INFO  (TEST-SpellCheckComponentTest.testReloadOnStart-seed#[2C9C5343D42D65FE]) [    ] o.a.s.u.SolrIndexWriter Calling setCommitData with IW:org.apache.solr.update.SolrIndexWriter@39de961a
   [junit4]   2> 1013837 INFO  (TEST-SpellCheckComponentTest.testReloadOnStart-seed#[2C9C5343D42D65FE]) [    ] o.a.s.s.SolrIndexSearcher Opening [Searcher@20de0687[collection1] main]
   [junit4]   2> 1013837 INFO  (TEST-SpellCheckComponentTest.testReloadOnStart-seed#[2C9C5343D42D65FE]) [    ] o.a.s.u.DirectUpdateHandler2 end_commit_flush
   [junit4]   2> 1013837 INFO  (searcherExecutor-4808-thread-1) [    ] o.a.s.h.c.SpellCheckComponent Building spell index for spell checker: default
   [junit4]   2> 1014008 INFO  (searcherExecutor-4808-thread-1) [    ] o.a.s.h.c.SpellCheckComponent Building spell index for spell checker: default_teststop
   [junit4]   2> 1014084 INFO  (searcherExecutor-4808-thread-1) [    ] o.a.s.h.c.SpellCheckComponent Building spell index for spell checker: threshold
   [junit4]   2> 1014201 INFO  (searcherExecutor-4808-thread-1) [    ] o.a.s.h.c.SpellCheckComponent Building spell index for spell checker: threshold_direct
   [junit4]   2> 1014201 INFO  (searcherExecutor-4808-thread-1) [    ] o.a.s.h.c.SpellCheckComponent Building spell index for spell checker: multipleFields
   [junit4]   2> 1014389 INFO  (searcherExecutor-4808-thread-1) [    ] o.a.s.h.c.SpellCheckComponent Building spell index for spell checker: freq
   [junit4]   2> 1014567 INFO  (searcherExecutor-4808-thread-1) [    ] o.a.s.h.c.SpellCheckComponent Building spell index for spell checker: fqcn
   [junit4]   2> 1014787 INFO  (searcherExecutor-4808-thread-1) [    ] o.a.s.c.SolrCore [collection1] Registered new searcher Searcher@20de0687[collection1] main{ExitableDirectoryReader(UninvertingDirectoryReader(Uninverting(_6(6.4.0):C10)))}
   [junit4]   2> 1014787 INFO  (TEST-SpellCheckComponentTest.testReloadOnStart-seed#[2C9C5343D42D65FE]) [    ] o.a.s.u.p.LogUpdateProcessorFactory [collection1]  webapp=null path=null params={}{commit=} 0 952
   [junit4]   2> 1014788 INFO  (TEST-SpellCheckComponentTest.testReloadOnStart-seed#[2C9C5343D42D65FE]) [    ] o.a.s.u.p.LogUpdateProcessorFactory [collection1]  webapp=null path=null params={}{add=[0]} 0 0
   [junit4]   2> 1014788 INFO  (TEST-SpellCheckComponentTest.testReloadOnStart-seed#[2C9C5343D42D65FE]) [    ] o.a.s.u.DirectUpdateHandler2 start commit{,optimize=false,openSearcher=true,waitSearcher=true,expungeDeletes=false,softCommit=false,prepareCommit=false}
   [junit4]   2> 1014788 INFO  (TEST-SpellCheckComponentTest.testReloadOnStart-seed#[2C9C5343D42D65FE]) [    ] o.a.s.u.SolrIndexWriter Calling setCommitData with IW:org.apache.solr.update.SolrIndexWriter@39de961a
   [junit4]   2> 1014790 INFO  (TEST-SpellCheckComponentTest.testReloadOnStart-seed#[2C9C5343D42D65FE]) [    ] o.a.s.s.SolrIndexSearcher Opening [Searcher@36cef672[collection1] main]
   [junit4]   2> 1014790 INFO  (TEST-SpellCheckComponentTest.testReloadOnStart-seed#[2C9C5343D42D65FE]) [    ] o.a.s.u.DirectUpdateHandler2 end_commit_flush
   [junit4]   2> 1014790 INFO  (searcherExecutor-4808-thread-1) [    ] o.a.s.h.c.SpellCheckComponent Building spell index for spell checker: default
   [junit4]   2> 1015046 INFO  (searcherExecutor-4808-thread-1) [    ] o.a.s.h.c.SpellCheckComponent Building spell index for spell checker: default_teststop
   [junit4]   2> 1015143 INFO  (searcherExecutor-4808-thread-1) [    ] o.a.s.h.c.SpellCheckComponent Building spell index for spell checker: threshold
   [junit4]   2> 1015321 INFO  (searcherExecutor-4808-thread-1) [    ] o.a.s.h.c.SpellCheckComponent Building spell index for spell checker: threshold_direct
   [junit4]   2> 1015321 INFO  (searcherExecutor-4808-thread-1) [    ] o.a.s.h.c.SpellCheckComponent Building spell index for spell checker: multipleFields
   [junit4]   2> 1015530 INFO  (searcherExecutor-4808-thread-1) [    ] o.a.s.h.c.SpellCheckComponent Building spell index for spell checker: freq
   [junit4]   2> 1015741 INFO  (searcherExecutor-4808-thread-1) [    ] o.a.s.h.c.SpellCheckComponent Building spell index for spell checker: fqcn
   [junit4]   2> 1015899 INFO  (searcherExecutor-4808-thread-1) [    ] o.a.s.c.SolrCore [collection1] Registered new searcher Searcher@36cef672[collection1] main{ExitableDirectoryReader(UninvertingDirectoryReader(Uninverting(_6(6.4.0):C10/1:delGen=1) Uninverting(_7(6.4.0):C1)))}
   [junit4]   2> 1015899 INFO  (TEST-SpellCheckComponentTest.testReloadOnStart-seed#[2C9C5343D42D65FE]) [    ] o.a.s.u.p.LogUpdateProcessorFactory [collection1]  webapp=null path=null params={}{commit=} 0 1111
   [junit4]   2> 1016153 INFO  (TEST-SpellCheckComponentTest.testReloadOnStart-seed#[2C9C5343D42D65FE]) [    ] o.a.s.c.S.Request [collection1]  webapp=null path=null params={q=*:*&spellcheck.q=ttle&qt=spellCheckCompRH&spellcheck.dictionary=default&spellcheck=true&wt=xml&spellcheck.build=true} hits=10 status=0 QTime=253
   [junit4]   2> 1016154 INFO  (TEST-SpellCheckComponentTest.testReloadOnStart-seed#[2C9C5343D42D65FE]) [    ] o.a.s.h.c.SpellCheckComponent Initializing spell checkers
   [junit4]   2> 1016163 INFO  (TEST-SpellCheckComponentTest.testReloadOnStart-seed#[2C9C5343D42D65FE]) [    ] o.a.s.SolrTestCaseJ4 ###Ending testReloadOnStart
   [junit4]   2> 1016163 INFO  (TEST-SpellCheckComponentTest.testReloadOnStart-seed#[2C9C5343D42D65FE]) [    ] o.a.s.u.DirectUpdateHandler2 [collection1] REMOVING ALL DOCUMENTS FROM INDEX
   [junit4]   2> 1016163 INFO  (TEST-SpellCheckComponentTest.testReloadOnStart-seed#[2C9C5343D42D65FE]) [    ] o.a.s.u.p.LogUpdateProcessorFactory [collection1]  webapp=null path=null params={}{deleteByQuery=*:*} 0 0
   [junit4]   2> 1016163 INFO  (TEST-SpellCheckComponentTest.testReloadOnStart-seed#[2C9C5343D42D65FE]) [    ] o.a.s.u.DirectUpdateHandler2 start commit{,optimize=false,openSearcher=true,waitSearcher=true,expungeDeletes=false,softCommit=false,prepareCommit=false}
   [junit4]   2> 1016163 INFO  (TEST-SpellCheckComponentTest.testReloadOnStart-seed#[2C9C5343D42D65FE]) [    ] o.a.s.u.SolrIndexWriter Calling setCommitData with IW:org.apache.solr.update.SolrIndexWriter@39de961a
   [junit4]   2> 1016163 INFO  (TEST-SpellCheckComponentTest.testReloadOnStart-seed#[2C9C5343D42D65FE]) [    ] o.a.s.s.SolrIndexSearcher Opening [Searcher@2423706e[collection1] main]
   [junit4]   2> 1016164 INFO  (TEST-SpellCheckComponentTest.testReloadOnStart-seed#[2C9C5343D42D65FE]) [    ] o.a.s.u.DirectUpdateHandler2 end_commit_flush
   [junit4]   2> 1016164 INFO  (searcherExecutor-4808-thread-1) [    ] o.a.s.h.c.SpellCheckComponent Building spell index for spell checker: default
   [junit4]   2> 1016228 INFO  (searcherExecutor-4808-thread-1) [    ] o.a.s.h.c.SpellCheckComponent Building spell index for spell checker: default_teststop
   [junit4]   2> 1016298 INFO  (searcherExecutor-4808-thread-1) [    ] o.a.s.h.c.SpellCheckComponent Building spell index for spell checker: threshold
   [junit4]   2> 1016350 INFO  (searcherExecutor-4808-thread-1) [    ] o.a.s.h.c.SpellCheckComponent Building spell index for spell checker: threshold_direct
   [junit4]   2> 1016350 INFO  (searcherExecutor-4808-thread-1) [    ] o.a.s.h.c.SpellCheckComponent Building spell index for spell checker: multipleFields
   [junit4]   2> 1016404 INFO  (searcherExecutor-4808-thread-1) [    ] o.a.s.h.c.SpellCheckComponent Building spell index for spell checker: freq
   [junit4]   2> 1016487 INFO  (searcherExecutor-4808-thread-1) [    ] o.a.s.h.c.SpellCheckComponent Building spell index for spell checker: fqcn
   [junit4]   2> 1016552 INFO  (searcherExecutor-4808-thread-1) [    ] o.a.s.c.SolrCore [collection1] Registered new searcher Searcher@2423706e[collection1] main{ExitableDirectoryReader(UninvertingDirectoryReader())}
   [junit4]   2> 1016552 INFO  (TEST-SpellCheckComponentTest.testReloadOnStart-seed#[2C9C5343D42D65FE]) [    ] o.a.s.u.p.LogUpdateProcessorFactory [collection1]  webapp=null path=null params={}{commit=} 0 388
   [junit4]   2> 1016553 INFO  (TEST-SpellCheckComponentTest.testRebuildOnCommit-seed#[2C9C5343D42D65FE]) [    ] o.a.s.SolrTestCaseJ4 ###Starting testRebuildOnCommit
   [junit4]   2> 1016553 INFO  (TEST-SpellCheckComponentTest.testRebuildOnCommit-seed#[2C9C5343D42D65FE]) [    ] o.a.s.u.p.LogUpdateProcessorFactory [collection1]  webapp=null path=null params={}{add=[0]} 0 0
   [junit4]   2> 1016554 INFO  (TEST-SpellCheckComponentTest.testRebuildOnCommit-seed#[2C9C5343D42D65FE]) [    ] o.a.s.u.p.LogUpdateProcessorFactory [collection1]  webapp=null path=null params={}{add=[1]} 0 0
   [junit4]   2> 1016554 INFO  (TEST-SpellCheckComponentTest.testRebuildOnCommit-seed#[2C9C5343D42D65FE]) [    ] o.a.s.u.p.LogUpdateProcessorFactory [collection1]  webapp=null path=null params={}{add=[2]} 0 0
   [junit4]   2> 1016554 INFO  (TEST-SpellCheckComponentTest.testRebuildOnCommit-seed#[2C9C5343D42D65FE]) [    ] o.a.s.u.p.LogUpdateProcessorFactory [collection1]  webapp=null path=null params={}{add=[3]} 0 0
   [junit4]   2> 1016554 INFO  (TEST-SpellCheckComponentTest.testRebuildOnCommit-seed#[2C9C5343D42D65FE]) [    ] o.a.s.u.p.LogUpdateProcessorFactory [collection1]  webapp=null path=null params={}{add=[4]} 0 0
   [junit4]   2> 1016554 INFO  (TEST-SpellCheckComponentTest.testRebuildOnCommit-seed#[2C9C5343D42D65FE]) [    ] o.a.s.u.p.LogUpdateProcessorFactory [collection1]  webapp=null path=null params={}{add=[5]} 0 0
   [junit4]   2> 1016555 INFO  (TEST-SpellCheckComponentTest.testRebuildOnCommit-seed#[2C9C5343D42D65FE]) [    ] o.a.s.u.p.LogUpdateProcessorFactory [collection1]  webapp=null path=null params={}{add=[6]} 0 0
   [junit4]   2> 1016555 INFO  (TEST-SpellCheckComponentTest.testRebuildOnCommit-seed#[2C9C5343D42D65FE]) [    ] o.a.s.u.p.LogUpdateProcessorFactory [collection1]  webapp=null path=null params={}{add=[7]} 0 0
   [junit4]   2> 1016555 INFO  (TEST-SpellCheckComponentTest.testRebuildOnCommit-seed#[2C9C5343D42D65FE]) [    ] o.a.s.u.p.LogUpdateProcessorFactory [collection1]  webapp=null path=null params={}{add=[8]} 0 0
   [junit4]   2> 1016555 INFO  (TEST-SpellCheckComponentTest.testRebuildOnCommit-seed#[2C9C5343D42D65FE]) [    ] o.a.s.u.p.LogUpdateProcessorFactory [collection1]  webapp=null path=null params={}{add=[9]} 0 0
   [junit4]   2> 1016555 INFO  (TEST-SpellCheckComponentTest.testRebuildOnCommit-seed#[2C9C5343D42D65FE]) [    ] o.a.s.u.DirectUpdateHandler2 start commit{,optimize=false,openSearcher=true,waitSearcher=true,expungeDeletes=false,softCommit=false,prepareCommit=false}
   [junit4]   2> 1016555 INFO  (TEST-SpellCheckComponentTest.testRebuildOnCommit-seed#[2C9C5343D42D65FE]) [    ] o.a.s.u.SolrIndexWriter Calling setCommitData with IW:org.apache.solr.update.SolrIndexWriter@39de961a
   [junit4]   2> 1016558 INFO  (TEST-SpellCheckComponentTest.testRebuildOnCommit-seed#[2C9C5343D42D65FE]) [    ] o.a.s.s.SolrIndexSearcher Opening [Searcher@457cbccf[collection1] main]
   [junit4]   2> 1016558 INFO  (TEST-SpellCheckComponentTest.testRebuildOnCommit-seed#[2C9C5343D42D65FE]) [    ] o.a.s.u.DirectUpdateHandler2 end_commit_flush
   [junit4]   2> 1016558 INFO  (searcherExecutor-4808-thread-1) [    ] o.a.s.h.c.SpellCheckComponent Building spell index for spell checker: default
   [junit4]   2> 1016743 INFO  (searcherExecutor-4808-thread-1) [    ] o.a.s.h.c.SpellCheckComponent Building spell index for spell checker: default_teststop
   [junit4]   2> 1016820 INFO  (searcherExecutor-4808-thread-1) [    ] o.a.s.h.c.SpellCheckComponent Building spell index for spell checker: threshold
   [junit4]   2> 1017113 INFO  (searcherExecutor-4808-thread-1) [    ] o.a.s.h.c.SpellCheckComponent Building spell index for spell checker: threshold_direct
   [junit4]   2> 1017113 INFO  (searcherExecutor-4808-thread-1) [    ] o.a.s.h.c.SpellCheckComponent Building spell index for spell checker: multipleFields
   [junit4]   2> 1017355 INFO  (searcherExecutor-4808-thread-1) [    ] o.a.s.h.c.SpellCheckComponent Building spell index for spell checker: freq
   [junit4]   2> 1017713 INFO  (searcherExecutor-4808-thread-1) [    ] o.a.s.h.c.SpellCheckComponent Building spell index for spell checker: fqcn
   [junit4]   2> 1018049 INFO  (searcherExecutor-4808-thread-1) [    ] o.a.s.c.SolrCore [collection1] Registered new searcher Searcher@457cbccf[collection1] main{ExitableDirectoryReader(UninvertingDirectoryReader(Uninverting(_8(6.4.0):C10)))}
   [junit4]   2> 1018049 INFO  (TEST-SpellCheckComponentTest.testRebuildOnCommit-seed#[2C9C5343D42D65FE]) [    ] o.a.s.u.p.LogUpdateProcessorFactory [collection1]  webapp=null path=null params={}{commit=} 0 1494
   [junit4]   2> 1018050 INFO  (TEST-SpellCheckComponentTest.testRebuildOnCommit-seed#[2C9C5343D42D65FE]) [    ] o.a.s.c.S.Request [collection1]  webapp=null path=null params={q=lowerfilt:lucenejavt&qt=spellCheckCompRH&spellcheck=true&wt=xml} hits=0 status=0 QTime=0
   [junit4]   2> 1018051 INFO  (TEST-SpellCheckComponentTest.testRebuildOnCommit-seed#[2C9C5343D42D65FE]) [    ] o.a.s.u.p.LogUpdateProcessorFactory [collection1]  webapp=null path=null params={}{add=[11231]} 0 0
   [junit4]   2> 1018051 INFO  (TEST-SpellCheckComponentTest.testRebuildOnCommit-seed#[2C9C5343D42D65FE]) [    ] o.a.s.u.DirectUpdateHandler2 start commit{,optimize=false,openSearcher=true,waitSearcher=true,expungeDeletes=false,softCommit=false,prepareCommit=false}
   [junit4]   2> 1018051 INFO  (TEST-SpellCheckComponentTest.testRebuildOnCommit-seed#[2C9C5343D42D65FE]) [    ] o.a.s.u.SolrIndexWriter Calling setCommitData with IW:org.apache.solr.update.SolrIndexWriter@39de961a
   [junit4]   2> 1018055 INFO  (TEST-SpellCheckComponentTest.testRebuildOnCommit-seed#[2C9C5343D42D65FE]) [    ] o.a.s.s.SolrIndexSearcher Opening [Searcher@525f6644[collection1] main]
   [junit4]   2> 1018055 INFO  (TEST-SpellCheckComponentTest.testRebuildOnCommit-seed#[2C9C5343D42D65FE]) [    ] o.a.s.u.DirectUpdateHandler2 end_commit_flush
   [junit4]   2> 1018055 INFO  (searcherExecutor-4808-thread-1) [    ] o.a.s.h.c.SpellCheckComponent Building spell index for spell checker: default
   [junit4]   2> 1018398 INFO  (searcherExecutor-4808-thread-1) [    ] o.a.s.h.c.SpellCheckComponent Building spell index for spell checker: default_teststop
   [junit4]   2> 1018482 INFO  (searcherExecutor-4808-thread-1) [    ] o.a.s.h.c.SpellCheckComponent Building spell index for spell checker: threshold
   [junit4]   2> 1018696 INFO  (searcherExecutor-4808-thread-1) [    ] o.a.s.h.c.SpellCheckComponent Building spell index for spell checker: threshold_direct
   [junit4]   2> 1018696 INFO  (searcherExecutor-4808-thread-1) [    ] o.a.s.h.c.SpellCheckComponent Building spell index for spell checker: multipleFields
   [junit4]   2> 1018913 INFO  (searcherExecutor-4808-thread-1) [    ] o.a.s.h.c.SpellCheckComponent Building spell index for spell checker: freq
   [junit4]   2> 1019086 INFO  (searcherExecutor-4808-thread-1) [    ] o.a.s.h.c.SpellCheckComponent Building spell index for spell checker: fqcn
   [junit4]   2> 1019221 INFO  (searcherExecutor-4808-thread-1) [    ] o.a.s.c.SolrCore [collection1] Registered new searcher Searcher@525f6644[collection1] main{ExitableDirectoryReader(UninvertingDirectoryReader(Uninverting(_8(6.4.0):C10) Uninverting(_9(6.4.0):C1)))}
   [junit4]   2> 1019221 INFO  (TEST-SpellCheckComponentTest.testRebuildOnCommit-seed#[2C9C5343D42D65FE]) [    ] o.a.s.u.p.LogUpdateProcessorFactory [collection1]  webapp=null path=null params={}{commit=} 0 1169
   [junit4]   2> 1019222 INFO  (TEST-SpellCheckComponentTest.testRebuildOnCommit-seed#[2C9C5343D42D65FE]) [    ] o.a.s.c.S.Request [collection1]  webapp=null path=null params={q=lowerfilt:lucenejavt&qt=spellCheckCompRH&spellcheck=true&wt=xml} hits=0 status=0 QTime=1172
   [junit4]   2> 1019222 INFO  (TEST-SpellCheckComponentTest.testRebuildOnCommit-seed#[2C9C5343D42D65FE]) [    ] o.a.s.SolrTestCaseJ4 ###Ending testRebuildOnCommit
   [junit4]   2> 1019223 INFO  (TEST-SpellCheckComponentTest.testRebuildOnCommit-seed#[2C9C5343D42D65FE]) [    ] o.a.s.u.DirectUpdateHandler2 [collection1] REMOVING ALL DOCUMENTS FROM INDEX
   [junit4]   2> 1019223 INFO  (TEST-SpellCheckComponentTest.testRebuildOnCommit-seed#[2C9C5343D42D65FE]) [    ] o.a.s.u.p.LogUpdateProcessorFactory [collection1]  webapp=null path=null params={}{deleteByQuery=*:*} 0 0
   [junit4]   2> 1019223 INFO  (TEST-SpellCheckComponentTest.testRebuildOnCommit-seed#[2C9C5343D42D65FE]) [    ] o.a.s.u.DirectUpdateHandler2 start commit{,optimize=false,openSearcher=true,waitSearcher=true,expungeDeletes=false,softCommit=false,prepareCommit=false}
   [junit4]   2> 1019223 INFO  (TEST-SpellCheckComponentTest.testRebuildOnCommit-seed#[2C9C5343D42D65FE]) [    ] o.a.s.u.SolrIndexWriter Calling setCommitData with IW:org.apache.solr.update.SolrIndexWriter@39de961a
   [junit4]   2> 1019223 INFO  (TEST-SpellCheckComponentTest.testRebuildOnCommit-seed#[2C9C5343D42D65FE]) [    ] o.a.s.s.SolrIndexSearcher Opening [Searcher@3a2b1bb9[collection1] main]
   [junit4]   2> 1019223 INFO  (TEST-SpellCheckComponentTest.testRebuildOnCommit-seed#[2C9C5343D42D65FE]) [    ] o.a.s.u.DirectUpdateHandler2 end_commit_flush
   [junit4]   2> 1019223 INFO  (searcherExecutor-4808-thread-1) [    ] o.a.s.h.c.SpellCheckComponent Building spell index for spell checker: default
   [junit4]   2> 1019267 INFO  (searcherExecutor-4808-thread-1) [    ] o.a.s.h.c.SpellCheckComponent Building spell index for spell checker: default_teststop
   [junit4]   2> 1019313 INFO  (searcherExecutor-4808-thread-1) [    ] o.a.s.h.c.SpellCheckComponent Building spell index for spell checker: threshold
   [junit4]   2> 1019359 INFO  (searcherExecutor-4808-thread-1) [    ] o.a.s.h.c.SpellCheckComponent Building spell index for spell checker: threshold_direct
   [junit4]   2> 1019360 INFO  (searcherExecutor-4808-thread-1) [    ] o.a.s.h.c.SpellCheckComponent Building spell index for spell checker: multipleFields
   [junit4]   2> 1019424 INFO  (searcherExecutor-4808-thread-1) [    ] o.a.s.h.c.SpellCheckComponent Building spell index for spell checker: freq
   [junit4]   2> 1019479 INFO  (searcherExecutor-4808-thread-1) [    ] o.a.s.h.c.SpellCheckComponent Building spell index for spell checker: fqcn
   [junit4]   2> 1019513 INFO  (searcherExecutor-4808-thread-1) [    ] o.a.s.c.SolrCore [collection1] Registered new searcher Searcher@3a2b1bb9[collection1] main{ExitableDirectoryReader(UninvertingDirectoryReader())}
   [junit4]   2> 1019513 INFO  (TEST-SpellCheckComponentTest.testRebuildOnCommit-seed#[2C9C5343D42D65FE]) [    ] o.a.s.u.p.LogUpdateProcessorFactory [collection1]  webapp=null path=null params={}{commit=} 0 290
   [junit4]   2> 1019515 INFO  (TEST-SpellCheckComponentTest.testExtendedResultsCount-seed#[2C9C5343D42D65FE]) [    ] o.a.s.SolrTestCaseJ4 ###Starting testExtendedResultsCount
   [junit4]   2> 1019515 INFO  (TEST-SpellCheckComponentTest.testExtendedResultsCount-seed#[2C9C5343D42D65FE]) [    ] o.a.s.u.p.LogUpdateProcessorFactory [collection1]  webapp=null path=null params={}{add=[0]} 0 0
   [junit4]   2> 1019515 INFO  (TEST-SpellCheckComponentTest.testExtendedResultsCount-seed#[2C9C5343D42D65FE]) [    ] o.a.s.u.p.LogUpdateProcessorFactory [collection1]  webapp=null path=null params={}{add=[1]} 0 0
   [junit4]   2> 1019516 INFO  (TEST-SpellCheckComponentTest.testExtendedResultsCount-seed#[2C9C5343D42D65FE]) [    ] o.a.s.u.p.LogUpdateProcessorFactory [collection1]  webapp=null path=null params={}{add=[2]} 0 0
   [junit4]   2> 1019516 INFO  (TEST-SpellCheckComponentTest.testExtendedResultsCount-seed#[2C9C5343D42D65FE]) [    ] o.a.s.u.p.LogUpdateProcessorFactory [collection1]  webapp=null path=null params={}{add=[3]} 0 0
   [junit4]   2> 1019516 INFO  (TEST-SpellCheckComponentTest.testExtendedResultsCount-seed#[2C9C5343D42D65FE]) [    ] o.a.s.u.p.LogUpdateProcessorFactory [collection1]  webapp=null path=null params={}{add=[4]} 0 0
   [junit4]   2> 1019516 INFO  (TEST-SpellCheckComponentTest.testExtendedResultsCount-seed#[2C9C5343D42D65FE]) [    ] o.a.s.u.p.LogUpdateProcessorFactory [collection1]  webapp=null path=null params={}{add=[5]} 0 0
   [junit4]   2> 1019516 INFO  (TEST-SpellCheckComponentTest.testExtendedResultsCount-seed#[2C9C5343D42D65FE]) [    ] o.a.s.u.p.LogUpdateProcessorFactory [collection1]  webapp=null path=null params={}{add=[6]} 0 0
   [junit4]   2> 1019517 INFO  (TEST-SpellCheckComponentTest.testExtendedResultsCount-seed#[2C9C5343D42D65FE]) [    ] o.a.s.u.p.LogUpdateProcessorFactory [collection1]  webapp=null path=null params={}{add=[7]} 0 0
   [junit4]   2> 1019517 INFO  (TEST-SpellCheckComponentTest.testExtendedResultsCount-seed#[2C9C5343D42D65FE]) [    ] o.a.s.u.p.LogUpdateProcessorFactory [collection1]  webapp=null path=null params={}{add=[8]} 0 0
   [junit4]   2> 1019517 INFO  (TEST-SpellCheckComponentTest.testExtendedResultsCount-seed#[2C9C5343D42D65FE]) [    ] o.a.s.u.p.LogUpdateProcessorFactory [collection1]  webapp=null path=null params={}{add=[9]} 0 0
   [junit4]   2> 1019517 INFO  (TEST-SpellCheckComponentTest.testExtendedResultsCount-seed#[2C9C5343D42D65FE]) [    ] o.a.s.u.DirectUpdateHandler2 start commit{,optimize=false,openSearcher=true,waitSearcher=true,expungeDeletes=false,softCommit=false,prepareCommit=false}
   [junit4]   2> 1019517 INFO  (TEST-SpellCheckComponentTest.testExtendedResultsCount-seed#[2C9C5343D42D65FE]) [    ] o.a.s.u.SolrIndexWriter Calling setCommitData with IW:org.apache.solr.update.SolrIndexWriter@39de961a
   [junit4]   2> 1019519 INFO  (TEST-SpellCheckComponentTest.testExtendedResultsCount-seed#[2C9C5343D42D65FE]) [    ] o.a.s.s.SolrIndexSearcher Opening [Searcher@56678878[collection1] main]
   [junit4]   2> 1019520 INFO  (TEST-SpellCheckComponentTest.testExtendedResultsCount-seed#[2C9C5343D42D65FE]) [    ] o.a.s.u.DirectUpdateHandler2 end_commit_flush
   [junit4]   2> 1019520 INFO  (sear

[...truncated too long message...]

ectUpdateHandler2 end_commit_flush
   [junit4]   2> 1023685 INFO  (searcherExecutor-4808-thread-1) [    ] o.a.s.h.c.SpellCheckComponent Building spell index for spell checker: default
   [junit4]   2> 1023842 INFO  (searcherExecutor-4808-thread-1) [    ] o.a.s.h.c.SpellCheckComponent Building spell index for spell checker: default_teststop
   [junit4]   2> 1023903 INFO  (searcherExecutor-4808-thread-1) [    ] o.a.s.h.c.SpellCheckComponent Building spell index for spell checker: threshold
   [junit4]   2> 1024067 INFO  (searcherExecutor-4808-thread-1) [    ] o.a.s.h.c.SpellCheckComponent Building spell index for spell checker: threshold_direct
   [junit4]   2> 1024067 INFO  (searcherExecutor-4808-thread-1) [    ] o.a.s.h.c.SpellCheckComponent Building spell index for spell checker: multipleFields
   [junit4]   2> 1024256 INFO  (searcherExecutor-4808-thread-1) [    ] o.a.s.h.c.SpellCheckComponent Building spell index for spell checker: freq
   [junit4]   2> 1024489 INFO  (searcherExecutor-4808-thread-1) [    ] o.a.s.h.c.SpellCheckComponent Building spell index for spell checker: fqcn
   [junit4]   2> 1024726 INFO  (searcherExecutor-4808-thread-1) [    ] o.a.s.c.SolrCore [collection1] Registered new searcher Searcher@6d1188c[collection1] main{ExitableDirectoryReader(UninvertingDirectoryReader(Uninverting(_c(6.4.0):C10)))}
   [junit4]   2> 1024726 INFO  (TEST-SpellCheckComponentTest.testNumericQuery-seed#[2C9C5343D42D65FE]) [    ] o.a.s.u.p.LogUpdateProcessorFactory [collection1]  webapp=null path=null params={}{commit=} 0 1044
   [junit4]   2> 1024727 INFO  (TEST-SpellCheckComponentTest.testNumericQuery-seed#[2C9C5343D42D65FE]) [    ] o.a.s.c.S.Request [collection1]  webapp=null path=null params={q=12346&qt=spellCheckCompRH&spellcheck=true&wt=xml} hits=0 status=0 QTime=0
   [junit4]   2> 1024727 INFO  (TEST-SpellCheckComponentTest.testNumericQuery-seed#[2C9C5343D42D65FE]) [    ] o.a.s.SolrTestCaseJ4 ###Ending testNumericQuery
   [junit4]   2> 1024727 INFO  (TEST-SpellCheckComponentTest.testNumericQuery-seed#[2C9C5343D42D65FE]) [    ] o.a.s.u.DirectUpdateHandler2 [collection1] REMOVING ALL DOCUMENTS FROM INDEX
   [junit4]   2> 1024728 INFO  (TEST-SpellCheckComponentTest.testNumericQuery-seed#[2C9C5343D42D65FE]) [    ] o.a.s.u.p.LogUpdateProcessorFactory [collection1]  webapp=null path=null params={}{deleteByQuery=*:*} 0 0
   [junit4]   2> 1024728 INFO  (TEST-SpellCheckComponentTest.testNumericQuery-seed#[2C9C5343D42D65FE]) [    ] o.a.s.u.DirectUpdateHandler2 start commit{,optimize=false,openSearcher=true,waitSearcher=true,expungeDeletes=false,softCommit=false,prepareCommit=false}
   [junit4]   2> 1024728 INFO  (TEST-SpellCheckComponentTest.testNumericQuery-seed#[2C9C5343D42D65FE]) [    ] o.a.s.u.SolrIndexWriter Calling setCommitData with IW:org.apache.solr.update.SolrIndexWriter@39de961a
   [junit4]   2> 1024728 INFO  (TEST-SpellCheckComponentTest.testNumericQuery-seed#[2C9C5343D42D65FE]) [    ] o.a.s.s.SolrIndexSearcher Opening [Searcher@4d0a6427[collection1] main]
   [junit4]   2> 1024728 INFO  (TEST-SpellCheckComponentTest.testNumericQuery-seed#[2C9C5343D42D65FE]) [    ] o.a.s.u.DirectUpdateHandler2 end_commit_flush
   [junit4]   2> 1024728 INFO  (searcherExecutor-4808-thread-1) [    ] o.a.s.h.c.SpellCheckComponent Building spell index for spell checker: default
   [junit4]   2> 1024803 INFO  (searcherExecutor-4808-thread-1) [    ] o.a.s.h.c.SpellCheckComponent Building spell index for spell checker: default_teststop
   [junit4]   2> 1024878 INFO  (searcherExecutor-4808-thread-1) [    ] o.a.s.h.c.SpellCheckComponent Building spell index for spell checker: threshold
   [junit4]   2> 1024942 INFO  (searcherExecutor-4808-thread-1) [    ] o.a.s.h.c.SpellCheckComponent Building spell index for spell checker: threshold_direct
   [junit4]   2> 1024942 INFO  (searcherExecutor-4808-thread-1) [    ] o.a.s.h.c.SpellCheckComponent Building spell index for spell checker: multipleFields
   [junit4]   2> 1025018 INFO  (searcherExecutor-4808-thread-1) [    ] o.a.s.h.c.SpellCheckComponent Building spell index for spell checker: freq
   [junit4]   2> 1025074 INFO  (searcherExecutor-4808-thread-1) [    ] o.a.s.h.c.SpellCheckComponent Building spell index for spell checker: fqcn
   [junit4]   2> 1025144 INFO  (searcherExecutor-4808-thread-1) [    ] o.a.s.c.SolrCore [collection1] Registered new searcher Searcher@4d0a6427[collection1] main{ExitableDirectoryReader(UninvertingDirectoryReader())}
   [junit4]   2> 1025144 INFO  (TEST-SpellCheckComponentTest.testNumericQuery-seed#[2C9C5343D42D65FE]) [    ] o.a.s.u.p.LogUpdateProcessorFactory [collection1]  webapp=null path=null params={}{commit=} 0 416
   [junit4]   2> 1025145 INFO  (SUITE-SpellCheckComponentTest-seed#[2C9C5343D42D65FE]-worker) [    ] o.a.s.SolrTestCaseJ4 ###deleteCore
   [junit4]   2> 1025145 INFO  (SUITE-SpellCheckComponentTest-seed#[2C9C5343D42D65FE]-worker) [    ] o.a.s.c.CoreContainer Shutting down CoreContainer instance=1255890812
   [junit4]   2> 1025150 INFO  (coreCloseExecutor-4812-thread-1) [    ] o.a.s.c.SolrCore [collection1]  CLOSING SolrCore org.apache.solr.core.SolrCore@88ff33b
   [junit4]   2> NOTE: leaving temporary files on disk at: /home/jenkins/workspace/Lucene-Solr-6.x-Linux/solr/build/solr-core/test/J1/temp/solr.handler.component.SpellCheckComponentTest_2C9C5343D42D65FE-001
   [junit4]   2> NOTE: test params are: codec=Asserting(Lucene62): {start1=PostingsFormat(name=LuceneVarGapDocFreqInterval), range_facet_l_dv=PostingsFormat(name=LuceneVarGapDocFreqInterval), multiDefault=PostingsFormat(name=LuceneFixedGap), intDefault=PostingsFormat(name=Direct), range_facet_l=PostingsFormat(name=LuceneFixedGap), lowerfilt1and2=PostingsFormat(name=LuceneFixedGap), end4=Lucene50(blocksize=128), end3=PostingsFormat(name=Direct), end2=PostingsFormat(name=LuceneVarGapDocFreqInterval), end1=PostingsFormat(name=LuceneFixedGap), lowerfilt=PostingsFormat(name=LuceneFixedGap), gram1=PostingsFormat(name=LuceneFixedGap), id=PostingsFormat(name=LuceneVarGapDocFreqInterval), range_facet_i_dv=PostingsFormat(name=LuceneFixedGap), gram2=PostingsFormat(name=LuceneVarGapDocFreqInterval), gram3=PostingsFormat(name=Direct), start3=Lucene50(blocksize=128), gram4=Lucene50(blocksize=128), start2=PostingsFormat(name=LuceneFixedGap), word=PostingsFormat(name=LuceneFixedGap), timestamp=PostingsFormat(name=LuceneFixedGap), start4=PostingsFormat(name=Direct)}, docValues:{range_facet_l_dv=DocValuesFormat(name=Memory), range_facet_i_dv=DocValuesFormat(name=Lucene54), timestamp=DocValuesFormat(name=Lucene54)}, maxPointsInLeafNode=1234, maxMBSortInHeap=7.742414922019764, sim=RandomSimilarity(queryNorm=true,coord=no): {}, locale=sw-CD, timezone=America/Mendoza
   [junit4]   2> NOTE: Linux 4.4.0-47-generic amd64/Oracle Corporation 9-ea (64-bit)/cpus=12,threads=1,free=178550608,total=518979584
   [junit4]   2> NOTE: All tests run in this JVM: [SchemaVersionSpecificBehaviorTest, TestQueryWrapperFilter, DocValuesNotIndexedTest, ChaosMonkeySafeLeaderTest, MoreLikeThisHandlerTest, VersionInfoTest, TestRandomRequestDistribution, ShardRoutingCustomTest, TestRTimerTree, SpellCheckCollatorTest, ShardRoutingTest, TestCoreContainer, TestLRUCache, PreAnalyzedFieldManagedSchemaCloudTest, OverseerCollectionConfigSetProcessorTest, HdfsSyncSliceTest, TermsComponentTest, IndexBasedSpellCheckerTest, LeaderElectionContextKeyTest, CdcrUpdateLogTest, TimerUtilsTest, HttpSolrCallGetCoreTest, TestDeleteCollectionOnDownNodes, TestWordDelimiterFilterFactory, TestCharFilters, TestFieldCacheReopen, CSVRequestHandlerTest, TestCollapseQParserPlugin, SimplePostToolTest, DistributedFacetPivotLargeTest, DateMathParserTest, TlogReplayBufferedWhileIndexingTest, TestQueryTypes, TestLockTree, SolrIndexSplitterTest, SliceStateTest, CursorMarkTest, TestLMDirichletSimilarityFactory, TestStressUserVersions, CollectionsAPIDistributedZkTest, TestFreeTextSuggestions, SortSpecParsingTest, DistributedIntervalFacetingTest, TestConfigSets, HdfsDirectoryFactoryTest, TestPKIAuthenticationPlugin, SpellingQueryConverterTest, TestRawResponseWriter, SolrCmdDistributorTest, SuggestComponentContextFilterQueryTest, RequestLoggingTest, TestReRankQParserPlugin, SSLMigrationTest, TestFieldTypeCollectionResource, IgnoreCommitOptimizeUpdateProcessorFactoryTest, TestChildDocTransformer, ReplicaListTransformerTest, HdfsLockFactoryTest, SampleTest, ClusterStateUpdateTest, DeleteStatusTest, TestDynamicFieldResource, HdfsBasicDistributedZk2Test, BlobRepositoryCloudTest, LoggingHandlerTest, JSONWriterTest, SolrInfoMBeanTest, TestTrie, MultiTermTest, TestSolrIndexConfig, BasicFunctionalityTest, DocumentBuilderTest, SortByFunctionTest, TestLuceneMatchVersion, BasicAuthIntegrationTest, CoreAdminRequestStatusTest, TestCustomDocTransformer, TestShortCircuitedRequests, TestClusterProperties, LeaderInitiatedRecoveryOnCommitTest, TestConfigOverlay, BadCopyFieldTest, TemplateUpdateProcessorTest, DirectSolrConnectionTest, HighlighterTest, CollectionReloadTest, TestSearchPerf, TestExclusionRuleCollectionAccess, TestClusterStateMutator, FileUtilsTest, TermVectorComponentTest, TestCSVResponseWriter, TestInitParams, TestSubQueryTransformerDistrib, SolrIndexConfigTest, TestDistributedGrouping, TestFastOutputStream, BaseCdcrDistributedZkTest, OverseerStatusTest, TestSearcherReuse, TestSlowCompositeReaderWrapper, TestCopyFieldCollectionResource, DeleteNodeTest, DistributedQueryComponentOptimizationTest, UpdateRequestProcessorFactoryTest, TestRequestForwarding, TestUninvertingReader, BasicDistributedZkTest, BasicDistributedZk2Test, OpenCloseCoreStressTest, FullSolrCloudDistribCmdsTest, TestReplicationHandler, ZkCLITest, AutoCommitTest, TestRecovery, TestHashPartitioner, TermVectorComponentDistributedTest, ZkControllerTest, TestRealTimeGet, TestStressReorder, TestReload, TestStressVersions, DistributedTermsComponentTest, TestSolr4Spatial, SpellCheckComponentTest]
   [junit4] Completed [318/658 (1!)] on J1 in 19.05s, 11 tests, 1 error <<< FAILURES!

[...truncated 51085 lines...]


Mime
View raw message