lucene-dev mailing list archives

Site index · List index
Message view « Date » · « Thread »
Top « Date » · « Thread »
From Apache Jenkins Server <jenk...@builds.apache.org>
Subject [JENKINS] Lucene-Solr-NightlyTests-6.x - Build # 219 - Still Unstable
Date Sun, 04 Dec 2016 21:31:31 GMT
Build: https://builds.apache.org/job/Lucene-Solr-NightlyTests-6.x/219/

8 tests failed.
FAILED:  org.apache.lucene.search.TestFuzzyQuery.testRandom

Error Message:
Test abandoned because suite timeout was reached.

Stack Trace:
java.lang.Exception: Test abandoned because suite timeout was reached.
	at __randomizedtesting.SeedInfo.seed([61CECF4512AB645F]:0)


FAILED:  junit.framework.TestSuite.org.apache.lucene.search.TestFuzzyQuery

Error Message:
Suite timeout exceeded (>= 7200000 msec).

Stack Trace:
java.lang.Exception: Suite timeout exceeded (>= 7200000 msec).
	at __randomizedtesting.SeedInfo.seed([61CECF4512AB645F]:0)


FAILED:  org.apache.solr.cloud.ShardSplitTest.testSplitWithChaosMonkey

Error Message:
There are still nodes recoverying - waited for 330 seconds

Stack Trace:
java.lang.AssertionError: There are still nodes recoverying - waited for 330 seconds
	at __randomizedtesting.SeedInfo.seed([76CD8EC0C0347139:FDEA5D118132DABD]:0)
	at org.junit.Assert.fail(Assert.java:93)
	at org.apache.solr.cloud.AbstractDistribZkTestBase.waitForRecoveriesToFinish(AbstractDistribZkTestBase.java:184)
	at org.apache.solr.cloud.AbstractDistribZkTestBase.waitForRecoveriesToFinish(AbstractDistribZkTestBase.java:141)
	at org.apache.solr.cloud.AbstractDistribZkTestBase.waitForRecoveriesToFinish(AbstractDistribZkTestBase.java:136)
	at org.apache.solr.cloud.AbstractFullDistribZkTestBase.waitForRecoveriesToFinish(AbstractFullDistribZkTestBase.java:856)
	at org.apache.solr.cloud.ShardSplitTest.testSplitWithChaosMonkey(ShardSplitTest.java:437)
	at sun.reflect.NativeMethodAccessorImpl.invoke0(Native Method)
	at sun.reflect.NativeMethodAccessorImpl.invoke(NativeMethodAccessorImpl.java:62)
	at sun.reflect.DelegatingMethodAccessorImpl.invoke(DelegatingMethodAccessorImpl.java:43)
	at java.lang.reflect.Method.invoke(Method.java:498)
	at com.carrotsearch.randomizedtesting.RandomizedRunner.invoke(RandomizedRunner.java:1713)
	at com.carrotsearch.randomizedtesting.RandomizedRunner$8.evaluate(RandomizedRunner.java:907)
	at com.carrotsearch.randomizedtesting.RandomizedRunner$9.evaluate(RandomizedRunner.java:943)
	at com.carrotsearch.randomizedtesting.RandomizedRunner$10.evaluate(RandomizedRunner.java:957)
	at org.apache.solr.BaseDistributedSearchTestCase$ShardsRepeatRule$ShardsFixedStatement.callStatement(BaseDistributedSearchTestCase.java:992)
	at org.apache.solr.BaseDistributedSearchTestCase$ShardsRepeatRule$ShardsStatement.evaluate(BaseDistributedSearchTestCase.java:967)
	at com.carrotsearch.randomizedtesting.rules.SystemPropertiesRestoreRule$1.evaluate(SystemPropertiesRestoreRule.java:57)
	at org.apache.lucene.util.TestRuleSetupTeardownChained$1.evaluate(TestRuleSetupTeardownChained.java:49)
	at org.apache.lucene.util.AbstractBeforeAfterRule$1.evaluate(AbstractBeforeAfterRule.java:45)
	at org.apache.lucene.util.TestRuleThreadAndTestName$1.evaluate(TestRuleThreadAndTestName.java:48)
	at org.apache.lucene.util.TestRuleIgnoreAfterMaxFailures$1.evaluate(TestRuleIgnoreAfterMaxFailures.java:64)
	at org.apache.lucene.util.TestRuleMarkFailure$1.evaluate(TestRuleMarkFailure.java:47)
	at com.carrotsearch.randomizedtesting.rules.StatementAdapter.evaluate(StatementAdapter.java:36)
	at com.carrotsearch.randomizedtesting.ThreadLeakControl$StatementRunner.run(ThreadLeakControl.java:367)
	at com.carrotsearch.randomizedtesting.ThreadLeakControl.forkTimeoutingTask(ThreadLeakControl.java:811)
	at com.carrotsearch.randomizedtesting.ThreadLeakControl$3.evaluate(ThreadLeakControl.java:462)
	at com.carrotsearch.randomizedtesting.RandomizedRunner.runSingleTest(RandomizedRunner.java:916)
	at com.carrotsearch.randomizedtesting.RandomizedRunner$5.evaluate(RandomizedRunner.java:802)
	at com.carrotsearch.randomizedtesting.RandomizedRunner$6.evaluate(RandomizedRunner.java:852)
	at com.carrotsearch.randomizedtesting.RandomizedRunner$7.evaluate(RandomizedRunner.java:863)
	at com.carrotsearch.randomizedtesting.rules.StatementAdapter.evaluate(StatementAdapter.java:36)
	at com.carrotsearch.randomizedtesting.rules.SystemPropertiesRestoreRule$1.evaluate(SystemPropertiesRestoreRule.java:57)
	at org.apache.lucene.util.AbstractBeforeAfterRule$1.evaluate(AbstractBeforeAfterRule.java:45)
	at com.carrotsearch.randomizedtesting.rules.StatementAdapter.evaluate(StatementAdapter.java:36)
	at org.apache.lucene.util.TestRuleStoreClassName$1.evaluate(TestRuleStoreClassName.java:41)
	at com.carrotsearch.randomizedtesting.rules.NoShadowingOrOverridesOnMethodsRule$1.evaluate(NoShadowingOrOverridesOnMethodsRule.java:40)
	at com.carrotsearch.randomizedtesting.rules.NoShadowingOrOverridesOnMethodsRule$1.evaluate(NoShadowingOrOverridesOnMethodsRule.java:40)
	at com.carrotsearch.randomizedtesting.rules.StatementAdapter.evaluate(StatementAdapter.java:36)
	at com.carrotsearch.randomizedtesting.rules.StatementAdapter.evaluate(StatementAdapter.java:36)
	at com.carrotsearch.randomizedtesting.rules.StatementAdapter.evaluate(StatementAdapter.java:36)
	at org.apache.lucene.util.TestRuleAssertionsRequired$1.evaluate(TestRuleAssertionsRequired.java:53)
	at org.apache.lucene.util.TestRuleMarkFailure$1.evaluate(TestRuleMarkFailure.java:47)
	at org.apache.lucene.util.TestRuleIgnoreAfterMaxFailures$1.evaluate(TestRuleIgnoreAfterMaxFailures.java:64)
	at org.apache.lucene.util.TestRuleIgnoreTestSuites$1.evaluate(TestRuleIgnoreTestSuites.java:54)
	at com.carrotsearch.randomizedtesting.rules.StatementAdapter.evaluate(StatementAdapter.java:36)
	at com.carrotsearch.randomizedtesting.ThreadLeakControl$StatementRunner.run(ThreadLeakControl.java:367)
	at java.lang.Thread.run(Thread.java:745)


FAILED:  org.apache.solr.cloud.hdfs.HdfsUnloadDistributedZkTest.test

Error Message:
Error from server at http://127.0.0.1:48273: Error CREATEing SolrCore 'test_unload_shard_and_collection_2': Unable to create core [test_unload_shard_and_collection_2] Caused by: Direct buffer memory

Stack Trace:
org.apache.solr.client.solrj.impl.HttpSolrClient$RemoteSolrException: Error from server at http://127.0.0.1:48273: Error CREATEing SolrCore 'test_unload_shard_and_collection_2': Unable to create core [test_unload_shard_and_collection_2] Caused by: Direct buffer memory
	at __randomizedtesting.SeedInfo.seed([76CD8EC0C0347139:FE99B11A6EC81CC1]:0)
	at org.apache.solr.client.solrj.impl.HttpSolrClient.executeMethod(HttpSolrClient.java:593)
	at org.apache.solr.client.solrj.impl.HttpSolrClient.request(HttpSolrClient.java:262)
	at org.apache.solr.client.solrj.impl.HttpSolrClient.request(HttpSolrClient.java:251)
	at org.apache.solr.client.solrj.SolrClient.request(SolrClient.java:1219)
	at org.apache.solr.cloud.UnloadDistributedZkTest.testUnloadShardAndCollection(UnloadDistributedZkTest.java:133)
	at org.apache.solr.cloud.UnloadDistributedZkTest.test(UnloadDistributedZkTest.java:70)
	at sun.reflect.NativeMethodAccessorImpl.invoke0(Native Method)
	at sun.reflect.NativeMethodAccessorImpl.invoke(NativeMethodAccessorImpl.java:62)
	at sun.reflect.DelegatingMethodAccessorImpl.invoke(DelegatingMethodAccessorImpl.java:43)
	at java.lang.reflect.Method.invoke(Method.java:498)
	at com.carrotsearch.randomizedtesting.RandomizedRunner.invoke(RandomizedRunner.java:1713)
	at com.carrotsearch.randomizedtesting.RandomizedRunner$8.evaluate(RandomizedRunner.java:907)
	at com.carrotsearch.randomizedtesting.RandomizedRunner$9.evaluate(RandomizedRunner.java:943)
	at com.carrotsearch.randomizedtesting.RandomizedRunner$10.evaluate(RandomizedRunner.java:957)
	at org.apache.solr.BaseDistributedSearchTestCase$ShardsRepeatRule$ShardsFixedStatement.callStatement(BaseDistributedSearchTestCase.java:992)
	at org.apache.solr.BaseDistributedSearchTestCase$ShardsRepeatRule$ShardsStatement.evaluate(BaseDistributedSearchTestCase.java:967)
	at com.carrotsearch.randomizedtesting.rules.SystemPropertiesRestoreRule$1.evaluate(SystemPropertiesRestoreRule.java:57)
	at org.apache.lucene.util.TestRuleSetupTeardownChained$1.evaluate(TestRuleSetupTeardownChained.java:49)
	at org.apache.lucene.util.AbstractBeforeAfterRule$1.evaluate(AbstractBeforeAfterRule.java:45)
	at org.apache.lucene.util.TestRuleThreadAndTestName$1.evaluate(TestRuleThreadAndTestName.java:48)
	at org.apache.lucene.util.TestRuleIgnoreAfterMaxFailures$1.evaluate(TestRuleIgnoreAfterMaxFailures.java:64)
	at org.apache.lucene.util.TestRuleMarkFailure$1.evaluate(TestRuleMarkFailure.java:47)
	at com.carrotsearch.randomizedtesting.rules.StatementAdapter.evaluate(StatementAdapter.java:36)
	at com.carrotsearch.randomizedtesting.ThreadLeakControl$StatementRunner.run(ThreadLeakControl.java:367)
	at com.carrotsearch.randomizedtesting.ThreadLeakControl.forkTimeoutingTask(ThreadLeakControl.java:811)
	at com.carrotsearch.randomizedtesting.ThreadLeakControl$3.evaluate(ThreadLeakControl.java:462)
	at com.carrotsearch.randomizedtesting.RandomizedRunner.runSingleTest(RandomizedRunner.java:916)
	at com.carrotsearch.randomizedtesting.RandomizedRunner$5.evaluate(RandomizedRunner.java:802)
	at com.carrotsearch.randomizedtesting.RandomizedRunner$6.evaluate(RandomizedRunner.java:852)
	at com.carrotsearch.randomizedtesting.RandomizedRunner$7.evaluate(RandomizedRunner.java:863)
	at com.carrotsearch.randomizedtesting.rules.StatementAdapter.evaluate(StatementAdapter.java:36)
	at com.carrotsearch.randomizedtesting.rules.SystemPropertiesRestoreRule$1.evaluate(SystemPropertiesRestoreRule.java:57)
	at org.apache.lucene.util.AbstractBeforeAfterRule$1.evaluate(AbstractBeforeAfterRule.java:45)
	at com.carrotsearch.randomizedtesting.rules.StatementAdapter.evaluate(StatementAdapter.java:36)
	at org.apache.lucene.util.TestRuleStoreClassName$1.evaluate(TestRuleStoreClassName.java:41)
	at com.carrotsearch.randomizedtesting.rules.NoShadowingOrOverridesOnMethodsRule$1.evaluate(NoShadowingOrOverridesOnMethodsRule.java:40)
	at com.carrotsearch.randomizedtesting.rules.NoShadowingOrOverridesOnMethodsRule$1.evaluate(NoShadowingOrOverridesOnMethodsRule.java:40)
	at com.carrotsearch.randomizedtesting.rules.StatementAdapter.evaluate(StatementAdapter.java:36)
	at com.carrotsearch.randomizedtesting.rules.StatementAdapter.evaluate(StatementAdapter.java:36)
	at com.carrotsearch.randomizedtesting.rules.StatementAdapter.evaluate(StatementAdapter.java:36)
	at org.apache.lucene.util.TestRuleAssertionsRequired$1.evaluate(TestRuleAssertionsRequired.java:53)
	at org.apache.lucene.util.TestRuleMarkFailure$1.evaluate(TestRuleMarkFailure.java:47)
	at org.apache.lucene.util.TestRuleIgnoreAfterMaxFailures$1.evaluate(TestRuleIgnoreAfterMaxFailures.java:64)
	at org.apache.lucene.util.TestRuleIgnoreTestSuites$1.evaluate(TestRuleIgnoreTestSuites.java:54)
	at com.carrotsearch.randomizedtesting.rules.StatementAdapter.evaluate(StatementAdapter.java:36)
	at com.carrotsearch.randomizedtesting.ThreadLeakControl$StatementRunner.run(ThreadLeakControl.java:367)
	at java.lang.Thread.run(Thread.java:745)


FAILED:  org.apache.solr.cloud.hdfs.StressHdfsTest.test

Error Message:
Could not find collection:delete_data_dir

Stack Trace:
java.lang.AssertionError: Could not find collection:delete_data_dir
	at __randomizedtesting.SeedInfo.seed([76CD8EC0C0347139:FE99B11A6EC81CC1]:0)
	at org.junit.Assert.fail(Assert.java:93)
	at org.junit.Assert.assertTrue(Assert.java:43)
	at org.junit.Assert.assertNotNull(Assert.java:526)
	at org.apache.solr.cloud.AbstractDistribZkTestBase.waitForRecoveriesToFinish(AbstractDistribZkTestBase.java:156)
	at org.apache.solr.cloud.AbstractDistribZkTestBase.waitForRecoveriesToFinish(AbstractDistribZkTestBase.java:141)
	at org.apache.solr.cloud.AbstractDistribZkTestBase.waitForRecoveriesToFinish(AbstractDistribZkTestBase.java:136)
	at org.apache.solr.cloud.AbstractFullDistribZkTestBase.waitForRecoveriesToFinish(AbstractFullDistribZkTestBase.java:856)
	at org.apache.solr.cloud.hdfs.StressHdfsTest.createAndDeleteCollection(StressHdfsTest.java:159)
	at org.apache.solr.cloud.hdfs.StressHdfsTest.test(StressHdfsTest.java:103)
	at sun.reflect.NativeMethodAccessorImpl.invoke0(Native Method)
	at sun.reflect.NativeMethodAccessorImpl.invoke(NativeMethodAccessorImpl.java:62)
	at sun.reflect.DelegatingMethodAccessorImpl.invoke(DelegatingMethodAccessorImpl.java:43)
	at java.lang.reflect.Method.invoke(Method.java:498)
	at com.carrotsearch.randomizedtesting.RandomizedRunner.invoke(RandomizedRunner.java:1713)
	at com.carrotsearch.randomizedtesting.RandomizedRunner$8.evaluate(RandomizedRunner.java:907)
	at com.carrotsearch.randomizedtesting.RandomizedRunner$9.evaluate(RandomizedRunner.java:943)
	at com.carrotsearch.randomizedtesting.RandomizedRunner$10.evaluate(RandomizedRunner.java:957)
	at org.apache.solr.BaseDistributedSearchTestCase$ShardsRepeatRule$ShardsFixedStatement.callStatement(BaseDistributedSearchTestCase.java:992)
	at org.apache.solr.BaseDistributedSearchTestCase$ShardsRepeatRule$ShardsStatement.evaluate(BaseDistributedSearchTestCase.java:967)
	at com.carrotsearch.randomizedtesting.rules.SystemPropertiesRestoreRule$1.evaluate(SystemPropertiesRestoreRule.java:57)
	at org.apache.lucene.util.TestRuleSetupTeardownChained$1.evaluate(TestRuleSetupTeardownChained.java:49)
	at org.apache.lucene.util.AbstractBeforeAfterRule$1.evaluate(AbstractBeforeAfterRule.java:45)
	at org.apache.lucene.util.TestRuleThreadAndTestName$1.evaluate(TestRuleThreadAndTestName.java:48)
	at org.apache.lucene.util.TestRuleIgnoreAfterMaxFailures$1.evaluate(TestRuleIgnoreAfterMaxFailures.java:64)
	at org.apache.lucene.util.TestRuleMarkFailure$1.evaluate(TestRuleMarkFailure.java:47)
	at com.carrotsearch.randomizedtesting.rules.StatementAdapter.evaluate(StatementAdapter.java:36)
	at com.carrotsearch.randomizedtesting.ThreadLeakControl$StatementRunner.run(ThreadLeakControl.java:367)
	at com.carrotsearch.randomizedtesting.ThreadLeakControl.forkTimeoutingTask(ThreadLeakControl.java:811)
	at com.carrotsearch.randomizedtesting.ThreadLeakControl$3.evaluate(ThreadLeakControl.java:462)
	at com.carrotsearch.randomizedtesting.RandomizedRunner.runSingleTest(RandomizedRunner.java:916)
	at com.carrotsearch.randomizedtesting.RandomizedRunner$5.evaluate(RandomizedRunner.java:802)
	at com.carrotsearch.randomizedtesting.RandomizedRunner$6.evaluate(RandomizedRunner.java:852)
	at com.carrotsearch.randomizedtesting.RandomizedRunner$7.evaluate(RandomizedRunner.java:863)
	at com.carrotsearch.randomizedtesting.rules.StatementAdapter.evaluate(StatementAdapter.java:36)
	at com.carrotsearch.randomizedtesting.rules.SystemPropertiesRestoreRule$1.evaluate(SystemPropertiesRestoreRule.java:57)
	at org.apache.lucene.util.AbstractBeforeAfterRule$1.evaluate(AbstractBeforeAfterRule.java:45)
	at com.carrotsearch.randomizedtesting.rules.StatementAdapter.evaluate(StatementAdapter.java:36)
	at org.apache.lucene.util.TestRuleStoreClassName$1.evaluate(TestRuleStoreClassName.java:41)
	at com.carrotsearch.randomizedtesting.rules.NoShadowingOrOverridesOnMethodsRule$1.evaluate(NoShadowingOrOverridesOnMethodsRule.java:40)
	at com.carrotsearch.randomizedtesting.rules.NoShadowingOrOverridesOnMethodsRule$1.evaluate(NoShadowingOrOverridesOnMethodsRule.java:40)
	at com.carrotsearch.randomizedtesting.rules.StatementAdapter.evaluate(StatementAdapter.java:36)
	at com.carrotsearch.randomizedtesting.rules.StatementAdapter.evaluate(StatementAdapter.java:36)
	at com.carrotsearch.randomizedtesting.rules.StatementAdapter.evaluate(StatementAdapter.java:36)
	at org.apache.lucene.util.TestRuleAssertionsRequired$1.evaluate(TestRuleAssertionsRequired.java:53)
	at org.apache.lucene.util.TestRuleMarkFailure$1.evaluate(TestRuleMarkFailure.java:47)
	at org.apache.lucene.util.TestRuleIgnoreAfterMaxFailures$1.evaluate(TestRuleIgnoreAfterMaxFailures.java:64)
	at org.apache.lucene.util.TestRuleIgnoreTestSuites$1.evaluate(TestRuleIgnoreTestSuites.java:54)
	at com.carrotsearch.randomizedtesting.rules.StatementAdapter.evaluate(StatementAdapter.java:36)
	at com.carrotsearch.randomizedtesting.ThreadLeakControl$StatementRunner.run(ThreadLeakControl.java:367)
	at java.lang.Thread.run(Thread.java:745)


FAILED:  org.apache.solr.cloud.SharedFSAutoReplicaFailoverTest.test

Error Message:
Timeout waiting for all live and active

Stack Trace:
java.lang.AssertionError: Timeout waiting for all live and active
	at __randomizedtesting.SeedInfo.seed([76CD8EC0C0347139:FE99B11A6EC81CC1]:0)
	at org.junit.Assert.fail(Assert.java:93)
	at org.junit.Assert.assertTrue(Assert.java:43)
	at org.apache.solr.cloud.SharedFSAutoReplicaFailoverTest.testBasics(SharedFSAutoReplicaFailoverTest.java:309)
	at org.apache.solr.cloud.SharedFSAutoReplicaFailoverTest.test(SharedFSAutoReplicaFailoverTest.java:127)
	at sun.reflect.NativeMethodAccessorImpl.invoke0(Native Method)
	at sun.reflect.NativeMethodAccessorImpl.invoke(NativeMethodAccessorImpl.java:62)
	at sun.reflect.DelegatingMethodAccessorImpl.invoke(DelegatingMethodAccessorImpl.java:43)
	at java.lang.reflect.Method.invoke(Method.java:498)
	at com.carrotsearch.randomizedtesting.RandomizedRunner.invoke(RandomizedRunner.java:1713)
	at com.carrotsearch.randomizedtesting.RandomizedRunner$8.evaluate(RandomizedRunner.java:907)
	at com.carrotsearch.randomizedtesting.RandomizedRunner$9.evaluate(RandomizedRunner.java:943)
	at com.carrotsearch.randomizedtesting.RandomizedRunner$10.evaluate(RandomizedRunner.java:957)
	at org.apache.solr.BaseDistributedSearchTestCase$ShardsRepeatRule$ShardsFixedStatement.callStatement(BaseDistributedSearchTestCase.java:992)
	at org.apache.solr.BaseDistributedSearchTestCase$ShardsRepeatRule$ShardsStatement.evaluate(BaseDistributedSearchTestCase.java:967)
	at com.carrotsearch.randomizedtesting.rules.SystemPropertiesRestoreRule$1.evaluate(SystemPropertiesRestoreRule.java:57)
	at org.apache.lucene.util.TestRuleSetupTeardownChained$1.evaluate(TestRuleSetupTeardownChained.java:49)
	at org.apache.lucene.util.AbstractBeforeAfterRule$1.evaluate(AbstractBeforeAfterRule.java:45)
	at org.apache.lucene.util.TestRuleThreadAndTestName$1.evaluate(TestRuleThreadAndTestName.java:48)
	at org.apache.lucene.util.TestRuleIgnoreAfterMaxFailures$1.evaluate(TestRuleIgnoreAfterMaxFailures.java:64)
	at org.apache.lucene.util.TestRuleMarkFailure$1.evaluate(TestRuleMarkFailure.java:47)
	at com.carrotsearch.randomizedtesting.rules.StatementAdapter.evaluate(StatementAdapter.java:36)
	at com.carrotsearch.randomizedtesting.ThreadLeakControl$StatementRunner.run(ThreadLeakControl.java:367)
	at com.carrotsearch.randomizedtesting.ThreadLeakControl.forkTimeoutingTask(ThreadLeakControl.java:811)
	at com.carrotsearch.randomizedtesting.ThreadLeakControl$3.evaluate(ThreadLeakControl.java:462)
	at com.carrotsearch.randomizedtesting.RandomizedRunner.runSingleTest(RandomizedRunner.java:916)
	at com.carrotsearch.randomizedtesting.RandomizedRunner$5.evaluate(RandomizedRunner.java:802)
	at com.carrotsearch.randomizedtesting.RandomizedRunner$6.evaluate(RandomizedRunner.java:852)
	at com.carrotsearch.randomizedtesting.RandomizedRunner$7.evaluate(RandomizedRunner.java:863)
	at com.carrotsearch.randomizedtesting.rules.StatementAdapter.evaluate(StatementAdapter.java:36)
	at com.carrotsearch.randomizedtesting.rules.SystemPropertiesRestoreRule$1.evaluate(SystemPropertiesRestoreRule.java:57)
	at org.apache.lucene.util.AbstractBeforeAfterRule$1.evaluate(AbstractBeforeAfterRule.java:45)
	at com.carrotsearch.randomizedtesting.rules.StatementAdapter.evaluate(StatementAdapter.java:36)
	at org.apache.lucene.util.TestRuleStoreClassName$1.evaluate(TestRuleStoreClassName.java:41)
	at com.carrotsearch.randomizedtesting.rules.NoShadowingOrOverridesOnMethodsRule$1.evaluate(NoShadowingOrOverridesOnMethodsRule.java:40)
	at com.carrotsearch.randomizedtesting.rules.NoShadowingOrOverridesOnMethodsRule$1.evaluate(NoShadowingOrOverridesOnMethodsRule.java:40)
	at com.carrotsearch.randomizedtesting.rules.StatementAdapter.evaluate(StatementAdapter.java:36)
	at com.carrotsearch.randomizedtesting.rules.StatementAdapter.evaluate(StatementAdapter.java:36)
	at com.carrotsearch.randomizedtesting.rules.StatementAdapter.evaluate(StatementAdapter.java:36)
	at org.apache.lucene.util.TestRuleAssertionsRequired$1.evaluate(TestRuleAssertionsRequired.java:53)
	at org.apache.lucene.util.TestRuleMarkFailure$1.evaluate(TestRuleMarkFailure.java:47)
	at org.apache.lucene.util.TestRuleIgnoreAfterMaxFailures$1.evaluate(TestRuleIgnoreAfterMaxFailures.java:64)
	at org.apache.lucene.util.TestRuleIgnoreTestSuites$1.evaluate(TestRuleIgnoreTestSuites.java:54)
	at com.carrotsearch.randomizedtesting.rules.StatementAdapter.evaluate(StatementAdapter.java:36)
	at com.carrotsearch.randomizedtesting.ThreadLeakControl$StatementRunner.run(ThreadLeakControl.java:367)
	at java.lang.Thread.run(Thread.java:745)


FAILED:  org.apache.solr.cloud.hdfs.HdfsCollectionsAPIDistributedZkTest.testCollectionsAPI

Error Message:
Expected to see collection awhollynewcollection_0 null Last available state: DocCollection(awhollynewcollection_0//collections/awhollynewcollection_0/state.json/3)={   "replicationFactor":"1",   "shards":{     "shard1":{       "range":"80000000-bfffffff",       "state":"active",       "replicas":{}},     "shard2":{       "range":"c0000000-ffffffff",       "state":"active",       "replicas":{}},     "shard3":{       "range":"0-3fffffff",       "state":"active",       "replicas":{}},     "shard4":{       "range":"40000000-7fffffff",       "state":"active",       "replicas":{}}},   "router":{"name":"compositeId"},   "maxShardsPerNode":"2",   "autoAddReplicas":"false"}

Stack Trace:
java.lang.AssertionError: Expected to see collection awhollynewcollection_0
null
Last available state: DocCollection(awhollynewcollection_0//collections/awhollynewcollection_0/state.json/3)={
  "replicationFactor":"1",
  "shards":{
    "shard1":{
      "range":"80000000-bfffffff",
      "state":"active",
      "replicas":{}},
    "shard2":{
      "range":"c0000000-ffffffff",
      "state":"active",
      "replicas":{}},
    "shard3":{
      "range":"0-3fffffff",
      "state":"active",
      "replicas":{}},
    "shard4":{
      "range":"40000000-7fffffff",
      "state":"active",
      "replicas":{}}},
  "router":{"name":"compositeId"},
  "maxShardsPerNode":"2",
  "autoAddReplicas":"false"}
	at __randomizedtesting.SeedInfo.seed([76CD8EC0C0347139:3EB8FA74C6075EAC]:0)
	at org.junit.Assert.fail(Assert.java:93)
	at org.apache.solr.cloud.SolrCloudTestCase.waitForState(SolrCloudTestCase.java:237)
	at org.apache.solr.cloud.CollectionsAPIDistributedZkTest.testCollectionsAPI(CollectionsAPIDistributedZkTest.java:496)
	at sun.reflect.NativeMethodAccessorImpl.invoke0(Native Method)
	at sun.reflect.NativeMethodAccessorImpl.invoke(NativeMethodAccessorImpl.java:62)
	at sun.reflect.DelegatingMethodAccessorImpl.invoke(DelegatingMethodAccessorImpl.java:43)
	at java.lang.reflect.Method.invoke(Method.java:498)
	at com.carrotsearch.randomizedtesting.RandomizedRunner.invoke(RandomizedRunner.java:1713)
	at com.carrotsearch.randomizedtesting.RandomizedRunner$8.evaluate(RandomizedRunner.java:907)
	at com.carrotsearch.randomizedtesting.RandomizedRunner$9.evaluate(RandomizedRunner.java:943)
	at com.carrotsearch.randomizedtesting.RandomizedRunner$10.evaluate(RandomizedRunner.java:957)
	at com.carrotsearch.randomizedtesting.rules.SystemPropertiesRestoreRule$1.evaluate(SystemPropertiesRestoreRule.java:57)
	at org.apache.lucene.util.TestRuleSetupTeardownChained$1.evaluate(TestRuleSetupTeardownChained.java:49)
	at org.apache.lucene.util.AbstractBeforeAfterRule$1.evaluate(AbstractBeforeAfterRule.java:45)
	at org.apache.lucene.util.TestRuleThreadAndTestName$1.evaluate(TestRuleThreadAndTestName.java:48)
	at org.apache.lucene.util.TestRuleIgnoreAfterMaxFailures$1.evaluate(TestRuleIgnoreAfterMaxFailures.java:64)
	at org.apache.lucene.util.TestRuleMarkFailure$1.evaluate(TestRuleMarkFailure.java:47)
	at com.carrotsearch.randomizedtesting.rules.StatementAdapter.evaluate(StatementAdapter.java:36)
	at com.carrotsearch.randomizedtesting.ThreadLeakControl$StatementRunner.run(ThreadLeakControl.java:367)
	at com.carrotsearch.randomizedtesting.ThreadLeakControl.forkTimeoutingTask(ThreadLeakControl.java:811)
	at com.carrotsearch.randomizedtesting.ThreadLeakControl$3.evaluate(ThreadLeakControl.java:462)
	at com.carrotsearch.randomizedtesting.RandomizedRunner.runSingleTest(RandomizedRunner.java:916)
	at com.carrotsearch.randomizedtesting.RandomizedRunner$5.evaluate(RandomizedRunner.java:802)
	at com.carrotsearch.randomizedtesting.RandomizedRunner$6.evaluate(RandomizedRunner.java:852)
	at com.carrotsearch.randomizedtesting.RandomizedRunner$7.evaluate(RandomizedRunner.java:863)
	at com.carrotsearch.randomizedtesting.rules.StatementAdapter.evaluate(StatementAdapter.java:36)
	at com.carrotsearch.randomizedtesting.rules.SystemPropertiesRestoreRule$1.evaluate(SystemPropertiesRestoreRule.java:57)
	at org.apache.lucene.util.AbstractBeforeAfterRule$1.evaluate(AbstractBeforeAfterRule.java:45)
	at com.carrotsearch.randomizedtesting.rules.StatementAdapter.evaluate(StatementAdapter.java:36)
	at org.apache.lucene.util.TestRuleStoreClassName$1.evaluate(TestRuleStoreClassName.java:41)
	at com.carrotsearch.randomizedtesting.rules.NoShadowingOrOverridesOnMethodsRule$1.evaluate(NoShadowingOrOverridesOnMethodsRule.java:40)
	at com.carrotsearch.randomizedtesting.rules.NoShadowingOrOverridesOnMethodsRule$1.evaluate(NoShadowingOrOverridesOnMethodsRule.java:40)
	at com.carrotsearch.randomizedtesting.rules.StatementAdapter.evaluate(StatementAdapter.java:36)
	at com.carrotsearch.randomizedtesting.rules.StatementAdapter.evaluate(StatementAdapter.java:36)
	at com.carrotsearch.randomizedtesting.rules.StatementAdapter.evaluate(StatementAdapter.java:36)
	at org.apache.lucene.util.TestRuleAssertionsRequired$1.evaluate(TestRuleAssertionsRequired.java:53)
	at org.apache.lucene.util.TestRuleMarkFailure$1.evaluate(TestRuleMarkFailure.java:47)
	at org.apache.lucene.util.TestRuleIgnoreAfterMaxFailures$1.evaluate(TestRuleIgnoreAfterMaxFailures.java:64)
	at org.apache.lucene.util.TestRuleIgnoreTestSuites$1.evaluate(TestRuleIgnoreTestSuites.java:54)
	at com.carrotsearch.randomizedtesting.rules.StatementAdapter.evaluate(StatementAdapter.java:36)
	at com.carrotsearch.randomizedtesting.ThreadLeakControl$StatementRunner.run(ThreadLeakControl.java:367)
	at java.lang.Thread.run(Thread.java:745)


FAILED:  org.apache.solr.cloud.hdfs.HdfsCollectionsAPIDistributedZkTest.testSpecificConfigsets

Error Message:
KeeperErrorCode = NoNode for /collections/withconfigset2

Stack Trace:
org.apache.zookeeper.KeeperException$NoNodeException: KeeperErrorCode = NoNode for /collections/withconfigset2
	at __randomizedtesting.SeedInfo.seed([76CD8EC0C0347139:5BB3C19A3710CB35]:0)
	at org.apache.zookeeper.KeeperException.create(KeeperException.java:111)
	at org.apache.zookeeper.KeeperException.create(KeeperException.java:51)
	at org.apache.zookeeper.ZooKeeper.getData(ZooKeeper.java:1155)
	at org.apache.solr.common.cloud.SolrZkClient$7.execute(SolrZkClient.java:356)
	at org.apache.solr.common.cloud.SolrZkClient$7.execute(SolrZkClient.java:353)
	at org.apache.solr.common.cloud.ZkCmdExecutor.retryOperation(ZkCmdExecutor.java:60)
	at org.apache.solr.common.cloud.SolrZkClient.getData(SolrZkClient.java:353)
	at org.apache.solr.cloud.CollectionsAPIDistributedZkTest.testSpecificConfigsets(CollectionsAPIDistributedZkTest.java:425)
	at sun.reflect.NativeMethodAccessorImpl.invoke0(Native Method)
	at sun.reflect.NativeMethodAccessorImpl.invoke(NativeMethodAccessorImpl.java:62)
	at sun.reflect.DelegatingMethodAccessorImpl.invoke(DelegatingMethodAccessorImpl.java:43)
	at java.lang.reflect.Method.invoke(Method.java:498)
	at com.carrotsearch.randomizedtesting.RandomizedRunner.invoke(RandomizedRunner.java:1713)
	at com.carrotsearch.randomizedtesting.RandomizedRunner$8.evaluate(RandomizedRunner.java:907)
	at com.carrotsearch.randomizedtesting.RandomizedRunner$9.evaluate(RandomizedRunner.java:943)
	at com.carrotsearch.randomizedtesting.RandomizedRunner$10.evaluate(RandomizedRunner.java:957)
	at com.carrotsearch.randomizedtesting.rules.SystemPropertiesRestoreRule$1.evaluate(SystemPropertiesRestoreRule.java:57)
	at org.apache.lucene.util.TestRuleSetupTeardownChained$1.evaluate(TestRuleSetupTeardownChained.java:49)
	at org.apache.lucene.util.AbstractBeforeAfterRule$1.evaluate(AbstractBeforeAfterRule.java:45)
	at org.apache.lucene.util.TestRuleThreadAndTestName$1.evaluate(TestRuleThreadAndTestName.java:48)
	at org.apache.lucene.util.TestRuleIgnoreAfterMaxFailures$1.evaluate(TestRuleIgnoreAfterMaxFailures.java:64)
	at org.apache.lucene.util.TestRuleMarkFailure$1.evaluate(TestRuleMarkFailure.java:47)
	at com.carrotsearch.randomizedtesting.rules.StatementAdapter.evaluate(StatementAdapter.java:36)
	at com.carrotsearch.randomizedtesting.ThreadLeakControl$StatementRunner.run(ThreadLeakControl.java:367)
	at com.carrotsearch.randomizedtesting.ThreadLeakControl.forkTimeoutingTask(ThreadLeakControl.java:811)
	at com.carrotsearch.randomizedtesting.ThreadLeakControl$3.evaluate(ThreadLeakControl.java:462)
	at com.carrotsearch.randomizedtesting.RandomizedRunner.runSingleTest(RandomizedRunner.java:916)
	at com.carrotsearch.randomizedtesting.RandomizedRunner$5.evaluate(RandomizedRunner.java:802)
	at com.carrotsearch.randomizedtesting.RandomizedRunner$6.evaluate(RandomizedRunner.java:852)
	at com.carrotsearch.randomizedtesting.RandomizedRunner$7.evaluate(RandomizedRunner.java:863)
	at com.carrotsearch.randomizedtesting.rules.StatementAdapter.evaluate(StatementAdapter.java:36)
	at com.carrotsearch.randomizedtesting.rules.SystemPropertiesRestoreRule$1.evaluate(SystemPropertiesRestoreRule.java:57)
	at org.apache.lucene.util.AbstractBeforeAfterRule$1.evaluate(AbstractBeforeAfterRule.java:45)
	at com.carrotsearch.randomizedtesting.rules.StatementAdapter.evaluate(StatementAdapter.java:36)
	at org.apache.lucene.util.TestRuleStoreClassName$1.evaluate(TestRuleStoreClassName.java:41)
	at com.carrotsearch.randomizedtesting.rules.NoShadowingOrOverridesOnMethodsRule$1.evaluate(NoShadowingOrOverridesOnMethodsRule.java:40)
	at com.carrotsearch.randomizedtesting.rules.NoShadowingOrOverridesOnMethodsRule$1.evaluate(NoShadowingOrOverridesOnMethodsRule.java:40)
	at com.carrotsearch.randomizedtesting.rules.StatementAdapter.evaluate(StatementAdapter.java:36)
	at com.carrotsearch.randomizedtesting.rules.StatementAdapter.evaluate(StatementAdapter.java:36)
	at com.carrotsearch.randomizedtesting.rules.StatementAdapter.evaluate(StatementAdapter.java:36)
	at org.apache.lucene.util.TestRuleAssertionsRequired$1.evaluate(TestRuleAssertionsRequired.java:53)
	at org.apache.lucene.util.TestRuleMarkFailure$1.evaluate(TestRuleMarkFailure.java:47)
	at org.apache.lucene.util.TestRuleIgnoreAfterMaxFailures$1.evaluate(TestRuleIgnoreAfterMaxFailures.java:64)
	at org.apache.lucene.util.TestRuleIgnoreTestSuites$1.evaluate(TestRuleIgnoreTestSuites.java:54)
	at com.carrotsearch.randomizedtesting.rules.StatementAdapter.evaluate(StatementAdapter.java:36)
	at com.carrotsearch.randomizedtesting.ThreadLeakControl$StatementRunner.run(ThreadLeakControl.java:367)
	at java.lang.Thread.run(Thread.java:745)




Build Log:
[...truncated 1611 lines...]
   [junit4] Suite: org.apache.lucene.search.TestFuzzyQuery
   [junit4]   2> déc. 05, 2016 3:57:58 AM com.carrotsearch.randomizedtesting.ThreadLeakControl$2 evaluate
   [junit4]   2> WARNING: Suite execution timed out: org.apache.lucene.search.TestFuzzyQuery
   [junit4]   2>    1) Thread[id=1, name=main, state=WAITING, group=main]
   [junit4]   2>         at java.lang.Object.wait(Native Method)
   [junit4]   2>         at java.lang.Thread.join(Thread.java:1249)
   [junit4]   2>         at java.lang.Thread.join(Thread.java:1323)
   [junit4]   2>         at com.carrotsearch.randomizedtesting.RandomizedRunner.runSuite(RandomizedRunner.java:608)
   [junit4]   2>         at com.carrotsearch.randomizedtesting.RandomizedRunner.run(RandomizedRunner.java:457)
   [junit4]   2>         at com.carrotsearch.ant.tasks.junit4.slave.SlaveMain.execute(SlaveMain.java:243)
   [junit4]   2>         at com.carrotsearch.ant.tasks.junit4.slave.SlaveMain.main(SlaveMain.java:354)
   [junit4]   2>         at com.carrotsearch.ant.tasks.junit4.slave.SlaveMainSafe.main(SlaveMainSafe.java:10)
   [junit4]   2>    2) Thread[id=38, name=SUITE-TestFuzzyQuery-seed#[61CECF4512AB645F], state=RUNNABLE, group=TGRP-TestFuzzyQuery]
   [junit4]   2>         at java.lang.Thread.getStackTrace(Thread.java:1556)
   [junit4]   2>         at com.carrotsearch.randomizedtesting.ThreadLeakControl$4.run(ThreadLeakControl.java:690)
   [junit4]   2>         at com.carrotsearch.randomizedtesting.ThreadLeakControl$4.run(ThreadLeakControl.java:687)
   [junit4]   2>         at java.security.AccessController.doPrivileged(Native Method)
   [junit4]   2>         at com.carrotsearch.randomizedtesting.ThreadLeakControl.getStackTrace(ThreadLeakControl.java:687)
   [junit4]   2>         at com.carrotsearch.randomizedtesting.ThreadLeakControl.getThreadsWithTraces(ThreadLeakControl.java:703)
   [junit4]   2>         at com.carrotsearch.randomizedtesting.ThreadLeakControl.formatThreadStacksFull(ThreadLeakControl.java:683)
   [junit4]   2>         at com.carrotsearch.randomizedtesting.ThreadLeakControl.access$1000(ThreadLeakControl.java:64)
   [junit4]   2>         at com.carrotsearch.randomizedtesting.ThreadLeakControl$2.evaluate(ThreadLeakControl.java:415)
   [junit4]   2>         at com.carrotsearch.randomizedtesting.RandomizedRunner.runSuite(RandomizedRunner.java:678)
   [junit4]   2>         at com.carrotsearch.randomizedtesting.RandomizedRunner.access$200(RandomizedRunner.java:140)
   [junit4]   2>         at com.carrotsearch.randomizedtesting.RandomizedRunner$2.run(RandomizedRunner.java:598)
   [junit4]   2>    3) Thread[id=9, name=JUnit4-serializer-daemon, state=TIMED_WAITING, group=main]
   [junit4]   2>         at java.lang.Thread.sleep(Native Method)
   [junit4]   2>         at com.carrotsearch.ant.tasks.junit4.events.Serializer$1.run(Serializer.java:50)
   [junit4]   2>    4) Thread[id=39, name=TEST-TestFuzzyQuery.testRandom-seed#[61CECF4512AB645F], state=RUNNABLE, group=TGRP-TestFuzzyQuery]
   [junit4]   2>         at java.lang.Object.hashCode(Native Method)
   [junit4]   2>         at java.util.WeakHashMap.hash(WeakHashMap.java:298)
   [junit4]   2>         at java.util.WeakHashMap.get(WeakHashMap.java:396)
   [junit4]   2>         at com.carrotsearch.randomizedtesting.RandomizedContext.getPerThread(RandomizedContext.java:319)
   [junit4]   2>         at com.carrotsearch.randomizedtesting.RandomizedContext.getRandomness(RandomizedContext.java:92)
   [junit4]   2>         at com.carrotsearch.randomizedtesting.RandomizedContext.getRandom(RandomizedContext.java:114)
   [junit4]   2>         at org.apache.lucene.util.LuceneTestCase.random(LuceneTestCase.java:729)
   [junit4]   2>         at org.apache.lucene.search.TestFuzzyQuery.randomSimpleString(TestFuzzyQuery.java:506)
   [junit4]   2>         at org.apache.lucene.search.TestFuzzyQuery.testRandom(TestFuzzyQuery.java:517)
   [junit4]   2>         at sun.reflect.NativeMethodAccessorImpl.invoke0(Native Method)
   [junit4]   2>         at sun.reflect.NativeMethodAccessorImpl.invoke(NativeMethodAccessorImpl.java:62)
   [junit4]   2>         at sun.reflect.DelegatingMethodAccessorImpl.invoke(DelegatingMethodAccessorImpl.java:43)
   [junit4]   2>         at java.lang.reflect.Method.invoke(Method.java:498)
   [junit4]   2>         at com.carrotsearch.randomizedtesting.RandomizedRunner.invoke(RandomizedRunner.java:1713)
   [junit4]   2>         at com.carrotsearch.randomizedtesting.RandomizedRunner$8.evaluate(RandomizedRunner.java:907)
   [junit4]   2>         at com.carrotsearch.randomizedtesting.RandomizedRunner$9.evaluate(RandomizedRunner.java:943)
   [junit4]   2>         at com.carrotsearch.randomizedtesting.RandomizedRunner$10.evaluate(RandomizedRunner.java:957)
   [junit4]   2>         at org.apache.lucene.util.TestRuleSetupTeardownChained$1.evaluate(TestRuleSetupTeardownChained.java:49)
   [junit4]   2>         at org.apache.lucene.util.AbstractBeforeAfterRule$1.evaluate(AbstractBeforeAfterRule.java:45)
   [junit4]   2>         at org.apache.lucene.util.TestRuleThreadAndTestName$1.evaluate(TestRuleThreadAndTestName.java:48)
   [junit4]   2>         at org.apache.lucene.util.TestRuleIgnoreAfterMaxFailures$1.evaluate(TestRuleIgnoreAfterMaxFailures.java:64)
   [junit4]   2>         at org.apache.lucene.util.TestRuleMarkFailure$1.evaluate(TestRuleMarkFailure.java:47)
   [junit4]   2>         at com.carrotsearch.randomizedtesting.rules.StatementAdapter.evaluate(StatementAdapter.java:36)
   [junit4]   2>         at com.carrotsearch.randomizedtesting.ThreadLeakControl$StatementRunner.run(ThreadLeakControl.java:367)
   [junit4]   2>         at com.carrotsearch.randomizedtesting.ThreadLeakControl.forkTimeoutingTask(ThreadLeakControl.java:811)
   [junit4]   2>         at com.carrotsearch.randomizedtesting.ThreadLeakControl$3.evaluate(ThreadLeakControl.java:462)
   [junit4]   2>         at com.carrotsearch.randomizedtesting.RandomizedRunner.runSingleTest(RandomizedRunner.java:916)
   [junit4]   2>         at com.carrotsearch.randomizedtesting.RandomizedRunner$5.evaluate(RandomizedRunner.java:802)
   [junit4]   2>         at com.carrotsearch.randomizedtesting.RandomizedRunner$6.evaluate(RandomizedRunner.java:852)
   [junit4]   2>         at com.carrotsearch.randomizedtesting.RandomizedRunner$7.evaluate(RandomizedRunner.java:863)
   [junit4]   2>         at org.apache.lucene.util.AbstractBeforeAfterRule$1.evaluate(AbstractBeforeAfterRule.java:45)
   [junit4]   2>         at com.carrotsearch.randomizedtesting.rules.StatementAdapter.evaluate(StatementAdapter.java:36)
   [junit4]   2>         at org.apache.lucene.util.TestRuleStoreClassName$1.evaluate(TestRuleStoreClassName.java:41)
   [junit4]   2>         at com.carrotsearch.randomizedtesting.rules.NoShadowingOrOverridesOnMethodsRule$1.evaluate(NoShadowingOrOverridesOnMethodsRule.java:40)
   [junit4]   2>         at com.carrotsearch.randomizedtesting.rules.NoShadowingOrOverridesOnMethodsRule$1.evaluate(NoShadowingOrOverridesOnMethodsRule.java:40)
   [junit4]   2>         at com.carrotsearch.randomizedtesting.rules.StatementAdapter.evaluate(StatementAdapter.java:36)
   [junit4]   2>         at com.carrotsearch.randomizedtesting.rules.StatementAdapter.evaluate(StatementAdapter.java:36)
   [junit4]   2>         at com.carrotsearch.randomizedtesting.rules.StatementAdapter.evaluate(StatementAdapter.java:36)
   [junit4]   2>         at org.apache.lucene.util.TestRuleAssertionsRequired$1.evaluate(TestRuleAssertionsRequired.java:53)
   [junit4]   2>         at org.apache.lucene.util.TestRuleMarkFailure$1.evaluate(TestRuleMarkFailure.java:47)
   [junit4]   2>         at org.apache.lucene.util.TestRuleIgnoreAfterMaxFailures$1.evaluate(TestRuleIgnoreAfterMaxFailures.java:64)
   [junit4]   2>         at org.apache.lucene.util.TestRuleIgnoreTestSuites$1.evaluate(TestRuleIgnoreTestSuites.java:54)
   [junit4]   2>         at com.carrotsearch.randomizedtesting.rules.StatementAdapter.evaluate(StatementAdapter.java:36)
   [junit4]   2>         at com.carrotsearch.randomizedtesting.ThreadLeakControl$StatementRunner.run(ThreadLeakControl.java:367)
   [junit4]   2>         at java.lang.Thread.run(Thread.java:745)
   [junit4]   2> NOTE: download the large Jenkins line-docs file by running 'ant get-jenkins-line-docs' in the lucene directory.
   [junit4]   2> NOTE: reproduce with: ant test  -Dtestcase=TestFuzzyQuery -Dtests.method=testRandom -Dtests.seed=61CECF4512AB645F -Dtests.multiplier=2 -Dtests.nightly=true -Dtests.slow=true -Dtests.linedocsfile=/home/jenkins/jenkins-slave/workspace/Lucene-Solr-NightlyTests-6.x/test-data/enwiki.random.lines.txt -Dtests.locale=fr-CH -Dtests.timezone=Australia/Hobart -Dtests.asserts=true -Dtests.file.encoding=UTF-8
   [junit4] ERROR   7200s J1 | TestFuzzyQuery.testRandom <<<
   [junit4]    > Throwable #1: java.lang.Exception: Test abandoned because suite timeout was reached.
   [junit4]    > 	at __randomizedtesting.SeedInfo.seed([61CECF4512AB645F]:0)
   [junit4]   2> déc. 05, 2016 3:57:58 AM com.carrotsearch.randomizedtesting.ThreadLeakControl checkThreadLeaks
   [junit4]   2> WARNING: Will linger awaiting termination of 1 leaked thread(s).
   [junit4]   2> déc. 05, 2016 3:58:18 AM com.carrotsearch.randomizedtesting.ThreadLeakControl checkThreadLeaks
   [junit4]   2> SEVERE: 1 thread leaked from SUITE scope at org.apache.lucene.search.TestFuzzyQuery: 
   [junit4]   2>    1) Thread[id=39, name=TEST-TestFuzzyQuery.testRandom-seed#[61CECF4512AB645F], state=RUNNABLE, group=TGRP-TestFuzzyQuery]
   [junit4]   2>         at java.util.WeakHashMap.getTable(WeakHashMap.java:350)
   [junit4]   2>         at java.util.WeakHashMap.getEntry(WeakHashMap.java:427)
   [junit4]   2>         at java.util.WeakHashMap.containsKey(WeakHashMap.java:417)
   [junit4]   2>         at com.carrotsearch.randomizedtesting.RandomizedContext.context(RandomizedContext.java:258)
   [junit4]   2>         at com.carrotsearch.randomizedtesting.RandomizedContext.current(RandomizedContext.java:134)
   [junit4]   2>         at org.apache.lucene.util.LuceneTestCase.random(LuceneTestCase.java:729)
   [junit4]   2>         at org.apache.lucene.search.TestFuzzyQuery.randomSimpleString(TestFuzzyQuery.java:506)
   [junit4]   2>         at org.apache.lucene.search.TestFuzzyQuery.testRandom(TestFuzzyQuery.java:517)
   [junit4]   2>         at sun.reflect.NativeMethodAccessorImpl.invoke0(Native Method)
   [junit4]   2>         at sun.reflect.NativeMethodAccessorImpl.invoke(NativeMethodAccessorImpl.java:62)
   [junit4]   2>         at sun.reflect.DelegatingMethodAccessorImpl.invoke(DelegatingMethodAccessorImpl.java:43)
   [junit4]   2>         at java.lang.reflect.Method.invoke(Method.java:498)
   [junit4]   2>         at com.carrotsearch.randomizedtesting.RandomizedRunner.invoke(RandomizedRunner.java:1713)
   [junit4]   2>         at com.carrotsearch.randomizedtesting.RandomizedRunner$8.evaluate(RandomizedRunner.java:907)
   [junit4]   2>         at com.carrotsearch.randomizedtesting.RandomizedRunner$9.evaluate(RandomizedRunner.java:943)
   [junit4]   2>         at com.carrotsearch.randomizedtesting.RandomizedRunner$10.evaluate(RandomizedRunner.java:957)
   [junit4]   2>         at org.apache.lucene.util.TestRuleSetupTeardownChained$1.evaluate(TestRuleSetupTeardownChained.java:49)
   [junit4]   2>         at org.apache.lucene.util.AbstractBeforeAfterRule$1.evaluate(AbstractBeforeAfterRule.java:45)
   [junit4]   2>         at org.apache.lucene.util.TestRuleThreadAndTestName$1.evaluate(TestRuleThreadAndTestName.java:48)
   [junit4]   2>         at org.apache.lucene.util.TestRuleIgnoreAfterMaxFailures$1.evaluate(TestRuleIgnoreAfterMaxFailures.java:64)
   [junit4]   2>         at org.apache.lucene.util.TestRuleMarkFailure$1.evaluate(TestRuleMarkFailure.java:47)
   [junit4]   2>         at com.carrotsearch.randomizedtesting.rules.StatementAdapter.evaluate(StatementAdapter.java:36)
   [junit4]   2>         at com.carrotsearch.randomizedtesting.ThreadLeakControl$StatementRunner.run(ThreadLeakControl.java:367)
   [junit4]   2>         at com.carrotsearch.randomizedtesting.ThreadLeakControl.forkTimeoutingTask(ThreadLeakControl.java:811)
   [junit4]   2>         at com.carrotsearch.randomizedtesting.ThreadLeakControl$3.evaluate(ThreadLeakControl.java:462)
   [junit4]   2>         at com.carrotsearch.randomizedtesting.RandomizedRunner.runSingleTest(RandomizedRunner.java:916)
   [junit4]   2>         at com.carrotsearch.randomizedtesting.RandomizedRunner$5.evaluate(RandomizedRunner.java:802)
   [junit4]   2>         at com.carrotsearch.randomizedtesting.RandomizedRunner$6.evaluate(RandomizedRunner.java:852)
   [junit4]   2>         at com.carrotsearch.randomizedtesting.RandomizedRunner$7.evaluate(RandomizedRunner.java:863)
   [junit4]   2>         at org.apache.lucene.util.AbstractBeforeAfterRule$1.evaluate(AbstractBeforeAfterRule.java:45)
   [junit4]   2>         at com.carrotsearch.randomizedtesting.rules.StatementAdapter.evaluate(StatementAdapter.java:36)
   [junit4]   2>         at org.apache.lucene.util.TestRuleStoreClassName$1.evaluate(TestRuleStoreClassName.java:41)
   [junit4]   2>         at com.carrotsearch.randomizedtesting.rules.NoShadowingOrOverridesOnMethodsRule$1.evaluate(NoShadowingOrOverridesOnMethodsRule.java:40)
   [junit4]   2>         at com.carrotsearch.randomizedtesting.rules.NoShadowingOrOverridesOnMethodsRule$1.evaluate(NoShadowingOrOverridesOnMethodsRule.java:40)
   [junit4]   2>         at com.carrotsearch.randomizedtesting.rules.StatementAdapter.evaluate(StatementAdapter.java:36)
   [junit4]   2>         at com.carrotsearch.randomizedtesting.rules.StatementAdapter.evaluate(StatementAdapter.java:36)
   [junit4]   2>         at com.carrotsearch.randomizedtesting.rules.StatementAdapter.evaluate(StatementAdapter.java:36)
   [junit4]   2>         at org.apache.lucene.util.TestRuleAssertionsRequired$1.evaluate(TestRuleAssertionsRequired.java:53)
   [junit4]   2>         at org.apache.lucene.util.TestRuleMarkFailure$1.evaluate(TestRuleMarkFailure.java:47)
   [junit4]   2>         at org.apache.lucene.util.TestRuleIgnoreAfterMaxFailures$1.evaluate(TestRuleIgnoreAfterMaxFailures.java:64)
   [junit4]   2>         at org.apache.lucene.util.TestRuleIgnoreTestSuites$1.evaluate(TestRuleIgnoreTestSuites.java:54)
   [junit4]   2>         at com.carrotsearch.randomizedtesting.rules.StatementAdapter.evaluate(StatementAdapter.java:36)
   [junit4]   2>         at com.carrotsearch.randomizedtesting.ThreadLeakControl$StatementRunner.run(ThreadLeakControl.java:367)
   [junit4]   2>         at java.lang.Thread.run(Thread.java:745)
   [junit4]   2> déc. 05, 2016 3:58:18 AM com.carrotsearch.randomizedtesting.ThreadLeakControl tryToInterruptAll
   [junit4]   2> INFO: Starting to interrupt leaked threads:
   [junit4]   2>    1) Thread[id=39, name=TEST-TestFuzzyQuery.testRandom-seed#[61CECF4512AB645F], state=RUNNABLE, group=TGRP-TestFuzzyQuery]
   [junit4]   2> déc. 05, 2016 3:58:21 AM com.carrotsearch.randomizedtesting.ThreadLeakControl tryToInterruptAll
   [junit4]   2> SEVERE: There are still zombie threads that couldn't be terminated:
   [junit4]   2>    1) Thread[id=39, name=TEST-TestFuzzyQuery.testRandom-seed#[61CECF4512AB645F], state=RUNNABLE, group=TGRP-TestFuzzyQuery]
   [junit4]   2>         at java.lang.Object.hashCode(Native Method)
   [junit4]   2>         at java.util.WeakHashMap.hash(WeakHashMap.java:298)
   [junit4]   2>         at java.util.WeakHashMap.getEntry(WeakHashMap.java:426)
   [junit4]   2>         at java.util.WeakHashMap.containsKey(WeakHashMap.java:417)
   [junit4]   2>         at com.carrotsearch.randomizedtesting.RandomizedContext.context(RandomizedContext.java:258)
   [junit4]   2>         at com.carrotsearch.randomizedtesting.RandomizedContext.current(RandomizedContext.java:134)
   [junit4]   2>         at org.apache.lucene.util.LuceneTestCase.random(LuceneTestCase.java:729)
   [junit4]   2>         at org.apache.lucene.search.TestFuzzyQuery.randomSimpleString(TestFuzzyQuery.java:506)
   [junit4]   2>         at org.apache.lucene.search.TestFuzzyQuery.testRandom(TestFuzzyQuery.java:517)
   [junit4]   2>         at sun.reflect.NativeMethodAccessorImpl.invoke0(Native Method)
   [junit4]   2>         at sun.reflect.NativeMethodAccessorImpl.invoke(NativeMethodAccessorImpl.java:62)
   [junit4]   2>         at sun.reflect.DelegatingMethodAccessorImpl.invoke(DelegatingMethodAccessorImpl.java:43)
   [junit4]   2>         at java.lang.reflect.Method.invoke(Method.java:498)
   [junit4]   2>         at com.carrotsearch.randomizedtesting.RandomizedRunner.invoke(RandomizedRunner.java:1713)
   [junit4]   2>         at com.carrotsearch.randomizedtesting.RandomizedRunner$8.evaluate(RandomizedRunner.java:907)
   [junit4]   2>         at com.carrotsearch.randomizedtesting.RandomizedRunner$9.evaluate(RandomizedRunner.java:943)
   [junit4]   2>         at com.carrotsearch.randomizedtesting.RandomizedRunner$10.evaluate(RandomizedRunner.java:957)
   [junit4]   2>         at org.apache.lucene.util.TestRuleSetupTeardownChained$1.evaluate(TestRuleSetupTeardownChained.java:49)
   [junit4]   2>         at org.apache.lucene.util.AbstractBeforeAfterRule$1.evaluate(AbstractBeforeAfterRule.java:45)
   [junit4]   2>         at org.apache.lucene.util.TestRuleThreadAndTestName$1.evaluate(TestRuleThreadAndTestName.java:48)
   [junit4]   2>         at org.apache.lucene.util.TestRuleIgnoreAfterMaxFailures$1.evaluate(TestRuleIgnoreAfterMaxFailures.java:64)
   [junit4]   2>         at org.apache.lucene.util.TestRuleMarkFailure$1.evaluate(TestRuleMarkFailure.java:47)
   [junit4]   2>         at com.carrotsearch.randomizedtesting.rules.StatementAdapter.evaluate(StatementAdapter.java:36)
   [junit4]   2>         at com.carrotsearch.randomizedtesting.ThreadLeakControl$StatementRunner.run(ThreadLeakControl.java:367)
   [junit4]   2>         at com.carrotsearch.randomizedtesting.ThreadLeakControl.forkTimeoutingTask(ThreadLeakControl.java:811)
   [junit4]   2>         at com.carrotsearch.randomizedtesting.ThreadLeakControl$3.evaluate(ThreadLeakControl.java:462)
   [junit4]   2>         at com.carrotsearch.randomizedtesting.RandomizedRunner.runSingleTest(RandomizedRunner.java:916)
   [junit4]   2>         at com.carrotsearch.randomizedtesting.RandomizedRunner$5.evaluate(RandomizedRunner.java:802)
   [junit4]   2>         at com.carrotsearch.randomizedtesting.RandomizedRunner$6.evaluate(RandomizedRunner.java:852)
   [junit4]   2>         at com.carrotsearch.randomizedtesting.RandomizedRunner$7.evaluate(RandomizedRunner.java:863)
   [junit4]   2>         at org.apache.lucene.util.AbstractBeforeAfterRule$1.evaluate(AbstractBeforeAfterRule.java:45)
   [junit4]   2>         at com.carrotsearch.randomizedtesting.rules.StatementAdapter.evaluate(StatementAdapter.java:36)
   [junit4]   2>         at org.apache.lucene.util.TestRuleStoreClassName$1.evaluate(TestRuleStoreClassName.java:41)
   [junit4]   2>         at com.carrotsearch.randomizedtesting.rules.NoShadowingOrOverridesOnMethodsRule$1.evaluate(NoShadowingOrOverridesOnMethodsRule.java:40)
   [junit4]   2>         at com.carrotsearch.randomizedtesting.rules.NoShadowingOrOverridesOnMethodsRule$1.evaluate(NoShadowingOrOverridesOnMethodsRule.java:40)
   [junit4]   2>         at com.carrotsearch.randomizedtesting.rules.StatementAdapter.evaluate(StatementAdapter.java:36)
   [junit4]   2>         at com.carrotsearch.randomizedtesting.rules.StatementAdapter.evaluate(StatementAdapter.java:36)
   [junit4]   2>         at com.carrotsearch.randomizedtesting.rules.StatementAdapter.evaluate(StatementAdapter.java:36)
   [junit4]   2>         at org.apache.lucene.util.TestRuleAssertionsRequired$1.evaluate(TestRuleAssertionsRequired.java:53)
   [junit4]   2>         at org.apache.lucene.util.TestRuleMarkFailure$1.evaluate(TestRuleMarkFailure.java:47)
   [junit4]   2>         at org.apache.lucene.util.TestRuleIgnoreAfterMaxFailures$1.evaluate(TestRuleIgnoreAfterMaxFailures.java:64)
   [junit4]   2>         at org.apache.lucene.util.TestRuleIgnoreTestSuites$1.evaluate(TestRuleIgnoreTestSuites.java:54)
   [junit4]   2>         at com.carrotsearch.randomizedtesting.rules.StatementAdapter.evaluate(StatementAdapter.java:36)
   [junit4]   2>         at com.carrotsearch.randomizedtesting.ThreadLeakControl$StatementRunner.run(ThreadLeakControl.java:367)
   [junit4]   2>         at java.lang.Thread.run(Thread.java:745)
   [junit4]   2> NOTE: test params are: codec=FastCompressingStoredFields(storedFieldsFormat=CompressingStoredFieldsFormat(compressionMode=FAST, chunkSize=1, maxDocsPerChunk=1, blockSize=388), termVectorsFormat=CompressingTermVectorsFormat(compressionMode=FAST, chunkSize=1, blockSize=388)), sim=RandomSimilarity(queryNorm=true,coord=yes): {field=DFI(ChiSquared)}, locale=fr-CH, timezone=Australia/Hobart
   [junit4]   2> NOTE: Linux 3.13.0-85-generic amd64/Oracle Corporation 1.8.0_102 (64-bit)/cpus=4,threads=2,free=190218736,total=208666624
   [junit4]   2> NOTE: All tests run in this JVM: [TestOmitTf, Test2BSortedDocValuesFixedSorted, TestMathUtil, TestFuzzyQuery]
   [junit4]   2> NOTE: download the large Jenkins line-docs file by running 'ant get-jenkins-line-docs' in the lucene directory.
   [junit4]   2> NOTE: reproduce with: ant test  -Dtestcase=TestFuzzyQuery -Dtests.seed=61CECF4512AB645F -Dtests.multiplier=2 -Dtests.nightly=true -Dtests.slow=true -Dtests.linedocsfile=/home/jenkins/jenkins-slave/workspace/Lucene-Solr-NightlyTests-6.x/test-data/enwiki.random.lines.txt -Dtests.locale=fr-CH -Dtests.timezone=Australia/Hobart -Dtests.asserts=true -Dtests.file.encoding=UTF-8
   [junit4] ERROR   0.00s J1 | TestFuzzyQuery (suite) <<<
   [junit4]    > Throwable #1: java.lang.Exception: Suite timeout exceeded (>= 7200000 msec).
   [junit4]    > 	at __randomizedtesting.SeedInfo.seed([61CECF4512AB645F]:0)
   [junit4] Completed [372/442 (1!)] on J1 in 7223.31s, 3 tests, 2 errors <<< FAILURES!

[...truncated 10215 lines...]
   [junit4] Suite: org.apache.solr.cloud.hdfs.HdfsCollectionsAPIDistributedZkTest
   [junit4]   2> Creating dataDir: /x1/jenkins/jenkins-slave/workspace/Lucene-Solr-NightlyTests-6.x/checkout/solr/build/solr-core/test/J2/temp/solr.cloud.hdfs.HdfsCollectionsAPIDistributedZkTest_76CD8EC0C0347139-001/init-core-data-001
   [junit4]   2> 676895 INFO  (SUITE-HdfsCollectionsAPIDistributedZkTest-seed#[76CD8EC0C0347139]-worker) [    ] o.a.s.SolrTestCaseJ4 Randomized ssl (true) and clientAuth (true) via: @org.apache.solr.util.RandomizeSSL(reason=, ssl=NaN, value=NaN, clientAuth=NaN)
   [junit4]   2> 676896 INFO  (SUITE-HdfsCollectionsAPIDistributedZkTest-seed#[76CD8EC0C0347139]-worker) [    ] o.a.s.c.MiniSolrCloudCluster Starting cluster of 4 servers in /x1/jenkins/jenkins-slave/workspace/Lucene-Solr-NightlyTests-6.x/checkout/solr/build/solr-core/test/J2/temp/solr.cloud.hdfs.HdfsCollectionsAPIDistributedZkTest_76CD8EC0C0347139-001/tempDir-001
   [junit4]   2> 676896 INFO  (SUITE-HdfsCollectionsAPIDistributedZkTest-seed#[76CD8EC0C0347139]-worker) [    ] o.a.s.c.ZkTestServer STARTING ZK TEST SERVER
   [junit4]   2> 676897 INFO  (Thread-2261) [    ] o.a.s.c.ZkTestServer client port:0.0.0.0/0.0.0.0:0
   [junit4]   2> 676897 INFO  (Thread-2261) [    ] o.a.s.c.ZkTestServer Starting server
   [junit4]   2> 676998 INFO  (SUITE-HdfsCollectionsAPIDistributedZkTest-seed#[76CD8EC0C0347139]-worker) [    ] o.a.s.c.ZkTestServer start zk server on port:44028
   [junit4]   2> 677011 INFO  (jetty-launcher-731-thread-2) [    ] o.e.j.s.Server jetty-9.3.14.v20161028
   [junit4]   2> 677011 INFO  (jetty-launcher-731-thread-4) [    ] o.e.j.s.Server jetty-9.3.14.v20161028
   [junit4]   2> 677011 INFO  (jetty-launcher-731-thread-1) [    ] o.e.j.s.Server jetty-9.3.14.v20161028
   [junit4]   2> 677012 INFO  (jetty-launcher-731-thread-3) [    ] o.e.j.s.Server jetty-9.3.14.v20161028
   [junit4]   2> 677013 INFO  (jetty-launcher-731-thread-2) [    ] o.e.j.s.h.ContextHandler Started o.e.j.s.ServletContextHandler@2d05fe07{/solr,null,AVAILABLE}
   [junit4]   2> 677023 INFO  (jetty-launcher-731-thread-1) [    ] o.e.j.s.h.ContextHandler Started o.e.j.s.ServletContextHandler@79e4641c{/solr,null,AVAILABLE}
   [junit4]   2> 677025 INFO  (jetty-launcher-731-thread-1) [    ] o.e.j.s.AbstractConnector Started ServerConnector@3451ab9d{SSL,[ssl, http/1.1]}{127.0.0.1:37178}
   [junit4]   2> 677025 INFO  (jetty-launcher-731-thread-1) [    ] o.e.j.s.Server Started @681118ms
   [junit4]   2> 677025 INFO  (jetty-launcher-731-thread-1) [    ] o.a.s.c.s.e.JettySolrRunner Jetty properties: {hostContext=/solr, hostPort=37178}
   [junit4]   2> 677025 ERROR (jetty-launcher-731-thread-1) [    ] o.a.s.s.StartupLoggingUtils Missing Java Option solr.log.dir. Logging may be missing or incomplete.
   [junit4]   2> 677025 INFO  (jetty-launcher-731-thread-1) [    ] o.a.s.s.SolrDispatchFilter  ___      _       Welcome to Apache Solr™ version 6.4.0
   [junit4]   2> 677025 INFO  (jetty-launcher-731-thread-1) [    ] o.a.s.s.SolrDispatchFilter / __| ___| |_ _   Starting in cloud mode on port null
   [junit4]   2> 677025 INFO  (jetty-launcher-731-thread-1) [    ] o.a.s.s.SolrDispatchFilter \__ \/ _ \ | '_|  Install dir: null
   [junit4]   2> 677025 INFO  (jetty-launcher-731-thread-1) [    ] o.a.s.s.SolrDispatchFilter |___/\___/_|_|    Start time: 2016-12-04T19:46:43.296Z
   [junit4]   2> 677036 INFO  (jetty-launcher-731-thread-2) [    ] o.e.j.s.AbstractConnector Started ServerConnector@500fa59b{SSL,[ssl, http/1.1]}{127.0.0.1:35373}
   [junit4]   2> 677036 INFO  (jetty-launcher-731-thread-2) [    ] o.e.j.s.Server Started @681130ms
   [junit4]   2> 677036 INFO  (jetty-launcher-731-thread-2) [    ] o.a.s.c.s.e.JettySolrRunner Jetty properties: {hostContext=/solr, hostPort=35373}
   [junit4]   2> 677036 ERROR (jetty-launcher-731-thread-2) [    ] o.a.s.s.StartupLoggingUtils Missing Java Option solr.log.dir. Logging may be missing or incomplete.
   [junit4]   2> 677037 INFO  (jetty-launcher-731-thread-2) [    ] o.a.s.s.SolrDispatchFilter  ___      _       Welcome to Apache Solr™ version 6.4.0
   [junit4]   2> 677037 INFO  (jetty-launcher-731-thread-2) [    ] o.a.s.s.SolrDispatchFilter / __| ___| |_ _   Starting in cloud mode on port null
   [junit4]   2> 677037 INFO  (jetty-launcher-731-thread-2) [    ] o.a.s.s.SolrDispatchFilter \__ \/ _ \ | '_|  Install dir: null
   [junit4]   2> 677037 INFO  (jetty-launcher-731-thread-2) [    ] o.a.s.s.SolrDispatchFilter |___/\___/_|_|    Start time: 2016-12-04T19:46:43.308Z
   [junit4]   2> 677037 INFO  (jetty-launcher-731-thread-4) [    ] o.e.j.s.h.ContextHandler Started o.e.j.s.ServletContextHandler@b587529{/solr,null,AVAILABLE}
   [junit4]   2> 677056 INFO  (jetty-launcher-731-thread-3) [    ] o.e.j.s.h.ContextHandler Started o.e.j.s.ServletContextHandler@681d5e59{/solr,null,AVAILABLE}
   [junit4]   2> 677056 INFO  (jetty-launcher-731-thread-4) [    ] o.e.j.s.AbstractConnector Started ServerConnector@7d907bf7{SSL,[ssl, http/1.1]}{127.0.0.1:57961}
   [junit4]   2> 677056 INFO  (jetty-launcher-731-thread-4) [    ] o.e.j.s.Server Started @681150ms
   [junit4]   2> 677057 INFO  (jetty-launcher-731-thread-4) [    ] o.a.s.c.s.e.JettySolrRunner Jetty properties: {hostContext=/solr, hostPort=57961}
   [junit4]   2> 677057 ERROR (jetty-launcher-731-thread-4) [    ] o.a.s.s.StartupLoggingUtils Missing Java Option solr.log.dir. Logging may be missing or incomplete.
   [junit4]   2> 677057 INFO  (jetty-launcher-731-thread-4) [    ] o.a.s.s.SolrDispatchFilter  ___      _       Welcome to Apache Solr™ version 6.4.0
   [junit4]   2> 677057 INFO  (jetty-launcher-731-thread-4) [    ] o.a.s.s.SolrDispatchFilter / __| ___| |_ _   Starting in cloud mode on port null
   [junit4]   2> 677057 INFO  (jetty-launcher-731-thread-4) [    ] o.a.s.s.SolrDispatchFilter \__ \/ _ \ | '_|  Install dir: null
   [junit4]   2> 677057 INFO  (jetty-launcher-731-thread-4) [    ] o.a.s.s.SolrDispatchFilter |___/\___/_|_|    Start time: 2016-12-04T19:46:43.328Z
   [junit4]   2> 677060 INFO  (jetty-launcher-731-thread-3) [    ] o.e.j.s.AbstractConnector Started ServerConnector@27ba1436{SSL,[ssl, http/1.1]}{127.0.0.1:48716}
   [junit4]   2> 677060 INFO  (jetty-launcher-731-thread-3) [    ] o.e.j.s.Server Started @681153ms
   [junit4]   2> 677060 INFO  (jetty-launcher-731-thread-3) [    ] o.a.s.c.s.e.JettySolrRunner Jetty properties: {hostContext=/solr, hostPort=48716}
   [junit4]   2> 677060 ERROR (jetty-launcher-731-thread-3) [    ] o.a.s.s.StartupLoggingUtils Missing Java Option solr.log.dir. Logging may be missing or incomplete.
   [junit4]   2> 677060 INFO  (jetty-launcher-731-thread-3) [    ] o.a.s.s.SolrDispatchFilter  ___      _       Welcome to Apache Solr™ version 6.4.0
   [junit4]   2> 677061 INFO  (jetty-launcher-731-thread-3) [    ] o.a.s.s.SolrDispatchFilter / __| ___| |_ _   Starting in cloud mode on port null
   [junit4]   2> 677061 INFO  (jetty-launcher-731-thread-3) [    ] o.a.s.s.SolrDispatchFilter \__ \/ _ \ | '_|  Install dir: null
   [junit4]   2> 677061 INFO  (jetty-launcher-731-thread-3) [    ] o.a.s.s.SolrDispatchFilter |___/\___/_|_|    Start time: 2016-12-04T19:46:43.332Z
   [junit4]   2> 677062 INFO  (jetty-launcher-731-thread-1) [    ] o.a.s.s.SolrDispatchFilter solr.xml found in ZooKeeper. Loading...
   [junit4]   2> 677071 INFO  (jetty-launcher-731-thread-2) [    ] o.a.s.s.SolrDispatchFilter solr.xml found in ZooKeeper. Loading...
   [junit4]   2> 677075 INFO  (jetty-launcher-731-thread-3) [    ] o.a.s.s.SolrDispatchFilter solr.xml found in ZooKeeper. Loading...
   [junit4]   2> 677075 INFO  (jetty-launcher-731-thread-4) [    ] o.a.s.s.SolrDispatchFilter solr.xml found in ZooKeeper. Loading...
   [junit4]   2> 677078 INFO  (jetty-launcher-731-thread-1) [    ] o.a.s.u.UpdateShardHandler Creating UpdateShardHandler HTTP client with params: socketTimeout=340000&connTimeout=45000&retry=true
   [junit4]   2> 677079 INFO  (jetty-launcher-731-thread-1) [    ] o.a.s.c.ZkContainer Zookeeper client=127.0.0.1:44028/solr
   [junit4]   2> 677082 WARN  (NIOServerCxn.Factory:0.0.0.0/0.0.0.0:0) [    ] o.a.z.s.NIOServerCnxn caught end of stream exception
   [junit4]   2> EndOfStreamException: Unable to read additional data from client sessionid 0x158cb5fcd610002, likely client has closed socket
   [junit4]   2> 	at org.apache.zookeeper.server.NIOServerCnxn.doIO(NIOServerCnxn.java:228)
   [junit4]   2> 	at org.apache.zookeeper.server.NIOServerCnxnFactory.run(NIOServerCnxnFactory.java:208)
   [junit4]   2> 	at java.lang.Thread.run(Thread.java:745)
   [junit4]   2> 677085 INFO  (jetty-launcher-731-thread-2) [    ] o.a.s.u.UpdateShardHandler Creating UpdateShardHandler HTTP client with params: socketTimeout=340000&connTimeout=45000&retry=true
   [junit4]   2> 677086 INFO  (jetty-launcher-731-thread-2) [    ] o.a.s.c.ZkContainer Zookeeper client=127.0.0.1:44028/solr
   [junit4]   2> 677090 INFO  (jetty-launcher-731-thread-3) [    ] o.a.s.u.UpdateShardHandler Creating UpdateShardHandler HTTP client with params: socketTimeout=340000&connTimeout=45000&retry=true
   [junit4]   2> 677090 INFO  (jetty-launcher-731-thread-3) [    ] o.a.s.c.ZkContainer Zookeeper client=127.0.0.1:44028/solr
   [junit4]   2> 677093 INFO  (jetty-launcher-731-thread-4) [    ] o.a.s.u.UpdateShardHandler Creating UpdateShardHandler HTTP client with params: socketTimeout=340000&connTimeout=45000&retry=true
   [junit4]   2> 677112 INFO  (jetty-launcher-731-thread-1) [n:127.0.0.1:37178_solr    ] o.a.s.c.OverseerElectionContext I am going to be the leader 127.0.0.1:37178_solr
   [junit4]   2> 677114 INFO  (jetty-launcher-731-thread-1) [n:127.0.0.1:37178_solr    ] o.a.s.c.Overseer Overseer (id=97051004316483591-127.0.0.1:37178_solr-n_0000000000) starting
   [junit4]   2> 677138 INFO  (jetty-launcher-731-thread-2) [n:127.0.0.1:35373_solr    ] o.a.s.c.ZkController Register node as live in ZooKeeper:/live_nodes/127.0.0.1:35373_solr
   [junit4]   2> 677150 INFO  (jetty-launcher-731-thread-4) [    ] o.a.s.c.ZkContainer Zookeeper client=127.0.0.1:44028/solr
   [junit4]   2> 677163 INFO  (zkCallback-745-thread-1-processing-n:127.0.0.1:37178_solr) [n:127.0.0.1:37178_solr    ] o.a.s.c.c.ZkStateReader Updated live nodes from ZooKeeper... (0) -> (1)
   [junit4]   2> 677167 WARN  (NIOServerCxn.Factory:0.0.0.0/0.0.0.0:0) [    ] o.a.z.s.NIOServerCnxn caught end of stream exception
   [junit4]   2> EndOfStreamException: Unable to read additional data from client sessionid 0x158cb5fcd61000a, likely client has closed socket
   [junit4]   2> 	at org.apache.zookeeper.server.NIOServerCnxn.doIO(NIOServerCnxn.java:228)
   [junit4]   2> 	at org.apache.zookeeper.server.NIOServerCnxnFactory.run(NIOServerCnxnFactory.java:208)
   [junit4]   2> 	at java.lang.Thread.run(Thread.java:745)
   [junit4]   2> 677184 INFO  (jetty-launcher-731-thread-1) [n:127.0.0.1:37178_solr    ] o.a.s.c.ZkController Register node as live in ZooKeeper:/live_nodes/127.0.0.1:37178_solr
   [junit4]   2> 677191 INFO  (zkCallback-749-thread-1-processing-n:127.0.0.1:35373_solr) [n:127.0.0.1:35373_solr    ] o.a.s.c.c.ZkStateReader Updated live nodes from ZooKeeper... (0) -> (1)
   [junit4]   2> 677208 INFO  (zkCallback-749-thread-1-processing-n:127.0.0.1:35373_solr) [n:127.0.0.1:35373_solr    ] o.a.s.c.c.ZkStateReader Updated live nodes from ZooKeeper... (1) -> (2)
   [junit4]   2> 677211 INFO  (zkCallback-745-thread-1-processing-n:127.0.0.1:37178_solr) [n:127.0.0.1:37178_solr    ] o.a.s.c.c.ZkStateReader Updated live nodes from ZooKeeper... (1) -> (2)
   [junit4]   2> 677216 INFO  (jetty-launcher-731-thread-3) [n:127.0.0.1:48716_solr    ] o.a.s.c.c.ZkStateReader Updated live nodes from ZooKeeper... (0) -> (2)
   [junit4]   2> 677229 INFO  (jetty-launcher-731-thread-3) [n:127.0.0.1:48716_solr    ] o.a.s.c.ZkController Register node as live in ZooKeeper:/live_nodes/127.0.0.1:48716_solr
   [junit4]   2> 677230 INFO  (zkCallback-749-thread-1-processing-n:127.0.0.1:35373_solr) [n:127.0.0.1:35373_solr    ] o.a.s.c.c.ZkStateReader Updated live nodes from ZooKeeper... (2) -> (3)
   [junit4]   2> 677251 INFO  (jetty-launcher-731-thread-2) [n:127.0.0.1:35373_solr    ] o.a.s.c.CorePropertiesLocator Found 0 core definitions underneath /x1/jenkins/jenkins-slave/workspace/Lucene-Solr-NightlyTests-6.x/checkout/solr/build/solr-core/test/J2/temp/solr.cloud.hdfs.HdfsCollectionsAPIDistributedZkTest_76CD8EC0C0347139-001/tempDir-001/node3/.
   [junit4]   2> 677255 INFO  (zkCallback-745-thread-3-processing-n:127.0.0.1:37178_solr) [n:127.0.0.1:37178_solr    ] o.a.s.c.c.ZkStateReader Updated live nodes from ZooKeeper... (2) -> (3)
   [junit4]   2> 677272 INFO  (jetty-launcher-731-thread-4) [n:127.0.0.1:57961_solr    ] o.a.s.c.c.ZkStateReader Updated live nodes from ZooKeeper... (0) -> (3)
   [junit4]   2> 677278 INFO  (zkCallback-753-thread-1-processing-n:127.0.0.1:48716_solr) [n:127.0.0.1:48716_solr    ] o.a.s.c.c.ZkStateReader Updated live nodes from ZooKeeper... (2) -> (3)
   [junit4]   2> 677280 INFO  (jetty-launcher-731-thread-4) [n:127.0.0.1:57961_solr    ] o.a.s.c.ZkController Register node as live in ZooKeeper:/live_nodes/127.0.0.1:57961_solr
   [junit4]   2> 677282 INFO  (zkCallback-753-thread-1-processing-n:127.0.0.1:48716_solr) [n:127.0.0.1:48716_solr    ] o.a.s.c.c.ZkStateReader Updated live nodes from ZooKeeper... (3) -> (4)
   [junit4]   2> 677282 INFO  (zkCallback-745-thread-1-processing-n:127.0.0.1:37178_solr) [n:127.0.0.1:37178_solr    ] o.a.s.c.c.ZkStateReader Updated live nodes from ZooKeeper... (3) -> (4)
   [junit4]   2> 677283 INFO  (zkCallback-749-thread-1-processing-n:127.0.0.1:35373_solr) [n:127.0.0.1:35373_solr    ] o.a.s.c.c.ZkStateReader Updated live nodes from ZooKeeper... (3) -> (4)
   [junit4]   2> 677299 INFO  (zkCallback-754-thread-1-processing-n:127.0.0.1:57961_solr) [n:127.0.0.1:57961_solr    ] o.a.s.c.c.ZkStateReader Updated live nodes from ZooKeeper... (3) -> (4)
   [junit4]   2> 677314 INFO  (jetty-launcher-731-thread-1) [n:127.0.0.1:37178_solr    ] o.a.s.c.CorePropertiesLocator Found 0 core definitions underneath /x1/jenkins/jenkins-slave/workspace/Lucene-Solr-NightlyTests-6.x/checkout/solr/build/solr-core/test/J2/temp/solr.cloud.hdfs.HdfsCollectionsAPIDistributedZkTest_76CD8EC0C0347139-001/tempDir-001/node2/.
   [junit4]   2> 677331 INFO  (jetty-launcher-731-thread-4) [n:127.0.0.1:57961_solr    ] o.a.s.c.CorePropertiesLocator Found 0 core definitions underneath /x1/jenkins/jenkins-slave/workspace/Lucene-Solr-NightlyTests-6.x/checkout/solr/build/solr-core/test/J2/temp/solr.cloud.hdfs.HdfsCollectionsAPIDistributedZkTest_76CD8EC0C0347139-001/tempDir-001/node1/.
   [junit4]   2> 677411 INFO  (jetty-launcher-731-thread-3) [n:127.0.0.1:48716_solr    ] o.a.s.c.CorePropertiesLocator Found 0 core definitions underneath /x1/jenkins/jenkins-slave/workspace/Lucene-Solr-NightlyTests-6.x/checkout/solr/build/solr-core/test/J2/temp/solr.cloud.hdfs.HdfsCollectionsAPIDistributedZkTest_76CD8EC0C0347139-001/tempDir-001/node4/.
   [junit4]   2> 677418 INFO  (SUITE-HdfsCollectionsAPIDistributedZkTest-seed#[76CD8EC0C0347139]-worker) [    ] o.a.s.c.c.ZkStateReader Updated live nodes from ZooKeeper... (0) -> (4)
   [junit4]   2> 677419 INFO  (SUITE-HdfsCollectionsAPIDistributedZkTest-seed#[76CD8EC0C0347139]-worker) [    ] o.a.s.c.s.i.ZkClientClusterStateProvider Cluster at 127.0.0.1:44028/solr ready
   [junit4]   1> Formatting using clusterid: testClusterID
   [junit4]   2> 677476 WARN  (SUITE-HdfsCollectionsAPIDistributedZkTest-seed#[76CD8EC0C0347139]-worker) [    ] o.a.h.m.i.MetricsConfig Cannot locate configuration: tried hadoop-metrics2-namenode.properties,hadoop-metrics2.properties
   [junit4]   2> 677492 WARN  (SUITE-HdfsCollectionsAPIDistributedZkTest-seed#[76CD8EC0C0347139]-worker) [    ] o.a.h.h.HttpRequestLog Jetty request log can only be enabled using Log4j
   [junit4]   2> 677495 INFO  (SUITE-HdfsCollectionsAPIDistributedZkTest-seed#[76CD8EC0C0347139]-worker) [    ] o.m.log jetty-6.1.26
   [junit4]   2> 677508 INFO  (SUITE-HdfsCollectionsAPIDistributedZkTest-seed#[76CD8EC0C0347139]-worker) [    ] o.m.log Extract jar:file:/x1/jenkins/.ivy2/cache/org.apache.hadoop/hadoop-hdfs/tests/hadoop-hdfs-2.7.2-tests.jar!/webapps/hdfs to ./temp/Jetty_localhost_40502_hdfs____.lrc0gr/webapp
   [junit4]   2> 677957 INFO  (SUITE-HdfsCollectionsAPIDistributedZkTest-seed#[76CD8EC0C0347139]-worker) [    ] o.m.log Started HttpServer2$SelectChannelConnectorWithSafeStartup@localhost:40502
   [junit4]   2> 678029 WARN  (SUITE-HdfsCollectionsAPIDistributedZkTest-seed#[76CD8EC0C0347139]-worker) [    ] o.a.h.h.HttpRequestLog Jetty request log can only be enabled using Log4j
   [junit4]   2> 678031 INFO  (SUITE-HdfsCollectionsAPIDistributedZkTest-seed#[76CD8EC0C0347139]-worker) [    ] o.m.log jetty-6.1.26
   [junit4]   2> 678044 INFO  (SUITE-HdfsCollectionsAPIDistributedZkTest-seed#[76CD8EC0C0347139]-worker) [    ] o.m.log Extract jar:file:/x1/jenkins/.ivy2/cache/org.apache.hadoop/hadoop-hdfs/tests/hadoop-hdfs-2.7.2-tests.jar!/webapps/datanode to ./temp/Jetty_localhost_53428_datanode____.gnh69p/webapp
   [junit4]   2> 678432 INFO  (SUITE-HdfsCollectionsAPIDistributedZkTest-seed#[76CD8EC0C0347139]-worker) [    ] o.m.log Started HttpServer2$SelectChannelConnectorWithSafeStartup@localhost:53428
   [junit4]   2> 678504 WARN  (SUITE-HdfsCollectionsAPIDistributedZkTest-seed#[76CD8EC0C0347139]-worker) [    ] o.a.h.h.HttpRequestLog Jetty request log can only be enabled using Log4j
   [junit4]   2> 678505 INFO  (SUITE-HdfsCollectionsAPIDistributedZkTest-seed#[76CD8EC0C0347139]-worker) [    ] o.m.log jetty-6.1.26
   [junit4]   2> 678535 INFO  (SUITE-HdfsCollectionsAPIDistributedZkTest-seed#[76CD8EC0C0347139]-worker) [    ] o.m.log Extract jar:file:/x1/jenkins/.ivy2/cache/org.apache.hadoop/hadoop-hdfs/tests/hadoop-hdfs-2.7.2-tests.jar!/webapps/datanode to ./temp/Jetty_localhost_56577_datanode____h10nln/webapp
   [junit4]   2> 678591 INFO  (IPC Server handler 3 on 38672) [    ] BlockStateChange BLOCK* processReport: from storage DS-fa799f78-8ccd-49d8-82a0-c90600954005 node DatanodeRegistration(127.0.0.1:37833, datanodeUuid=7f0c561c-beb9-4ce0-966e-c3563cab86c5, infoPort=36604, infoSecurePort=0, ipcPort=39937, storageInfo=lv=-56;cid=testClusterID;nsid=1248187616;c=0), blocks: 0, hasStaleStorage: true, processing time: 0 msecs
   [junit4]   2> 678591 INFO  (IPC Server handler 3 on 38672) [    ] BlockStateChange BLOCK* processReport: from storage DS-77d9e625-14e4-4069-b84a-2051eed388e3 node DatanodeRegistration(127.0.0.1:37833, datanodeUuid=7f0c561c-beb9-4ce0-966e-c3563cab86c5, infoPort=36604, infoSecurePort=0, ipcPort=39937, storageInfo=lv=-56;cid=testClusterID;nsid=1248187616;c=0), blocks: 0, hasStaleStorage: false, processing time: 0 msecs
   [junit4]   2> 678968 INFO  (SUITE-HdfsCollectionsAPIDistributedZkTest-seed#[76CD8EC0C0347139]-worker) [    ] o.m.log Started HttpServer2$SelectChannelConnectorWithSafeStartup@localhost:56577
   [junit4]   2> 679060 INFO  (IPC Server handler 2 on 38672) [    ] BlockStateChange BLOCK* processReport: from storage DS-d49ffed7-fb4b-49fb-af49-c74916dc6075 node DatanodeRegistration(127.0.0.1:50299, datanodeUuid=b28b3ef7-b754-4fa9-917f-b4ad76e9089c, infoPort=42900, infoSecurePort=0, ipcPort=59160, storageInfo=lv=-56;cid=testClusterID;nsid=1248187616;c=0), blocks: 0, hasStaleStorage: true, processing time: 0 msecs
   [junit4]   2> 679060 INFO  (IPC Server handler 2 on 38672) [    ] BlockStateChange BLOCK* processReport: from storage DS-1f925802-75e6-41a5-90ff-e2e4e8ac9e37 node DatanodeRegistration(127.0.0.1:50299, datanodeUuid=b28b3ef7-b754-4fa9-917f-b4ad76e9089c, infoPort=42900, infoSecurePort=0, ipcPort=59160, storageInfo=lv=-56;cid=testClusterID;nsid=1248187616;c=0), blocks: 0, hasStaleStorage: false, processing time: 0 msecs
   [junit4]   2> 679161 INFO  (TEST-HdfsCollectionsAPIDistributedZkTest.testZeroNumShards-seed#[76CD8EC0C0347139]) [    ] o.a.s.SolrTestCaseJ4 ###Starting testZeroNumShards
   [junit4]   2> 679162 INFO  (TEST-HdfsCollectionsAPIDistributedZkTest.testZeroNumShards-seed#[76CD8EC0C0347139]) [    ] o.a.s.c.c.ZkStateReader Updated live nodes from ZooKeeper... (0) -> (4)
   [junit4]   2> 679225 INFO  (qtp1382184418-5350) [n:127.0.0.1:48716_solr    ] o.a.s.h.a.CollectionsHandler Invoked Collection Action :create with params replicationFactor=10&collection.configName=conf&name=acollection&action=CREATE&numShards=0&wt=javabin&version=2 and sendToOCPQueue=true
   [junit4]   2> 679228 INFO  (OverseerThreadFactory-1866-thread-1-processing-n:127.0.0.1:37178_solr) [n:127.0.0.1:37178_solr    ] o.a.s.c.CreateCollectionCmd Create collection acollection
   [junit4]   2> 679229 ERROR (OverseerThreadFactory-1866-thread-1-processing-n:127.0.0.1:37178_solr) [n:127.0.0.1:37178_solr    ] o.a.s.c.OverseerCollectionMessageHandler Collection: acollection operation: create failed:org.apache.solr.common.SolrException: numShards must be > 0
   [junit4]   2> 	at org.apache.solr.cloud.CreateCollectionCmd.call(CreateCollectionCmd.java:117)
   [junit4]   2> 	at org.apache.solr.cloud.OverseerCollectionMessageHandler.processMessage(OverseerCollectionMessageHandler.java:224)
   [junit4]   2> 	at org.apache.solr.cloud.OverseerTaskProcessor$Runner.run(OverseerTaskProcessor.java:463)
   [junit4]   2> 	at org.apache.solr.common.util.ExecutorUtil$MDCAwareThreadPoolExecutor.lambda$execute$0(ExecutorUtil.java:229)
   [junit4]   2> 	at java.util.concurrent.ThreadPoolExecutor.runWorker(ThreadPoolExecutor.java:1142)
   [junit4]   2> 	at java.util.concurrent.ThreadPoolExecutor$Worker.run(ThreadPoolExecutor.java:617)
   [junit4]   2> 	at java.lang.Thread.run(Thread.java:745)
   [junit4]   2> 
   [junit4]   2> 679232 INFO  (qtp1382184418-5350) [n:127.0.0.1:48716_solr    ] o.a.s.s.HttpSolrCall [admin] webapp=null path=/admin/collections params={replicationFactor=10&collection.configName=conf&name=acollection&action=CREATE&numShards=0&wt=javabin&version=2} status=400 QTime=6
   [junit4]   2> 679233 INFO  (TEST-HdfsCollectionsAPIDistributedZkTest.testZeroNumShards-seed#[76CD8EC0C0347139]) [    ] o.a.s.SolrTestCaseJ4 ###Ending testZeroNumShards
   [junit4]   2> 679293 INFO  (TEST-HdfsCollectionsAPIDistributedZkTest.testMissingNumShards-seed#[76CD8EC0C0347139]) [    ] o.a.s.SolrTestCaseJ4 ###Starting testMissingNumShards
   [junit4]   2> 679294 INFO  (TEST-HdfsCollectionsAPIDistributedZkTest.testMissingNumShards-seed#[76CD8EC0C0347139]) [    ] o.a.s.c.c.ZkStateReader Updated live nodes from ZooKeeper... (0) -> (4)
   [junit4]   2> 679298 INFO  (qtp1382184418-5351) [n:127.0.0.1:48716_solr    ] o.a.s.h.a.CollectionsHandler Invoked Collection Action :create with params replicationFactor=10&collection.configName=conf&name=acollection&action=CREATE&wt=javabin&version=2 and sendToOCPQueue=true
   [junit4]   2> 679300 INFO  (OverseerThreadFactory-1866-thread-2-processing-n:127.0.0.1:37178_solr) [n:127.0.0.1:37178_solr    ] o.a.s.c.CreateCollectionCmd Create collection acollection
   [junit4]   2> 679301 INFO  (OverseerCollectionConfigSetProcessor-97051004316483591-127.0.0.1:37178_solr-n_0000000000) [n:127.0.0.1:37178_solr    ] o.a.s.c.OverseerTaskQueue Response ZK path: /overseer/collection-queue-work/qnr-0000000000 doesn't exist.  Requestor may have disconnected from ZooKeeper
   [junit4]   2> 679301 ERROR (OverseerThreadFactory-1866-thread-2-processing-n:127.0.0.1:37178_solr) [n:127.0.0.1:37178_solr    ] o.a.s.c.OverseerCollectionMessageHandler Collection: acollection operation: create failed:org.apache.solr.common.SolrException: numShards is a required param (when using CompositeId router).
   [junit4]   2> 	at org.apache.solr.cloud.CreateCollectionCmd.call(CreateCollectionCmd.java:105)
   [junit4]   2> 	at org.apache.solr.cloud.OverseerCollectionMessageHandler.processMessage(OverseerCollectionMessageHandler.java:224)
   [junit4]   2> 	at org.apache.solr.cloud.OverseerTaskProcessor$Runner.run(OverseerTaskProcessor.java:463)
   [junit4]   2> 	at org.apache.solr.common.util.ExecutorUtil$MDCAwareThreadPoolExecutor.lambda$execute$0(ExecutorUtil.java:229)
   [junit4]   2> 	at java.util.concurrent.ThreadPoolExecutor.runWorker(ThreadPoolExecutor.java:1142)
   [junit4]   2> 	at java.util.concurrent.ThreadPoolExecutor$Worker.run(ThreadPoolExecutor.java:617)
   [junit4]   2> 	at java.lang.Thread.run(Thread.java:745)
   [junit4]   2> 
   [junit4]   2> 679304 INFO  (qtp1382184418-5351) [n:127.0.0.1:48716_solr    ] o.a.s.s.HttpSolrCall [admin] webapp=null path=/admin/collections params={replicationFactor=10&collection.configName=conf&name=acollection&action=CREATE&wt=javabin&version=2} status=400 QTime=6
   [junit4]   2> 679304 INFO  (TEST-HdfsCollectionsAPIDistributedZkTest.testMissingNumShards-seed#[76CD8EC0C0347139]) [    ] o.a.s.SolrTestCaseJ4 ###Ending testMissingNumShards
   [junit4]   2> 679368 INFO  (TEST-HdfsCollectionsAPIDistributedZkTest.addReplicaTest-seed#[76CD8EC0C0347139]) [    ] o.a.s.SolrTestCaseJ4 ###Starting addReplicaTest
   [junit4]   2> 679369 INFO  (TEST-HdfsCollectionsAPIDistributedZkTest.addReplicaTest-seed#[76CD8EC0C0347139]) [    ] o.a.s.c.c.ZkStateReader Updated live nodes from ZooKeeper... (0) -> (4)
   [junit4]   2> 679372 INFO  (qtp1382184418-5333) [n:127.0.0.1:48716_solr    ] o.a.s.h.a.CollectionsHandler Invoked Collection Action :create with params replicationFactor=2&collection.configName=conf&maxShardsPerNode=4&name=addReplicaColl&action=CREATE&numShards=2&wt=javabin&version=2 and sendToOCPQueue=true
   [junit4]   2> 679375 INFO  (OverseerThreadFactory-1866-thread-3-processing-n:127.0.0.1:37178_solr) [n:127.0.0.1:37178_solr    ] o.a.s.c.CreateCollectionCmd Create collection addReplicaColl
   [junit4]   2> 679375 INFO  (OverseerCollectionConfigSetProcessor-97051004316483591-127.0.0.1:37178_solr-n_0000000000) [n:127.0.0.1:37178_solr    ] o.a.s.c.OverseerTaskQueue Response ZK path: /overseer/collection-queue-work/qnr-0000000002 doesn't exist.  Requestor may have disconnected from ZooKeeper
   [junit4]   2> 679499 INFO  (qtp1382184418-5350) [n:127.0.0.1:48716_solr    ] o.a.s.u.TestInjection Inject random core creation delay of 3s
   [junit4]   2> 679571 INFO  (qtp1940596849-5316) [n:127.0.0.1:35373_solr    ] o.a.s.u.TestInjection Inject random core creation delay of 3s
   [junit4]   2> 679573 INFO  (qtp477430700-5327) [n:127.0.0.1:37178_solr    ] o.a.s.u.TestInjection Inject random core creation delay of 3s
   [junit4]   2> 679577 INFO  (qtp1296791814-5339) [n:127.0.0.1:57961_solr    ] o.a.s.u.TestInjection Inject random core creation delay of 3s
   [junit4]   2> 682499 INFO  (qtp1382184418-5350) [n:127.0.0.1:48716_solr    ] o.a.s.h.a.CoreAdminOperation core create command qt=/admin/cores&collection.configName=conf&newCollection=true&name=addReplicaColl_shard1_replica1&action=CREATE&numShards=2&collection=addReplicaColl&shard=shard1&wt=javabin&version=2
   [junit4]   2> 682504 INFO  (zkCallback-753-thread-1-processing-n:127.0.0.1:48716_solr) [n:127.0.0.1:48716_solr    ] o.a.s.c.c.ZkStateReader A cluster state change: [WatchedEvent state:SyncConnected type:NodeDataChanged path:/collections/addReplicaColl/state.json] for collection [addReplicaColl] has occurred - updating... (live nodes size: [4])
   [junit4]   2> 682572 INFO  (qtp1940596849-5316) [n:127.0.0.1:35373_solr    ] o.a.s.h.a.CoreAdminOperation core create command qt=/admin/cores&collection.configName=conf&newCollection=true&name=addReplicaColl_shard2_replica1&action=CREATE&numShards=2&collection=addReplicaColl&shard=shard2&wt=javabin&version=2
   [junit4]   2> 682573 INFO  (qtp477430700-5327) [n:127.0.0.1:37178_solr    ] o.a.s.h.a.CoreAdminOperation core create command qt=/admin/cores&collection.configName=conf&newCollection=true&name=addReplicaColl_shard1_replica2&action=CREATE&numShards=2&collection=addReplicaColl&shard=shard1&wt=javabin&version=2
   [junit4]   2> 682577 INFO  (qtp1296791814-5339) [n:127.0.0.1:57961_solr    ] o.a.s.h.a.CoreAdminOperation core create command qt=/admin/cores&collection.configName=conf&newCollection=true&name=addReplicaColl_shard2_replica2&action=CREATE&numShards=2&collection=addReplicaColl&shard=shard2&wt=javabin&version=2
   [junit4]   2> 682682 INFO  (zkCallback-753-thread-1-processing-n:127.0.0.1:48716_solr) [n:127.0.0.1:48716_solr    ] o.a.s.c.c.ZkStateReader A cluster state change: [WatchedEvent state:SyncConnected type:NodeDataChanged path:/collections/addReplicaColl/state.json] for collection [addReplicaColl] has occurred - updating... (live nodes size: [4])
   [junit4]   2> 682682 INFO  (zkCallback-754-thread-1-processing-n:127.0.0.1:57961_solr) [n:127.0.0.1:57961_solr    ] o.a.s.c.c.ZkStateReader A cluster state change: [WatchedEvent state:SyncConnected type:NodeDataChanged path:/collections/addReplicaColl/state.json] for collection [addReplicaColl] has occurred - updating... (live nodes size: [4])
   [junit4]   2> 682682 INFO  (zkCallback-745-thread-2-processing-n:127.0.0.1:37178_solr) [n:127.0.0.1:37178_solr    ] o.a.s.c.c.ZkStateReader A cluster state change: [WatchedEvent state:SyncConnected type:NodeDataChanged path:/collections/addReplicaColl/state.json] for collection [addReplicaColl] has occurred - updating... (live nodes size: [4])
   [junit4]   2> 682682 INFO  (zkCallback-749-thread-1-processing-n:127.0.0.1:35373_solr) [n:127.0.0.1:35373_solr    ] o.a.s.c.c.ZkStateReader A cluster state change: [WatchedEvent state:SyncConnected type:NodeDataChanged path:/collections/addReplicaColl/state.json] for collection [addReplicaColl] has occurred - updating... (live nodes size: [4])
   [junit4]   2> 683511 INFO  (qtp1382184418-5350) [n:127.0.0.1:48716_solr c:addReplicaColl s:shard1  x:addReplicaColl_shard1_replica1] o.a.s.c.SolrConfig Using Lucene MatchVersion: 6.4.0
   [junit4]   2> 683534 INFO  (qtp1382184418-5350) [n:127.0.0.1:48716_solr c:addReplicaColl s:shard1  x:addReplicaColl_shard1_replica1] o.a.s.s.IndexSchema [addReplicaColl_shard1_replica1] Schema name=minimal
   [junit4]   2> 683537 INFO  (qtp1382184418-5350) [n:127.0.0.1:48716_solr c:addReplicaColl s:shard1  x:addReplicaColl_shard1_replica1] o.a.s.s.IndexSchema Loaded schema minimal/1.1 with uniqueid field id
   [junit4]   2> 683538 INFO  (qtp1382184418-5350) [n:127.0.0.1:48716_solr c:addReplicaColl s:shard1  x:addReplicaColl_shard1_replica1] o.a.s.c.CoreContainer Creating SolrCore 'addReplicaColl_shard1_replica1' using configuration from collection addReplicaColl
   [junit4]   2> 683539 INFO  (qtp1382184418-5350) [n:127.0.0.1:48716_solr c:addReplicaColl s:shard1 r:core_node1 x:addReplicaColl_shard1_replica1] o.a.s.c.HdfsDirectoryFactory solr.hdfs.home=hdfs://localhost:38672/data
   [junit4]   2> 683539 INFO  (qtp1382184418-5350) [n:127.0.0.1:48716_solr c:addReplicaColl s:shard1 r:core_node1 x:addReplicaColl_shard1_replica1] o.a.s.c.HdfsDirectoryFactory Solr Kerberos Authentication disabled
   [junit4]   2> 683539 INFO  (qtp1382184418-5350) [n:127.0.0.1:48716_solr c:addReplicaColl s:shard1 r:core_node1 x:addReplicaColl_shard1_replica1] o.a.s.c.SolrCore [[addReplicaColl_shard1_replica1] ] Opening new SolrCore at [/x1/jenkins/jenkins-slave/workspace/Lucene-Solr-NightlyTests-6.x/checkout/solr/build/solr-core/test/J2/temp/solr.cloud.hdfs.HdfsCollectionsAPIDistributedZkTest_76CD8EC0C0347139-001/tempDir-001/node4/addReplicaColl_shard1_replica1], dataDir=[hdfs://localhost:38672/data/addReplicaColl/core_node1/data/]
   [junit4]   2> 683539 INFO  (qtp1382184418-5350) [n:127.0.0.1:48716_solr c:addReplicaColl s:shard1 r:core_node1 x:addReplicaColl_shard1_replica1] o.a.s.c.HdfsDirectoryFactory creating directory factory for path hdfs://localhost:38672/data/addReplicaColl/core_node1/data/snapshot_metadata
   [junit4]   2> 683546 INFO  (qtp1382184418-5350) [n:127.0.0.1:48716_solr c:addReplicaColl s:shard1 r:core_node1 x:addReplicaColl_shard1_replica1] o.a.s.c.HdfsDirectoryFactory Number of slabs of block cache [1] with direct memory allocation set to [true]
   [junit4]   2> 683546 INFO  (qtp1382184418-5350) [n:127.0.0.1:48716_solr c:addReplicaColl s:shard1 r:core_node1 x:addReplicaColl_shard1_replica1] o.a.s.c.HdfsDirectoryFactory Block cache target memory usage, slab size of [16777216] will allocate [1] slabs and use ~[16777216] bytes
   [junit4]   2> 683546 INFO  (qtp1382184418-5350) [n:127.0.0.1:48716_solr c:addReplicaColl s:shard1 r:core_node1 x:addReplicaColl_shard1_replica1] o.a.s.c.HdfsDirectoryFactory Creating new global HDFS BlockCache
   [junit4]   2> 683583 INFO  (qtp477430700-5327) [n:127.0.0.1:37178_solr c:addReplicaColl s:shard1  x:addReplicaColl_shard1_replica2] o.a.s.c.SolrConfig Using Lucene MatchVersion: 6.4.0
   [junit4]   2> 683583 INFO  (qtp1940596849-5316) [n:127.0.0.1:35373_solr c:addReplicaColl s:shard2  x:addReplicaColl_shard2_replica1] o.a.s.c.SolrConfig Using Lucene MatchVersion: 6.4.0
   [junit4]   2> 683589 INFO  (qtp1296791814-5339) [n:127.0.0.1:57961_solr c:addReplicaColl s:shard2  x:addReplicaColl_shard2_replica2] o.a.s.c.SolrConfig Using Lucene MatchVersion: 6.4.0
   [junit4]   2> 683591 INFO  (qtp477430700-5327) [n:127.0.0.1:37178_solr c:addReplicaColl s:shard1  x:addReplicaColl_shard1_replica2] o.a.s.s.IndexSchema [addReplicaColl_shard1_replica2] Schema name=minimal
   [junit4]   2> 683591 INFO  (qtp1940596849-5316) [n:127.0.0.1:35373_solr c:addReplicaColl s:shard2  x:addReplicaColl_shard2_replica1] o.a.s.s.IndexSchema [addReplicaColl_shard2_replica1] Schema name=minimal
   [junit4]   2> 683593 INFO  (qtp477430700-5327) [n:127.0.0.1:37178_solr c:addReplicaColl s:shard1  x:addReplicaColl_shard1_replica2] o.a.s.s.IndexSchema Loaded schema minimal/1.1 with uniqueid field id
   [junit4]   2> 683593 INFO  (qtp1940596849-5316) [n:127.0.0.1:35373_solr c:addReplicaColl s:shard2  x:addReplicaColl_shard2_replica1] o.a.s.s.IndexSchema Loaded schema minimal/1.1 with uniqueid field id
   [junit4]   2> 683595 INFO  (qtp1940596849-5316) [n:127.0.0.1:35373_solr c:addReplicaColl s:shard2  x:addReplicaColl_shard2_replica1] o.a.s.c.CoreContainer Creating SolrCore 'addReplicaColl_shard2_replica1' using configuration from collection addReplicaColl
   [junit4]   2> 683596 INFO  (qtp1940596849-5316) [n:127.0.0.1:35373_solr c:addReplicaColl s:shard2 r:core_node2 x:addReplicaColl_shard2_replica1] o.a.s.c.HdfsDirectoryFactory solr.hdfs.home=hdfs://localhost:38672/data
   [junit4]   2> 683596 INFO  (qtp1940596849-5316) [n:127.0.0.1:35373_solr c:addReplicaColl s:shard2 r:core_node2 x:addReplicaColl_shard2_replica1] o.a.s.c.HdfsDirectoryFactory Solr Kerberos Authentication disabled
   [junit4]   2> 683596 INFO  (qtp1940596849-5316) [n:127.0.0.1:35373_solr c:addReplicaColl s:shard2 r:core_node2 x:addReplicaColl_shard2_replica1] o.a.s.c.SolrCore [[addReplicaColl_shard2_replica1] ] Opening new SolrCore at [/x1/jenkins/jenkins-slave/workspace/Lucene-Solr-NightlyTests-6.x/checkout/solr/build/solr-core/test/J2/temp/solr.cloud.hdfs.HdfsCollectionsAPIDistributedZkTest_76CD8EC0C0347139-001/tempDir-001/node3/addReplicaColl_shard2_replica1], dataDir=[hdfs://localhost:38672/data/addReplicaColl/core_node2/data/]
   [junit4]   2> 683597 INFO  (qtp1296791814-5339) [n:127.0.0.1:57961_solr c:addReplicaColl s:shard2  x:addReplicaColl_shard2_replica2] o.a.s.s.IndexSchema [addReplicaColl_shard2_replica2] Schema name=minimal
   [junit4]   2> 683599 INFO  (qtp1940596849-5316) [n:127.0.0.1:35373_solr c:addReplicaColl s:shard2 r:core_node2 x:addReplicaColl_shard2_replica1] o.a.s.c.HdfsDirectoryFactory creating directory factory for path hdfs://localhost:38672/data/addReplicaColl/core_node2/data/snapshot_metadata
   [junit4]   2> 683596 INFO  (qtp477430700-5327) [n:127.0.0.1:37178_solr c:addReplicaColl s:shard1  x:addReplicaColl_shard1_replica2] o.a.s.c.CoreContainer Creating SolrCore 'addReplicaColl_shard1_replica2' using configuration from collection addReplicaColl
   [junit4]   2> 683601 INFO  (qtp477430700-5327) [n:127.0.0.1:37178_solr c:addReplicaColl s:shard1 r:core_node3 x:addReplicaColl_shard1_replica2] o.a.s.c.HdfsDirectoryFactory solr.hdfs.home=hdfs://localhost:38672/data
   [junit4]   2> 683601 INFO  (qtp477430700-5327) [n:127.0.0.1:37178_solr c:addReplicaColl s:shard1 r:core_node3 x:addReplicaColl_shard1_replica2] o.a.s.c.HdfsDirectoryFactory Solr Kerberos Authentication disabled
   [junit4]   2> 683601 INFO  (qtp477430700-5327) [n:127.0.0.1:37178_solr c:addReplicaColl s:shard1 r:core_node3 x:addReplicaColl_shard1_replica2] o.a.s.c.SolrCore [[addReplicaColl_shard1_replica2] ] Opening new SolrCore at [/x1/jenkins/jenkins-slave/workspace/Lucene-Solr-NightlyTests-6.x/checkout/solr/build/solr-core/test/J2/temp/solr.cloud.hdfs.HdfsCollectionsAPIDistributedZkTest_76CD8EC0C0347139-001/tempDir-001/node2/addReplicaColl_shard1_replica2], dataDir=[hdfs://localhost:38672/data/addReplicaColl/core_node3/data/]
   [junit4]   2> 683601 INFO  (qtp477430700-5327) [n:127.0.0.1:37178_solr c:addReplicaColl s:shard1 r:core_node3 x:addReplicaColl_shard1_replica2] o.a.s.c.HdfsDirectoryFactory creating directory factory for path hdfs://localhost:38672/data/addReplicaColl/core_node3/data/snapshot_metadata
   [junit4]   2> 683604 INFO  (qtp1296791814-5339) [n:127.0.0.1:57961_solr c:addReplicaColl s:shard2  x:addReplicaColl_shard2_replica2] o.a.s.s.Ind

[...truncated too long message...]

o(MetricsSourceAdapter.java:151)
   [junit4]   2> 	at com.sun.jmx.interceptor.DefaultMBeanServerInterceptor.getClassName(DefaultMBeanServerInterceptor.java:1804)
   [junit4]   2> 	at com.sun.jmx.interceptor.DefaultMBeanServerInterceptor.safeGetClassName(DefaultMBeanServerInterceptor.java:1595)
   [junit4]   2> 	at com.sun.jmx.interceptor.DefaultMBeanServerInterceptor.checkMBeanPermission(DefaultMBeanServerInterceptor.java:1813)
   [junit4]   2> 	at com.sun.jmx.interceptor.DefaultMBeanServerInterceptor.exclusiveUnregisterMBean(DefaultMBeanServerInterceptor.java:430)
   [junit4]   2> 	at com.sun.jmx.interceptor.DefaultMBeanServerInterceptor.unregisterMBean(DefaultMBeanServerInterceptor.java:415)
   [junit4]   2> 	at com.sun.jmx.mbeanserver.JmxMBeanServer.unregisterMBean(JmxMBeanServer.java:546)
   [junit4]   2> 	at org.apache.hadoop.metrics2.util.MBeans.unregister(MBeans.java:81)
   [junit4]   2> 	at org.apache.hadoop.metrics2.impl.MetricsSourceAdapter.stopMBeans(MetricsSourceAdapter.java:226)
   [junit4]   2> 	at org.apache.hadoop.metrics2.impl.MetricsSourceAdapter.stop(MetricsSourceAdapter.java:211)
   [junit4]   2> 	at org.apache.hadoop.metrics2.impl.MetricsSystemImpl.stopSources(MetricsSystemImpl.java:463)
   [junit4]   2> 	at org.apache.hadoop.metrics2.impl.MetricsSystemImpl.stop(MetricsSystemImpl.java:213)
   [junit4]   2> 	at org.apache.hadoop.metrics2.impl.MetricsSystemImpl.shutdown(MetricsSystemImpl.java:594)
   [junit4]   2> 	at org.apache.hadoop.metrics2.lib.DefaultMetricsSystem.shutdownInstance(DefaultMetricsSystem.java:72)
   [junit4]   2> 	at org.apache.hadoop.metrics2.lib.DefaultMetricsSystem.shutdown(DefaultMetricsSystem.java:68)
   [junit4]   2> 	at org.apache.hadoop.hdfs.server.namenode.metrics.NameNodeMetrics.shutdown(NameNodeMetrics.java:171)
   [junit4]   2> 	at org.apache.hadoop.hdfs.server.namenode.NameNode.stop(NameNode.java:872)
   [junit4]   2> 	at org.apache.hadoop.hdfs.MiniDFSCluster.shutdown(MiniDFSCluster.java:1726)
   [junit4]   2> 	at org.apache.hadoop.hdfs.MiniDFSCluster.shutdown(MiniDFSCluster.java:1705)
   [junit4]   2> 	at org.apache.solr.cloud.hdfs.HdfsTestUtil.teardownClass(HdfsTestUtil.java:198)
   [junit4]   2> 	at org.apache.solr.cloud.hdfs.StressHdfsTest.teardownClass(StressHdfsTest.java:77)
   [junit4]   2> 	at sun.reflect.NativeMethodAccessorImpl.invoke0(Native Method)
   [junit4]   2> 	at sun.reflect.NativeMethodAccessorImpl.invoke(NativeMethodAccessorImpl.java:62)
   [junit4]   2> 	at sun.reflect.DelegatingMethodAccessorImpl.invoke(DelegatingMethodAccessorImpl.java:43)
   [junit4]   2> 	at java.lang.reflect.Method.invoke(Method.java:498)
   [junit4]   2> 	at com.carrotsearch.randomizedtesting.RandomizedRunner.invoke(RandomizedRunner.java:1713)
   [junit4]   2> 	at com.carrotsearch.randomizedtesting.RandomizedRunner$7.evaluate(RandomizedRunner.java:870)
   [junit4]   2> 	at com.carrotsearch.randomizedtesting.rules.StatementAdapter.evaluate(StatementAdapter.java:36)
   [junit4]   2> 	at com.carrotsearch.randomizedtesting.rules.SystemPropertiesRestoreRule$1.evaluate(SystemPropertiesRestoreRule.java:57)
   [junit4]   2> 	at org.apache.lucene.util.AbstractBeforeAfterRule$1.evaluate(AbstractBeforeAfterRule.java:45)
   [junit4]   2> 	at com.carrotsearch.randomizedtesting.rules.StatementAdapter.evaluate(StatementAdapter.java:36)
   [junit4]   2> 	at org.apache.lucene.util.TestRuleStoreClassName$1.evaluate(TestRuleStoreClassName.java:41)
   [junit4]   2> 	at com.carrotsearch.randomizedtesting.rules.NoShadowingOrOverridesOnMethodsRule$1.evaluate(NoShadowingOrOverridesOnMethodsRule.java:40)
   [junit4]   2> 	at com.carrotsearch.randomizedtesting.rules.NoShadowingOrOverridesOnMethodsRule$1.evaluate(NoShadowingOrOverridesOnMethodsRule.java:40)
   [junit4]   2> 	at com.carrotsearch.randomizedtesting.rules.StatementAdapter.evaluate(StatementAdapter.java:36)
   [junit4]   2> 	at com.carrotsearch.randomizedtesting.rules.StatementAdapter.evaluate(StatementAdapter.java:36)
   [junit4]   2> 	at com.carrotsearch.randomizedtesting.rules.StatementAdapter.evaluate(StatementAdapter.java:36)
   [junit4]   2> 	at org.apache.lucene.util.TestRuleAssertionsRequired$1.evaluate(TestRuleAssertionsRequired.java:53)
   [junit4]   2> 	at org.apache.lucene.util.TestRuleMarkFailure$1.evaluate(TestRuleMarkFailure.java:47)
   [junit4]   2> 	at org.apache.lucene.util.TestRuleIgnoreAfterMaxFailures$1.evaluate(TestRuleIgnoreAfterMaxFailures.java:64)
   [junit4]   2> 	at org.apache.lucene.util.TestRuleIgnoreTestSuites$1.evaluate(TestRuleIgnoreTestSuites.java:54)
   [junit4]   2> 	at com.carrotsearch.randomizedtesting.rules.StatementAdapter.evaluate(StatementAdapter.java:36)
   [junit4]   2> 	at com.carrotsearch.randomizedtesting.ThreadLeakControl$StatementRunner.run(ThreadLeakControl.java:367)
   [junit4]   2> 	at java.lang.Thread.run(Thread.java:745)
   [junit4]   2> Caused by: java.lang.NullPointerException
   [junit4]   2> 	at org.apache.hadoop.hdfs.server.blockmanagement.BlocksMap.size(BlocksMap.java:203)
   [junit4]   2> 	at org.apache.hadoop.hdfs.server.blockmanagement.BlockManager.getTotalBlocks(BlockManager.java:3370)
   [junit4]   2> 	at org.apache.hadoop.hdfs.server.namenode.FSNamesystem.getBlocksTotal(FSNamesystem.java:5729)
   [junit4]   2> 	... 54 more
   [junit4]   2> 4916895 INFO  (SUITE-StressHdfsTest-seed#[76CD8EC0C0347139]-worker) [    ] o.a.s.SolrTestCaseJ4 ###deleteCore
   [junit4]   2> NOTE: leaving temporary files on disk at: /x1/jenkins/jenkins-slave/workspace/Lucene-Solr-NightlyTests-6.x/checkout/solr/build/solr-core/test/J0/temp/solr.cloud.hdfs.StressHdfsTest_76CD8EC0C0347139-001
   [junit4]   2> Dec 04, 2016 8:57:23 PM com.carrotsearch.randomizedtesting.ThreadLeakControl checkThreadLeaks
   [junit4]   2> WARNING: Will linger awaiting termination of 35 leaked thread(s).
   [junit4]   2> NOTE: test params are: codec=Asserting(Lucene62): {range_facet_l_dv=PostingsFormat(name=Asserting), _version_=FSTOrd50, multiDefault=TestBloomFilteredLucenePostings(BloomFilteringPostingsFormat(Lucene50(blocksize=128))), intDefault=FSTOrd50, id=PostingsFormat(name=Asserting), range_facet_i_dv=TestBloomFilteredLucenePostings(BloomFilteringPostingsFormat(Lucene50(blocksize=128))), text=PostingsFormat(name=LuceneFixedGap), range_facet_l=TestBloomFilteredLucenePostings(BloomFilteringPostingsFormat(Lucene50(blocksize=128))), timestamp=TestBloomFilteredLucenePostings(BloomFilteringPostingsFormat(Lucene50(blocksize=128))), txt_t=PostingsFormat(name=LuceneFixedGap)}, docValues:{range_facet_l_dv=DocValuesFormat(name=Lucene54), range_facet_i_dv=DocValuesFormat(name=Asserting), timestamp=DocValuesFormat(name=Asserting)}, maxPointsInLeafNode=939, maxMBSortInHeap=5.924799971136695, sim=RandomSimilarity(queryNorm=false,coord=crazy): {}, locale=es-CR, timezone=PNT
   [junit4]   2> NOTE: Linux 3.13.0-85-generic amd64/Oracle Corporation 1.8.0_102 (64-bit)/cpus=4,threads=2,free=330821000,total=516947968
   [junit4]   2> NOTE: All tests run in this JVM: [PreAnalyzedUpdateProcessorTest, AlternateDirectoryTest, TestHighlightDedupGrouping, SolrRequestParserTest, TestSchemaNameResource, TestRangeQuery, FullHLLTest, PeerSyncTest, DisMaxRequestHandlerTest, DistributedFacetExistsSmallTest, CloudMLTQParserTest, QueryElevationComponentTest, TestGeoJSONResponseWriter, TestInfoStreamLogging, TestSolrQueryParserResource, DocumentAnalysisRequestHandlerTest, TestCrossCoreJoin, CacheHeaderTest, PeerSyncWithIndexFingerprintCachingTest, TestCryptoKeys, TestAuthorizationFramework, DefaultValueUpdateProcessorTest, TestSolr4Spatial, PathHierarchyTokenizerFactoryTest, ExitableDirectoryReaderTest, BlockCacheTest, DistributedVersionInfoTest, SolrCoreTest, TestAtomicUpdateErrorCases, TestUnifiedSolrHighlighter, TestStressLucene, TestLocalFSCloudBackupRestore, CursorPagingTest, TestQuerySenderNoQuery, TestCustomSort, ZkNodePropsTest, ChangedSchemaMergeTest, TestConfigReload, TestRemoteStreaming, TestDownShardTolerantSearch, AtomicUpdatesTest, TestMacros, TestSolrCloudWithDelegationTokens, BigEndianAscendingWordSerializerTest, DateFieldTest, VMParamsZkACLAndCredentialsProvidersTest, TestBulkSchemaConcurrent, ExternalFileFieldSortTest, SparseHLLTest, TestFieldCacheSort, LeaderFailureAfterFreshStartTest, TestManagedResourceStorage, TestSubQueryTransformerCrossCore, TestDistribIDF, ResourceLoaderTest, TestManagedSchemaAPI, XsltUpdateRequestHandlerTest, TestCSVLoader, TestOmitPositions, NumericFieldsTest, LeaderElectionIntegrationTest, TestDistributedSearch, TestBackupRepositoryFactory, TestFieldResource, DistributedSpellCheckComponentTest, TestSolrDynamicMBean, TestReloadDeadlock, TestReplicationHandler, BasicDistributedZkTest, TestCustomStream, HdfsChaosMonkeyNothingIsSafeTest, DistributedQueryComponentCustomSortTest, RollingRestartTest, ZkStateWriterTest, TestSolrQueryResponse, CachingDirectoryFactoryTest, TestSQLHandlerNonCloud, TestPseudoReturnFields, TestPushWriter, CoreAdminCreateDiscoverTest, TestXmlQParser, TestCodecSupport, NotRequiredUniqueKeyTest, TestStressCloudBlindAtomicUpdates, TestRandomFlRTGCloud, TestObjectReleaseTracker, TestRandomFaceting, TestLeaderElectionWithEmptyReplica, HdfsNNFailoverTest, ReturnFieldsTest, HighlighterConfigTest, SimpleCollectionCreateDeleteTest, TestRealTimeGet, TestPerFieldSimilarity, TestFastWriter, PolyFieldTest, TestLazyCores, CurrencyFieldOpenExchangeTest, TestDocSet, TestBinaryResponseWriter, TestValueSourceCache, TolerantUpdateProcessorTest, MigrateRouteKeyTest, DocExpirationUpdateProcessorFactoryTest, StandardRequestHandlerTest, FileBasedSpellCheckerTest, SolrCLIZkUtilsTest, SolrXmlInZkTest, TestAuthenticationFramework, TestCloudPseudoReturnFields, TestConfigSetsAPIExclusivity, TestConfigSetsAPIZkFailure, TestHdfsCloudBackupRestore, TestReplicaProperties, TestRequestForwarding, TestSizeLimitedDistributedMap, HdfsBasicDistributedZk2Test, HdfsRestartWhileUpdatingTest, StressHdfsTest]
   [junit4] Completed [541/658 (5!)] on J0 in 103.23s, 1 test, 1 failure <<< FAILURES!

[...truncated 61088 lines...]



Mime
View raw message