lucene-dev mailing list archives

Site index · List index
Message view « Date » · « Thread »
Top « Date » · « Thread »
From Policeman Jenkins Server <jenk...@thetaphi.de>
Subject [JENKINS-EA] Lucene-Solr-6.x-Linux (64bit/jdk-9-ea+147) - Build # 2436 - Still Unstable!
Date Fri, 16 Dec 2016 16:59:45 GMT
Build: https://jenkins.thetaphi.de/job/Lucene-Solr-6.x-Linux/2436/
Java: 64bit/jdk-9-ea+147 -XX:+UseCompressedOops -XX:+UseParallelGC

1 tests failed.
FAILED:  org.apache.solr.cloud.TestSolrCloudWithDelegationTokens.testDelegationTokenCancelFail

Error Message:
expected:<200> but was:<404>

Stack Trace:
java.lang.AssertionError: expected:<200> but was:<404>
	at __randomizedtesting.SeedInfo.seed([FF652194F0E6FB5:674967339F947D59]:0)
	at org.junit.Assert.fail(Assert.java:93)
	at org.junit.Assert.failNotEquals(Assert.java:647)
	at org.junit.Assert.assertEquals(Assert.java:128)
	at org.junit.Assert.assertEquals(Assert.java:472)
	at org.junit.Assert.assertEquals(Assert.java:456)
	at org.apache.solr.cloud.TestSolrCloudWithDelegationTokens.cancelDelegationToken(TestSolrCloudWithDelegationTokens.java:141)
	at org.apache.solr.cloud.TestSolrCloudWithDelegationTokens.testDelegationTokenCancelFail(TestSolrCloudWithDelegationTokens.java:305)
	at java.base/jdk.internal.reflect.NativeMethodAccessorImpl.invoke0(Native Method)
	at java.base/jdk.internal.reflect.NativeMethodAccessorImpl.invoke(NativeMethodAccessorImpl.java:62)
	at java.base/jdk.internal.reflect.DelegatingMethodAccessorImpl.invoke(DelegatingMethodAccessorImpl.java:43)
	at java.base/java.lang.reflect.Method.invoke(Method.java:538)
	at com.carrotsearch.randomizedtesting.RandomizedRunner.invoke(RandomizedRunner.java:1713)
	at com.carrotsearch.randomizedtesting.RandomizedRunner$8.evaluate(RandomizedRunner.java:907)
	at com.carrotsearch.randomizedtesting.RandomizedRunner$9.evaluate(RandomizedRunner.java:943)
	at com.carrotsearch.randomizedtesting.RandomizedRunner$10.evaluate(RandomizedRunner.java:957)
	at com.carrotsearch.randomizedtesting.rules.SystemPropertiesRestoreRule$1.evaluate(SystemPropertiesRestoreRule.java:57)
	at org.apache.lucene.util.TestRuleSetupTeardownChained$1.evaluate(TestRuleSetupTeardownChained.java:49)
	at org.apache.lucene.util.AbstractBeforeAfterRule$1.evaluate(AbstractBeforeAfterRule.java:45)
	at org.apache.lucene.util.TestRuleThreadAndTestName$1.evaluate(TestRuleThreadAndTestName.java:48)
	at org.apache.lucene.util.TestRuleIgnoreAfterMaxFailures$1.evaluate(TestRuleIgnoreAfterMaxFailures.java:64)
	at org.apache.lucene.util.TestRuleMarkFailure$1.evaluate(TestRuleMarkFailure.java:47)
	at com.carrotsearch.randomizedtesting.rules.StatementAdapter.evaluate(StatementAdapter.java:36)
	at com.carrotsearch.randomizedtesting.ThreadLeakControl$StatementRunner.run(ThreadLeakControl.java:367)
	at com.carrotsearch.randomizedtesting.ThreadLeakControl.forkTimeoutingTask(ThreadLeakControl.java:811)
	at com.carrotsearch.randomizedtesting.ThreadLeakControl$3.evaluate(ThreadLeakControl.java:462)
	at com.carrotsearch.randomizedtesting.RandomizedRunner.runSingleTest(RandomizedRunner.java:916)
	at com.carrotsearch.randomizedtesting.RandomizedRunner$5.evaluate(RandomizedRunner.java:802)
	at com.carrotsearch.randomizedtesting.RandomizedRunner$6.evaluate(RandomizedRunner.java:852)
	at com.carrotsearch.randomizedtesting.RandomizedRunner$7.evaluate(RandomizedRunner.java:863)
	at com.carrotsearch.randomizedtesting.rules.StatementAdapter.evaluate(StatementAdapter.java:36)
	at com.carrotsearch.randomizedtesting.rules.SystemPropertiesRestoreRule$1.evaluate(SystemPropertiesRestoreRule.java:57)
	at org.apache.lucene.util.AbstractBeforeAfterRule$1.evaluate(AbstractBeforeAfterRule.java:45)
	at com.carrotsearch.randomizedtesting.rules.StatementAdapter.evaluate(StatementAdapter.java:36)
	at org.apache.lucene.util.TestRuleStoreClassName$1.evaluate(TestRuleStoreClassName.java:41)
	at com.carrotsearch.randomizedtesting.rules.NoShadowingOrOverridesOnMethodsRule$1.evaluate(NoShadowingOrOverridesOnMethodsRule.java:40)
	at com.carrotsearch.randomizedtesting.rules.NoShadowingOrOverridesOnMethodsRule$1.evaluate(NoShadowingOrOverridesOnMethodsRule.java:40)
	at com.carrotsearch.randomizedtesting.rules.StatementAdapter.evaluate(StatementAdapter.java:36)
	at com.carrotsearch.randomizedtesting.rules.StatementAdapter.evaluate(StatementAdapter.java:36)
	at com.carrotsearch.randomizedtesting.rules.StatementAdapter.evaluate(StatementAdapter.java:36)
	at org.apache.lucene.util.TestRuleAssertionsRequired$1.evaluate(TestRuleAssertionsRequired.java:53)
	at org.apache.lucene.util.TestRuleMarkFailure$1.evaluate(TestRuleMarkFailure.java:47)
	at org.apache.lucene.util.TestRuleIgnoreAfterMaxFailures$1.evaluate(TestRuleIgnoreAfterMaxFailures.java:64)
	at org.apache.lucene.util.TestRuleIgnoreTestSuites$1.evaluate(TestRuleIgnoreTestSuites.java:54)
	at com.carrotsearch.randomizedtesting.rules.StatementAdapter.evaluate(StatementAdapter.java:36)
	at com.carrotsearch.randomizedtesting.ThreadLeakControl$StatementRunner.run(ThreadLeakControl.java:367)
	at java.base/java.lang.Thread.run(Thread.java:844)




Build Log:
[...truncated 11177 lines...]
   [junit4] Suite: org.apache.solr.cloud.TestSolrCloudWithDelegationTokens
   [junit4]   2> Creating dataDir: /home/jenkins/workspace/Lucene-Solr-6.x-Linux/solr/build/solr-core/test/J1/temp/solr.cloud.TestSolrCloudWithDelegationTokens_FF652194F0E6FB5-001/init-core-data-001
   [junit4]   2> 507041 INFO  (SUITE-TestSolrCloudWithDelegationTokens-seed#[FF652194F0E6FB5]-worker) [    ] o.a.s.SolrTestCaseJ4 Randomized ssl (false) and clientAuth (false) via: @org.apache.solr.SolrTestCaseJ4$SuppressSSL(bugUrl="None")
   [junit4]   2> 507042 INFO  (SUITE-TestSolrCloudWithDelegationTokens-seed#[FF652194F0E6FB5]-worker) [    ] o.a.s.c.MiniSolrCloudCluster Starting cluster of 2 servers in /home/jenkins/workspace/Lucene-Solr-6.x-Linux/solr/build/solr-core/test/J1/temp/solr.cloud.TestSolrCloudWithDelegationTokens_FF652194F0E6FB5-001/tempDir-001
   [junit4]   2> 507042 INFO  (SUITE-TestSolrCloudWithDelegationTokens-seed#[FF652194F0E6FB5]-worker) [    ] o.a.s.c.ZkTestServer STARTING ZK TEST SERVER
   [junit4]   2> 507042 INFO  (Thread-1135) [    ] o.a.s.c.ZkTestServer client port:0.0.0.0/0.0.0.0:0
   [junit4]   2> 507042 INFO  (Thread-1135) [    ] o.a.s.c.ZkTestServer Starting server
   [junit4]   2> 507142 INFO  (SUITE-TestSolrCloudWithDelegationTokens-seed#[FF652194F0E6FB5]-worker) [    ] o.a.s.c.ZkTestServer start zk server on port:35801
   [junit4]   2> 507145 INFO  (jetty-launcher-792-thread-1) [    ] o.e.j.s.Server jetty-9.3.14.v20161028
   [junit4]   2> 507146 INFO  (jetty-launcher-792-thread-2) [    ] o.e.j.s.Server jetty-9.3.14.v20161028
   [junit4]   2> 507146 INFO  (jetty-launcher-792-thread-1) [    ] o.e.j.s.h.ContextHandler Started o.e.j.s.ServletContextHandler@18c57dde{/solr,null,AVAILABLE}
   [junit4]   2> 507146 INFO  (jetty-launcher-792-thread-2) [    ] o.e.j.s.h.ContextHandler Started o.e.j.s.ServletContextHandler@11dc6fc{/solr,null,AVAILABLE}
   [junit4]   2> 507148 INFO  (jetty-launcher-792-thread-2) [    ] o.e.j.s.AbstractConnector Started ServerConnector@79018cfe{HTTP/1.1,[http/1.1]}{127.0.0.1:39060}
   [junit4]   2> 507148 INFO  (jetty-launcher-792-thread-1) [    ] o.e.j.s.AbstractConnector Started ServerConnector@363911f1{HTTP/1.1,[http/1.1]}{127.0.0.1:40872}
   [junit4]   2> 507148 INFO  (jetty-launcher-792-thread-2) [    ] o.e.j.s.Server Started @509245ms
   [junit4]   2> 507148 INFO  (jetty-launcher-792-thread-1) [    ] o.e.j.s.Server Started @509245ms
   [junit4]   2> 507148 INFO  (jetty-launcher-792-thread-2) [    ] o.a.s.c.s.e.JettySolrRunner Jetty properties: {hostContext=/solr, hostPort=39060}
   [junit4]   2> 507148 INFO  (jetty-launcher-792-thread-1) [    ] o.a.s.c.s.e.JettySolrRunner Jetty properties: {hostContext=/solr, hostPort=40872}
   [junit4]   2> 507148 ERROR (jetty-launcher-792-thread-1) [    ] o.a.s.s.StartupLoggingUtils Missing Java Option solr.log.dir. Logging may be missing or incomplete.
   [junit4]   2> 507148 ERROR (jetty-launcher-792-thread-2) [    ] o.a.s.s.StartupLoggingUtils Missing Java Option solr.log.dir. Logging may be missing or incomplete.
   [junit4]   2> 507148 INFO  (jetty-launcher-792-thread-1) [    ] o.a.s.s.SolrDispatchFilter  ___      _       Welcome to Apache Solr? version 6.4.0
   [junit4]   2> 507148 INFO  (jetty-launcher-792-thread-2) [    ] o.a.s.s.SolrDispatchFilter  ___      _       Welcome to Apache Solr? version 6.4.0
   [junit4]   2> 507148 INFO  (jetty-launcher-792-thread-1) [    ] o.a.s.s.SolrDispatchFilter / __| ___| |_ _   Starting in cloud mode on port null
   [junit4]   2> 507148 INFO  (jetty-launcher-792-thread-2) [    ] o.a.s.s.SolrDispatchFilter / __| ___| |_ _   Starting in cloud mode on port null
   [junit4]   2> 507148 INFO  (jetty-launcher-792-thread-1) [    ] o.a.s.s.SolrDispatchFilter \__ \/ _ \ | '_|  Install dir: null
   [junit4]   2> 507148 INFO  (jetty-launcher-792-thread-2) [    ] o.a.s.s.SolrDispatchFilter \__ \/ _ \ | '_|  Install dir: null
   [junit4]   2> 507148 INFO  (jetty-launcher-792-thread-1) [    ] o.a.s.s.SolrDispatchFilter |___/\___/_|_|    Start time: 2016-12-16T16:25:39.120728Z
   [junit4]   2> 507148 INFO  (jetty-launcher-792-thread-2) [    ] o.a.s.s.SolrDispatchFilter |___/\___/_|_|    Start time: 2016-12-16T16:25:39.120751Z
   [junit4]   2> 507159 INFO  (jetty-launcher-792-thread-2) [    ] o.a.s.s.SolrDispatchFilter solr.xml found in ZooKeeper. Loading...
   [junit4]   2> 507159 INFO  (jetty-launcher-792-thread-1) [    ] o.a.s.s.SolrDispatchFilter solr.xml found in ZooKeeper. Loading...
   [junit4]   2> 507162 WARN  (NIOServerCxn.Factory:0.0.0.0/0.0.0.0:0) [    ] o.a.z.s.NIOServerCnxn caught end of stream exception
   [junit4]   2> EndOfStreamException: Unable to read additional data from client sessionid 0x159087407c70001, likely client has closed socket
   [junit4]   2> 	at org.apache.zookeeper.server.NIOServerCnxn.doIO(NIOServerCnxn.java:228)
   [junit4]   2> 	at org.apache.zookeeper.server.NIOServerCnxnFactory.run(NIOServerCnxnFactory.java:208)
   [junit4]   2> 	at java.base/java.lang.Thread.run(Thread.java:844)
   [junit4]   2> 507163 INFO  (jetty-launcher-792-thread-1) [    ] o.a.s.u.UpdateShardHandler Creating UpdateShardHandler HTTP client with params: socketTimeout=340000&connTimeout=45000&retry=true
   [junit4]   2> 507164 INFO  (jetty-launcher-792-thread-2) [    ] o.a.s.u.UpdateShardHandler Creating UpdateShardHandler HTTP client with params: socketTimeout=340000&connTimeout=45000&retry=true
   [junit4]   2> 507165 INFO  (jetty-launcher-792-thread-1) [    ] o.a.s.c.ZkContainer Zookeeper client=127.0.0.1:35801/solr
   [junit4]   2> 507166 INFO  (jetty-launcher-792-thread-2) [    ] o.a.s.c.ZkContainer Zookeeper client=127.0.0.1:35801/solr
   [junit4]   2> 507175 INFO  (jetty-launcher-792-thread-1) [    ] o.a.s.c.OverseerElectionContext I am going to be the leader 127.0.0.1:40872_solr
   [junit4]   2> 507175 INFO  (jetty-launcher-792-thread-2) [    ] o.a.s.c.ZkController Register node as live in ZooKeeper:/live_nodes/127.0.0.1:39060_solr
   [junit4]   2> 507176 INFO  (jetty-launcher-792-thread-1) [    ] o.a.s.c.Overseer Overseer (id=97118161404887045-127.0.0.1:40872_solr-n_0000000000) starting
   [junit4]   2> 507176 INFO  (zkCallback-803-thread-1) [    ] o.a.s.c.c.ZkStateReader Updated live nodes from ZooKeeper... (0) -> (1)
   [junit4]   2> 507176 INFO  (zkCallback-802-thread-1) [    ] o.a.s.c.c.ZkStateReader Updated live nodes from ZooKeeper... (0) -> (1)
   [junit4]   2> 507179 INFO  (jetty-launcher-792-thread-1) [    ] o.a.s.c.ZkController Register node as live in ZooKeeper:/live_nodes/127.0.0.1:40872_solr
   [junit4]   2> 507183 INFO  (zkCallback-802-thread-1) [    ] o.a.s.c.c.ZkStateReader Updated live nodes from ZooKeeper... (1) -> (2)
   [junit4]   2> 507183 INFO  (zkCallback-803-thread-1) [    ] o.a.s.c.c.ZkStateReader Updated live nodes from ZooKeeper... (1) -> (2)
   [junit4]   2> 507190 INFO  (jetty-launcher-792-thread-2) [    ] o.a.s.c.CoreContainer Authentication plugin class obtained from system property 'authenticationPlugin': org.apache.solr.security.HttpParamDelegationTokenPlugin
   [junit4]   2> 507201 INFO  (jetty-launcher-792-thread-2) [    ] o.a.s.s.KerberosPlugin Params: {token.valid=30, delegation-token.token-kind=solr-dt, cookie.domain=127.0.0.1, cookie.path=/, zk-dt-secret-manager.znodeWorkingPath=solr/security/zkdtsm, token.validity=36000, signer.secret.provider.zookeeper.path=/token, type=kerberos, zk-dt-secret-manager.enable=true, kerberos.name.rules=DEFAULT, signer.secret.provider=zookeeper}
   [junit4]   2> 507221 INFO  (jetty-launcher-792-thread-1) [    ] o.a.s.c.CoreContainer Authentication plugin class obtained from system property 'authenticationPlugin': org.apache.solr.security.HttpParamDelegationTokenPlugin
   [junit4]   2> 507222 INFO  (jetty-launcher-792-thread-1) [    ] o.a.s.s.KerberosPlugin Params: {token.valid=30, delegation-token.token-kind=solr-dt, cookie.domain=127.0.0.1, cookie.path=/, zk-dt-secret-manager.znodeWorkingPath=solr/security/zkdtsm, token.validity=36000, signer.secret.provider.zookeeper.path=/token, type=kerberos, zk-dt-secret-manager.enable=true, kerberos.name.rules=DEFAULT, signer.secret.provider=zookeeper}
   [junit4]   2> 507242 INFO  (jetty-launcher-792-thread-1) [    ] o.a.c.f.i.CuratorFrameworkImpl Starting
   [junit4]   2> 507242 INFO  (jetty-launcher-792-thread-2) [    ] o.a.c.f.i.CuratorFrameworkImpl Starting
   [junit4]   2> 507261 INFO  (jetty-launcher-792-thread-1-EventThread) [    ] o.a.c.f.s.ConnectionStateManager State change: CONNECTED
   [junit4]   2> 507261 INFO  (jetty-launcher-792-thread-2-EventThread) [    ] o.a.c.f.s.ConnectionStateManager State change: CONNECTED
   [junit4]   2> 507387 INFO  (jetty-launcher-792-thread-2) [    ] o.a.s.h.c.HttpShardHandlerFactory Reconfiguring the default client with: org.apache.solr.security.HttpParamDelegationTokenPlugin$2@7dc44fa1
   [junit4]   2> 507387 INFO  (jetty-launcher-792-thread-1) [    ] o.a.s.h.c.HttpShardHandlerFactory Reconfiguring the default client with: org.apache.solr.security.HttpParamDelegationTokenPlugin$2@58c9a23c
   [junit4]   2> 507387 INFO  (jetty-launcher-792-thread-2) [    ] o.a.s.u.UpdateShardHandler Reconfiguring the default client with: org.apache.solr.security.HttpParamDelegationTokenPlugin$2@7dc44fa1
   [junit4]   2> 507388 INFO  (jetty-launcher-792-thread-1) [    ] o.a.s.u.UpdateShardHandler Reconfiguring the default client with: org.apache.solr.security.HttpParamDelegationTokenPlugin$2@58c9a23c
   [junit4]   2> 507388 INFO  (jetty-launcher-792-thread-2) [    ] o.a.s.c.CorePropertiesLocator Found 0 core definitions underneath /home/jenkins/workspace/Lucene-Solr-6.x-Linux/solr/build/solr-core/test/J1/temp/solr.cloud.TestSolrCloudWithDelegationTokens_FF652194F0E6FB5-001/tempDir-001/node2/.
   [junit4]   2> 507388 INFO  (jetty-launcher-792-thread-1) [    ] o.a.s.c.CorePropertiesLocator Found 0 core definitions underneath /home/jenkins/workspace/Lucene-Solr-6.x-Linux/solr/build/solr-core/test/J1/temp/solr.cloud.TestSolrCloudWithDelegationTokens_FF652194F0E6FB5-001/tempDir-001/node1/.
   [junit4]   2> 507406 INFO  (TEST-TestSolrCloudWithDelegationTokens.testDelegationTokenCancel-seed#[FF652194F0E6FB5]) [    ] o.a.s.SolrTestCaseJ4 ###Starting testDelegationTokenCancel
   [junit4]   2> 507646 INFO  (TEST-TestSolrCloudWithDelegationTokens.testDelegationTokenCancel-seed#[FF652194F0E6FB5]) [    ] o.a.s.c.c.ZkStateReader Updated live nodes from ZooKeeper... (0) -> (2)
   [junit4]   2> 507646 INFO  (TEST-TestSolrCloudWithDelegationTokens.testDelegationTokenCancel-seed#[FF652194F0E6FB5]) [    ] o.a.s.c.s.i.ZkClientClusterStateProvider Cluster at 127.0.0.1:35801/solr ready
   [junit4]   2> 507649 ERROR (qtp1715963317-5054) [    ] o.a.h.s.t.d.ZKDelegationTokenSecretManager No node in path [/ZKDTSMTokensRoot/DT_1]
   [junit4]   2> 507671 WARN  (TEST-TestSolrCloudWithDelegationTokens.testDelegationTokenCancel-seed#[FF652194F0E6FB5]) [    ] o.a.h.c.p.ResponseProcessCookies Invalid cookie header: "Set-Cookie: hadoop.auth=; Path=/; Domain=127.0.0.1; Expires=jue., 01-ene.-1970 00:00:00 GMT; HttpOnly". Invalid 'expires' attribute: jue., 01-ene.-1970 00:00:00 GMT
   [junit4]   2> 507674 INFO  (TEST-TestSolrCloudWithDelegationTokens.testDelegationTokenCancel-seed#[FF652194F0E6FB5]) [    ] o.a.s.c.c.ZkStateReader Updated live nodes from ZooKeeper... (0) -> (2)
   [junit4]   2> 507675 INFO  (TEST-TestSolrCloudWithDelegationTokens.testDelegationTokenCancel-seed#[FF652194F0E6FB5]) [    ] o.a.s.c.s.i.ZkClientClusterStateProvider Cluster at 127.0.0.1:35801/solr ready
   [junit4]   2> 507679 WARN  (TEST-TestSolrCloudWithDelegationTokens.testDelegationTokenCancel-seed#[FF652194F0E6FB5]) [    ] o.a.h.c.p.ResponseProcessCookies Invalid cookie header: "Set-Cookie: hadoop.auth=; Path=/; Domain=127.0.0.1; Expires=jue., 01-ene.-1970 00:00:00 GMT; HttpOnly". Invalid 'expires' attribute: jue., 01-ene.-1970 00:00:00 GMT
   [junit4]   2> 507691 INFO  (TEST-TestSolrCloudWithDelegationTokens.testDelegationTokenCancel-seed#[FF652194F0E6FB5]) [    ] o.a.s.c.c.ZkStateReader Updated live nodes from ZooKeeper... (0) -> (2)
   [junit4]   2> 507691 INFO  (TEST-TestSolrCloudWithDelegationTokens.testDelegationTokenCancel-seed#[FF652194F0E6FB5]) [    ] o.a.s.c.s.i.ZkClientClusterStateProvider Cluster at 127.0.0.1:35801/solr ready
   [junit4]   2> 507693 ERROR (qtp1715963317-5050) [    ] o.a.h.s.t.d.ZKDelegationTokenSecretManager No node in path [/ZKDTSMTokensRoot/DT_2]
   [junit4]   2> 507705 WARN  (TEST-TestSolrCloudWithDelegationTokens.testDelegationTokenCancel-seed#[FF652194F0E6FB5]) [    ] o.a.h.c.p.ResponseProcessCookies Invalid cookie header: "Set-Cookie: hadoop.auth=; Path=/; Domain=127.0.0.1; Expires=jue., 01-ene.-1970 00:00:00 GMT; HttpOnly". Invalid 'expires' attribute: jue., 01-ene.-1970 00:00:00 GMT
   [junit4]   2> 507709 INFO  (TEST-TestSolrCloudWithDelegationTokens.testDelegationTokenCancel-seed#[FF652194F0E6FB5]) [    ] o.a.s.c.c.ZkStateReader Updated live nodes from ZooKeeper... (0) -> (2)
   [junit4]   2> 507710 INFO  (TEST-TestSolrCloudWithDelegationTokens.testDelegationTokenCancel-seed#[FF652194F0E6FB5]) [    ] o.a.s.c.s.i.ZkClientClusterStateProvider Cluster at 127.0.0.1:35801/solr ready
   [junit4]   2> 507714 WARN  (TEST-TestSolrCloudWithDelegationTokens.testDelegationTokenCancel-seed#[FF652194F0E6FB5]) [    ] o.a.h.c.p.ResponseProcessCookies Invalid cookie header: "Set-Cookie: hadoop.auth=; Path=/; Domain=127.0.0.1; Expires=jue., 01-ene.-1970 00:00:00 GMT; HttpOnly". Invalid 'expires' attribute: jue., 01-ene.-1970 00:00:00 GMT
   [junit4]   2> 507716 INFO  (TEST-TestSolrCloudWithDelegationTokens.testDelegationTokenCancel-seed#[FF652194F0E6FB5]) [    ] o.a.s.SolrTestCaseJ4 ###Ending testDelegationTokenCancel
   [junit4]   2> 507742 INFO  (TEST-TestSolrCloudWithDelegationTokens.testDelegationTokenRenew-seed#[FF652194F0E6FB5]) [    ] o.a.s.SolrTestCaseJ4 ###Starting testDelegationTokenRenew
   [junit4]   2> 507771 INFO  (qtp516765949-5051) [    ] o.a.s.h.a.CollectionsHandler Invoked Collection Action :list with params action=LIST&delegation=GgADYmFyA2JhcgCKAVkIdAqEigFZLICOhAMDFK6lyYiRvHOVR3siHgVq0PuVKBsvB3NvbHItZHQA&wt=javabin&version=2 and sendToOCPQueue=true
   [junit4]   2> 507772 INFO  (qtp516765949-5051) [    ] o.a.s.s.HttpSolrCall [admin] webapp=null path=/admin/collections params={action=LIST&delegation=GgADYmFyA2JhcgCKAVkIdAqEigFZLICOhAMDFK6lyYiRvHOVR3siHgVq0PuVKBsvB3NvbHItZHQA&wt=javabin&version=2} status=0 QTime=0
   [junit4]   2> 507774 WARN  (TEST-TestSolrCloudWithDelegationTokens.testDelegationTokenRenew-seed#[FF652194F0E6FB5]) [    ] o.a.h.c.p.ResponseProcessCookies Invalid cookie header: "Set-Cookie: hadoop.auth=; Path=/; Domain=127.0.0.1; Expires=jue., 01-ene.-1970 00:00:00 GMT; HttpOnly". Invalid 'expires' attribute: jue., 01-ene.-1970 00:00:00 GMT
   [junit4]   2> 507777 INFO  (qtp1715963317-5048) [    ] o.a.s.h.a.CollectionsHandler Invoked Collection Action :list with params action=LIST&delegation=GgADYmFyA2JhcgCKAVkIdAqEigFZLICOhAMDFK6lyYiRvHOVR3siHgVq0PuVKBsvB3NvbHItZHQA&wt=javabin&version=2 and sendToOCPQueue=true
   [junit4]   2> 507777 INFO  (qtp1715963317-5048) [    ] o.a.s.s.HttpSolrCall [admin] webapp=null path=/admin/collections params={action=LIST&delegation=GgADYmFyA2JhcgCKAVkIdAqEigFZLICOhAMDFK6lyYiRvHOVR3siHgVq0PuVKBsvB3NvbHItZHQA&wt=javabin&version=2} status=0 QTime=0
   [junit4]   2> 507781 WARN  (TEST-TestSolrCloudWithDelegationTokens.testDelegationTokenRenew-seed#[FF652194F0E6FB5]) [    ] o.a.h.c.p.ResponseProcessCookies Invalid cookie header: "Set-Cookie: hadoop.auth=; Path=/; Domain=127.0.0.1; Expires=jue., 01-ene.-1970 00:00:00 GMT; HttpOnly". Invalid 'expires' attribute: jue., 01-ene.-1970 00:00:00 GMT
   [junit4]   2> 507797 INFO  (TEST-TestSolrCloudWithDelegationTokens.testDelegationTokenRenew-seed#[FF652194F0E6FB5]) [    ] o.a.s.c.c.ZkStateReader Updated live nodes from ZooKeeper... (0) -> (2)
   [junit4]   2> 507798 INFO  (TEST-TestSolrCloudWithDelegationTokens.testDelegationTokenRenew-seed#[FF652194F0E6FB5]) [    ] o.a.s.c.s.i.ZkClientClusterStateProvider Cluster at 127.0.0.1:35801/solr ready
   [junit4]   2> 507801 INFO  (qtp1715963317-5050) [    ] o.a.s.h.a.CollectionsHandler Invoked Collection Action :list with params action=LIST&delegation=GgADYmFyA2JhcgCKAVkIdAqrigFZLICOqwQDFLrHTP9LmGJyVipqpxNqCnare499B3NvbHItZHQA&wt=javabin&version=2 and sendToOCPQueue=true
   [junit4]   2> 507801 INFO  (qtp1715963317-5050) [    ] o.a.s.s.HttpSolrCall [admin] webapp=null path=/admin/collections params={action=LIST&delegation=GgADYmFyA2JhcgCKAVkIdAqrigFZLICOqwQDFLrHTP9LmGJyVipqpxNqCnare499B3NvbHItZHQA&wt=javabin&version=2} status=0 QTime=0
   [junit4]   2> 507812 INFO  (TEST-TestSolrCloudWithDelegationTokens.testDelegationTokenRenew-seed#[FF652194F0E6FB5]) [    ] o.a.s.c.c.ZkStateReader Updated live nodes from ZooKeeper... (0) -> (2)
   [junit4]   2> 507813 INFO  (TEST-TestSolrCloudWithDelegationTokens.testDelegationTokenRenew-seed#[FF652194F0E6FB5]) [    ] o.a.s.c.s.i.ZkClientClusterStateProvider Cluster at 127.0.0.1:35801/solr ready
   [junit4]   2> 507817 WARN  (TEST-TestSolrCloudWithDelegationTokens.testDelegationTokenRenew-seed#[FF652194F0E6FB5]) [    ] o.a.h.c.p.ResponseProcessCookies Invalid cookie header: "Set-Cookie: hadoop.auth=; Path=/; Domain=127.0.0.1; Expires=jue., 01-ene.-1970 00:00:00 GMT; HttpOnly". Invalid 'expires' attribute: jue., 01-ene.-1970 00:00:00 GMT
   [junit4]   2> 507820 INFO  (TEST-TestSolrCloudWithDelegationTokens.testDelegationTokenRenew-seed#[FF652194F0E6FB5]) [    ] o.a.s.c.c.ZkStateReader Updated live nodes from ZooKeeper... (0) -> (2)
   [junit4]   2> 507821 INFO  (TEST-TestSolrCloudWithDelegationTokens.testDelegationTokenRenew-seed#[FF652194F0E6FB5]) [    ] o.a.s.c.s.i.ZkClientClusterStateProvider Cluster at 127.0.0.1:35801/solr ready
   [junit4]   2> 507824 INFO  (qtp1715963317-5046) [    ] o.a.s.h.a.CollectionsHandler Invoked Collection Action :list with params action=LIST&delegation=GgADYmFyA2JhcgCKAVkIdAqrigFZLICOqwQDFLrHTP9LmGJyVipqpxNqCnare499B3NvbHItZHQA&wt=javabin&version=2 and sendToOCPQueue=true
   [junit4]   2> 507824 INFO  (qtp1715963317-5046) [    ] o.a.s.s.HttpSolrCall [admin] webapp=null path=/admin/collections params={action=LIST&delegation=GgADYmFyA2JhcgCKAVkIdAqrigFZLICOqwQDFLrHTP9LmGJyVipqpxNqCnare499B3NvbHItZHQA&wt=javabin&version=2} status=0 QTime=0
   [junit4]   2> 507827 INFO  (TEST-TestSolrCloudWithDelegationTokens.testDelegationTokenRenew-seed#[FF652194F0E6FB5]) [    ] o.a.s.c.c.ZkStateReader Updated live nodes from ZooKeeper... (0) -> (2)
   [junit4]   2> 507828 INFO  (TEST-TestSolrCloudWithDelegationTokens.testDelegationTokenRenew-seed#[FF652194F0E6FB5]) [    ] o.a.s.c.s.i.ZkClientClusterStateProvider Cluster at 127.0.0.1:35801/solr ready
   [junit4]   2> 507831 WARN  (TEST-TestSolrCloudWithDelegationTokens.testDelegationTokenRenew-seed#[FF652194F0E6FB5]) [    ] o.a.h.c.p.ResponseProcessCookies Invalid cookie header: "Set-Cookie: hadoop.auth=; Path=/; Domain=127.0.0.1; Expires=jue., 01-ene.-1970 00:00:00 GMT; HttpOnly". Invalid 'expires' attribute: jue., 01-ene.-1970 00:00:00 GMT
   [junit4]   2> 507849 INFO  (TEST-TestSolrCloudWithDelegationTokens.testDelegationTokenRenew-seed#[FF652194F0E6FB5]) [    ] o.a.s.c.c.ZkStateReader Updated live nodes from ZooKeeper... (0) -> (2)
   [junit4]   2> 507850 INFO  (TEST-TestSolrCloudWithDelegationTokens.testDelegationTokenRenew-seed#[FF652194F0E6FB5]) [    ] o.a.s.c.s.i.ZkClientClusterStateProvider Cluster at 127.0.0.1:35801/solr ready
   [junit4]   2> 507853 INFO  (qtp1715963317-5054) [    ] o.a.s.h.a.CollectionsHandler Invoked Collection Action :list with params action=LIST&delegation=GgADYmFyA2JhcgCKAVkIdArfigFZLICO3wUDFGbtpEEMP7bSc9FA7N3h-GCkCL9EB3NvbHItZHQA&wt=javabin&version=2 and sendToOCPQueue=true
   [junit4]   2> 507854 INFO  (qtp1715963317-5054) [    ] o.a.s.s.HttpSolrCall [admin] webapp=null path=/admin/collections params={action=LIST&delegation=GgADYmFyA2JhcgCKAVkIdArfigFZLICO3wUDFGbtpEEMP7bSc9FA7N3h-GCkCL9EB3NvbHItZHQA&wt=javabin&version=2} status=0 QTime=0
   [junit4]   2> 507856 INFO  (TEST-TestSolrCloudWithDelegationTokens.testDelegationTokenRenew-seed#[FF652194F0E6FB5]) [    ] o.a.s.c.c.ZkStateReader Updated live nodes from ZooKeeper... (0) -> (2)
   [junit4]   2> 507857 INFO  (TEST-TestSolrCloudWithDelegationTokens.testDelegationTokenRenew-seed#[FF652194F0E6FB5]) [    ] o.a.s.c.s.i.ZkClientClusterStateProvider Cluster at 127.0.0.1:35801/solr ready
   [junit4]   2> 507859 WARN  (TEST-TestSolrCloudWithDelegationTokens.testDelegationTokenRenew-seed#[FF652194F0E6FB5]) [    ] o.a.h.c.p.ResponseProcessCookies Invalid cookie header: "Set-Cookie: hadoop.auth=; Path=/; Domain=127.0.0.1; Expires=jue., 01-ene.-1970 00:00:00 GMT; HttpOnly". Invalid 'expires' attribute: jue., 01-ene.-1970 00:00:00 GMT
   [junit4]   2> 507862 INFO  (TEST-TestSolrCloudWithDelegationTokens.testDelegationTokenRenew-seed#[FF652194F0E6FB5]) [    ] o.a.s.c.c.ZkStateReader Updated live nodes from ZooKeeper... (0) -> (2)
   [junit4]   2> 507862 INFO  (TEST-TestSolrCloudWithDelegationTokens.testDelegationTokenRenew-seed#[FF652194F0E6FB5]) [    ] o.a.s.c.s.i.ZkClientClusterStateProvider Cluster at 127.0.0.1:35801/solr ready
   [junit4]   2> 507865 INFO  (qtp1715963317-5058) [    ] o.a.s.h.a.CollectionsHandler Invoked Collection Action :list with params action=LIST&delegation=GgADYmFyA2JhcgCKAVkIdArfigFZLICO3wUDFGbtpEEMP7bSc9FA7N3h-GCkCL9EB3NvbHItZHQA&wt=javabin&version=2 and sendToOCPQueue=true
   [junit4]   2> 507865 INFO  (qtp1715963317-5058) [    ] o.a.s.s.HttpSolrCall [admin] webapp=null path=/admin/collections params={action=LIST&delegation=GgADYmFyA2JhcgCKAVkIdArfigFZLICO3wUDFGbtpEEMP7bSc9FA7N3h-GCkCL9EB3NvbHItZHQA&wt=javabin&version=2} status=0 QTime=0
   [junit4]   2> 507872 INFO  (TEST-TestSolrCloudWithDelegationTokens.testDelegationTokenRenew-seed#[FF652194F0E6FB5]) [    ] o.a.s.c.c.ZkStateReader Updated live nodes from ZooKeeper... (0) -> (2)
   [junit4]   2> 507872 INFO  (TEST-TestSolrCloudWithDelegationTokens.testDelegationTokenRenew-seed#[FF652194F0E6FB5]) [    ] o.a.s.c.s.i.ZkClientClusterStateProvider Cluster at 127.0.0.1:35801/solr ready
   [junit4]   2> 507875 WARN  (TEST-TestSolrCloudWithDelegationTokens.testDelegationTokenRenew-seed#[FF652194F0E6FB5]) [    ] o.a.h.c.p.ResponseProcessCookies Invalid cookie header: "Set-Cookie: hadoop.auth=; Path=/; Domain=127.0.0.1; Expires=jue., 01-ene.-1970 00:00:00 GMT; HttpOnly". Invalid 'expires' attribute: jue., 01-ene.-1970 00:00:00 GMT
   [junit4]   2> 507887 INFO  (TEST-TestSolrCloudWithDelegationTokens.testDelegationTokenRenew-seed#[FF652194F0E6FB5]) [    ] o.a.s.c.c.ZkStateReader Updated live nodes from ZooKeeper... (0) -> (2)
   [junit4]   2> 507888 INFO  (TEST-TestSolrCloudWithDelegationTokens.testDelegationTokenRenew-seed#[FF652194F0E6FB5]) [    ] o.a.s.c.s.i.ZkClientClusterStateProvider Cluster at 127.0.0.1:35801/solr ready
   [junit4]   2> 507890 INFO  (qtp1715963317-5046) [    ] o.a.s.h.a.CollectionsHandler Invoked Collection Action :list with params action=LIST&delegation=GgADYmFyA2JhcgCKAVkIdAsKigFZLICPCgYDFC86jO_gnhbtzsnSZILPCpwjEJkAB3NvbHItZHQA&wt=javabin&version=2 and sendToOCPQueue=true
   [junit4]   2> 507890 INFO  (qtp1715963317-5046) [    ] o.a.s.s.HttpSolrCall [admin] webapp=null path=/admin/collections params={action=LIST&delegation=GgADYmFyA2JhcgCKAVkIdAsKigFZLICPCgYDFC86jO_gnhbtzsnSZILPCpwjEJkAB3NvbHItZHQA&wt=javabin&version=2} status=0 QTime=0
   [junit4]   2> 507893 WARN  (TEST-TestSolrCloudWithDelegationTokens.testDelegationTokenRenew-seed#[FF652194F0E6FB5]) [    ] o.a.h.c.p.ResponseProcessCookies Invalid cookie header: "Set-Cookie: hadoop.auth=; Path=/; Domain=127.0.0.1; Expires=jue., 01-ene.-1970 00:00:00 GMT; HttpOnly". Invalid 'expires' attribute: jue., 01-ene.-1970 00:00:00 GMT
   [junit4]   2> 507895 INFO  (qtp1715963317-5046) [    ] o.a.s.h.a.CollectionsHandler Invoked Collection Action :list with params action=LIST&delegation=GgADYmFyA2JhcgCKAVkIdAsKigFZLICPCgYDFC86jO_gnhbtzsnSZILPCpwjEJkAB3NvbHItZHQA&wt=javabin&version=2 and sendToOCPQueue=true
   [junit4]   2> 507895 INFO  (qtp1715963317-5046) [    ] o.a.s.s.HttpSolrCall [admin] webapp=null path=/admin/collections params={action=LIST&delegation=GgADYmFyA2JhcgCKAVkIdAsKigFZLICPCgYDFC86jO_gnhbtzsnSZILPCpwjEJkAB3NvbHItZHQA&wt=javabin&version=2} status=0 QTime=0
   [junit4]   2> 507897 INFO  (TEST-TestSolrCloudWithDelegationTokens.testDelegationTokenRenew-seed#[FF652194F0E6FB5]) [    ] o.a.s.c.c.ZkStateReader Updated live nodes from ZooKeeper... (0) -> (2)
   [junit4]   2> 507897 INFO  (TEST-TestSolrCloudWithDelegationTokens.testDelegationTokenRenew-seed#[FF652194F0E6FB5]) [    ] o.a.s.c.s.i.ZkClientClusterStateProvider Cluster at 127.0.0.1:35801/solr ready
   [junit4]   2> 507900 WARN  (TEST-TestSolrCloudWithDelegationTokens.testDelegationTokenRenew-seed#[FF652194F0E6FB5]) [    ] o.a.h.c.p.ResponseProcessCookies Invalid cookie header: "Set-Cookie: hadoop.auth=; Path=/; Domain=127.0.0.1; Expires=jue., 01-ene.-1970 00:00:00 GMT; HttpOnly". Invalid 'expires' attribute: jue., 01-ene.-1970 00:00:00 GMT
   [junit4]   2> 507901 INFO  (TEST-TestSolrCloudWithDelegationTokens.testDelegationTokenRenew-seed#[FF652194F0E6FB5]) [    ] o.a.s.SolrTestCaseJ4 ###Ending testDelegationTokenRenew
   [junit4]   2> 507911 INFO  (TEST-TestSolrCloudWithDelegationTokens.testZNodePaths-seed#[FF652194F0E6FB5]) [    ] o.a.s.SolrTestCaseJ4 ###Starting testZNodePaths
   [junit4]   2> 507916 INFO  (TEST-TestSolrCloudWithDelegationTokens.testZNodePaths-seed#[FF652194F0E6FB5]) [    ] o.a.s.SolrTestCaseJ4 ###Ending testZNodePaths
   [junit4]   2> 507933 INFO  (TEST-TestSolrCloudWithDelegationTokens.testDelegationTokenVerify-seed#[FF652194F0E6FB5]) [    ] o.a.s.SolrTestCaseJ4 ###Starting testDelegationTokenVerify
   [junit4]   2> 507942 INFO  (TEST-TestSolrCloudWithDelegationTokens.testDelegationTokenVerify-seed#[FF652194F0E6FB5]) [    ] o.a.s.c.c.ZkStateReader Updated live nodes from ZooKeeper... (0) -> (2)
   [junit4]   2> 507943 INFO  (TEST-TestSolrCloudWithDelegationTokens.testDelegationTokenVerify-seed#[FF652194F0E6FB5]) [    ] o.a.s.c.s.i.ZkClientClusterStateProvider Cluster at 127.0.0.1:35801/solr ready
   [junit4]   2> 507946 INFO  (qtp1715963317-5044) [    ] o.a.s.h.a.CollectionsHandler Invoked Collection Action :list with params action=LIST&delegation=GgADYmFyA2JhcgCKAVkIdAtDigFZLICPQwgDFHXfNBdjVt72mYcGHtV9MB1DhbFyB3NvbHItZHQA&wt=javabin&version=2 and sendToOCPQueue=true
   [junit4]   2> 507946 INFO  (qtp1715963317-5044) [    ] o.a.s.s.HttpSolrCall [admin] webapp=null path=/admin/collections params={action=LIST&delegation=GgADYmFyA2JhcgCKAVkIdAtDigFZLICPQwgDFHXfNBdjVt72mYcGHtV9MB1DhbFyB3NvbHItZHQA&wt=javabin&version=2} status=0 QTime=0
   [junit4]   2> 507952 INFO  (TEST-TestSolrCloudWithDelegationTokens.testDelegationTokenVerify-seed#[FF652194F0E6FB5]) [    ] o.a.s.c.c.ZkStateReader Updated live nodes from ZooKeeper... (0) -> (2)
   [junit4]   2> 507953 INFO  (TEST-TestSolrCloudWithDelegationTokens.testDelegationTokenVerify-seed#[FF652194F0E6FB5]) [    ] o.a.s.c.s.i.ZkClientClusterStateProvider Cluster at 127.0.0.1:35801/solr ready
   [junit4]   2> 507955 WARN  (TEST-TestSolrCloudWithDelegationTokens.testDelegationTokenVerify-seed#[FF652194F0E6FB5]) [    ] o.a.h.c.p.ResponseProcessCookies Invalid cookie header: "Set-Cookie: hadoop.auth=; Path=/; Domain=127.0.0.1; Expires=jue., 01-ene.-1970 00:00:00 GMT; HttpOnly". Invalid 'expires' attribute: jue., 01-ene.-1970 00:00:00 GMT
   [junit4]   2> 507958 INFO  (TEST-TestSolrCloudWithDelegationTokens.testDelegationTokenVerify-seed#[FF652194F0E6FB5]) [    ] o.a.s.c.c.ZkStateReader Updated live nodes from ZooKeeper... (0) -> (2)
   [junit4]   2> 507958 INFO  (TEST-TestSolrCloudWithDelegationTokens.testDelegationTokenVerify-seed#[FF652194F0E6FB5]) [    ] o.a.s.c.s.i.ZkClientClusterStateProvider Cluster at 127.0.0.1:35801/solr ready
   [junit4]   2> 507961 INFO  (qtp1715963317-5054) [    ] o.a.s.h.a.CollectionsHandler Invoked Collection Action :list with params action=LIST&delegation=GgADYmFyA2JhcgCKAVkIdAtDigFZLICPQwgDFHXfNBdjVt72mYcGHtV9MB1DhbFyB3NvbHItZHQA&wt=javabin&version=2 and sendToOCPQueue=true
   [junit4]   2> 507961 INFO  (qtp1715963317-5054) [    ] o.a.s.s.HttpSolrCall [admin] webapp=null path=/admin/collections params={action=LIST&delegation=GgADYmFyA2JhcgCKAVkIdAtDigFZLICPQwgDFHXfNBdjVt72mYcGHtV9MB1DhbFyB3NvbHItZHQA&wt=javabin&version=2} status=0 QTime=0
   [junit4]   2> 507963 WARN  (TEST-TestSolrCloudWithDelegationTokens.testDelegationTokenVerify-seed#[FF652194F0E6FB5]) [    ] o.a.h.c.p.ResponseProcessCookies Invalid cookie header: "Set-Cookie: hadoop.auth=; Path=/; Domain=127.0.0.1; Expires=jue., 01-ene.-1970 00:00:00 GMT; HttpOnly". Invalid 'expires' attribute: jue., 01-ene.-1970 00:00:00 GMT
   [junit4]   2> 507964 INFO  (TEST-TestSolrCloudWithDelegationTokens.testDelegationTokenVerify-seed#[FF652194F0E6FB5]) [    ] o.a.s.SolrTestCaseJ4 ###Ending testDelegationTokenVerify
   [junit4]   2> 507978 INFO  (TEST-TestSolrCloudWithDelegationTokens.testDelegationOtherOp-seed#[FF652194F0E6FB5]) [    ] o.a.s.SolrTestCaseJ4 ###Starting testDelegationOtherOp
   [junit4]   2> 507980 INFO  (qtp516765949-5059) [    ] o.a.s.h.a.CollectionsHandler Invoked Collection Action :list with params op=someSolrOperation&action=LIST&wt=javabin&version=2 and sendToOCPQueue=true
   [junit4]   2> 507980 INFO  (qtp516765949-5059) [    ] o.a.s.s.HttpSolrCall [admin] webapp=null path=/admin/collections params={op=someSolrOperation&action=LIST&wt=javabin&version=2} status=0 QTime=0
   [junit4]   2> 507980 WARN  (TEST-TestSolrCloudWithDelegationTokens.testDelegationOtherOp-seed#[FF652194F0E6FB5]) [    ] o.a.h.c.p.ResponseProcessCookies Invalid cookie header: "Set-Cookie: hadoop.auth="u=bar&p=bar&t=test&e=1481941539951&s=rulmhMv9wuPUH9qdsREIlluWM+U="; Path=/; Domain=127.0.0.1; Expires=s?b., 17-dic.-2016 02:25:39 GMT; HttpOnly". Invalid 'expires' attribute: s?b., 17-dic.-2016 02:25:39 GMT
   [junit4]   2> 507981 INFO  (TEST-TestSolrCloudWithDelegationTokens.testDelegationOtherOp-seed#[FF652194F0E6FB5]) [    ] o.a.s.SolrTestCaseJ4 ###Ending testDelegationOtherOp
   [junit4]   2> 507992 INFO  (TEST-TestSolrCloudWithDelegationTokens.testDelegationTokenSolrClient-seed#[FF652194F0E6FB5]) [    ] o.a.s.SolrTestCaseJ4 ###Starting testDelegationTokenSolrClient
   [junit4]   2> 508002 WARN  (TEST-TestSolrCloudWithDelegationTokens.testDelegationTokenSolrClient-seed#[FF652194F0E6FB5]) [    ] o.a.h.c.p.ResponseProcessCookies Invalid cookie header: "Set-Cookie: hadoop.auth=; Path=/; Domain=127.0.0.1; Expires=jue., 01-ene.-1970 00:00:00 GMT; HttpOnly". Invalid 'expires' attribute: jue., 01-ene.-1970 00:00:00 GMT
   [junit4]   2> 508005 INFO  (qtp516765949-5049) [    ] o.a.s.h.a.CollectionsHandler Invoked Collection Action :list with params action=LIST&delegation=GgADYmFyA2JhcgCKAVkIdAt-igFZLICPfgkDFMfnczHiBWfpTRtItZoNAvx906NUB3NvbHItZHQA&wt=javabin&version=2 and sendToOCPQueue=true
   [junit4]   2> 508005 INFO  (qtp516765949-5049) [    ] o.a.s.s.HttpSolrCall [admin] webapp=null path=/admin/collections params={action=LIST&delegation=GgADYmFyA2JhcgCKAVkIdAt-igFZLICPfgkDFMfnczHiBWfpTRtItZoNAvx906NUB3NvbHItZHQA&wt=javabin&version=2} status=0 QTime=0
   [junit4]   2> 508005 INFO  (TEST-TestSolrCloudWithDelegationTokens.testDelegationTokenSolrClient-seed#[FF652194F0E6FB5]) [    ] o.a.s.SolrTestCaseJ4 ###Ending testDelegationTokenSolrClient
   [junit4]   2> 508025 INFO  (TEST-TestSolrCloudWithDelegationTokens.testDelegationTokenRenewFail-seed#[FF652194F0E6FB5]) [    ] o.a.s.SolrTestCaseJ4 ###Starting testDelegationTokenRenewFail
   [junit4]   2> 508036 WARN  (qtp516765949-5047) [    ] o.a.h.s.a.s.AuthenticationFilter Authentication exception: org.apache.hadoop.security.AccessControlException: foo tries to renew a token with renewer bar
   [junit4]   2> 508036 WARN  (qtp516765949-5047) [    ] o.a.s.s.KerberosPlugin Could not find org.apache.solr.security.kerberosplugin.requestcontinues
   [junit4]   2> 508036 WARN  (TEST-TestSolrCloudWithDelegationTokens.testDelegationTokenRenewFail-seed#[FF652194F0E6FB5]) [    ] o.a.h.c.p.ResponseProcessCookies Invalid cookie header: "Set-Cookie: hadoop.auth=; Path=/; Domain=127.0.0.1; Expires=jue., 01-ene.-1970 00:00:00 GMT; HttpOnly". Invalid 'expires' attribute: jue., 01-ene.-1970 00:00:00 GMT
   [junit4]   2> 508038 WARN  (qtp1715963317-5058) [    ] o.a.h.s.a.s.AuthenticationFilter Authentication exception: org.apache.hadoop.security.AccessControlException: foo tries to renew a token with renewer bar
   [junit4]   2> 508039 WARN  (qtp1715963317-5058) [    ] o.a.s.s.KerberosPlugin Could not find org.apache.solr.security.kerberosplugin.requestcontinues
   [junit4]   2> 508039 WARN  (TEST-TestSolrCloudWithDelegationTokens.testDelegationTokenRenewFail-seed#[FF652194F0E6FB5]) [    ] o.a.h.c.p.ResponseProcessCookies Invalid cookie header: "Set-Cookie: hadoop.auth=; Path=/; Domain=127.0.0.1; Expires=jue., 01-ene.-1970 00:00:00 GMT; HttpOnly". Invalid 'expires' attribute: jue., 01-ene.-1970 00:00:00 GMT
   [junit4]   2> 508045 WARN  (qtp516765949-5055) [    ] o.a.h.s.a.s.AuthenticationFilter Authentication exception: org.apache.hadoop.security.AccessControlException: notRenewUser tries to renew a token with renewer renewUser
   [junit4]   2> 508045 WARN  (qtp516765949-5055) [    ] o.a.s.s.KerberosPlugin Could not find org.apache.solr.security.kerberosplugin.requestcontinues
   [junit4]   2> 508045 WARN  (TEST-TestSolrCloudWithDelegationTokens.testDelegationTokenRenewFail-seed#[FF652194F0E6FB5]) [    ] o.a.h.c.p.ResponseProcessCookies Invalid cookie header: "Set-Cookie: hadoop.auth=; Path=/; Domain=127.0.0.1; Expires=jue., 01-ene.-1970 00:00:00 GMT; HttpOnly". Invalid 'expires' attribute: jue., 01-ene.-1970 00:00:00 GMT
   [junit4]   2> 508047 WARN  (qtp1715963317-5056) [    ] o.a.h.s.a.s.AuthenticationFilter Authentication exception: org.apache.hadoop.security.AccessControlException: notRenewUser tries to renew a token with renewer renewUser
   [junit4]   2> 508047 WARN  (qtp1715963317-5056) [    ] o.a.s.s.KerberosPlugin Could not find org.apache.solr.security.kerberosplugin.requestcontinues
   [junit4]   2> 508047 WARN  (TEST-TestSolrCloudWithDelegationTokens.testDelegationTokenRenewFail-seed#[FF652194F0E6FB5]) [    ] o.a.h.c.p.ResponseProcessCookies Invalid cookie header: "Set-Cookie: hadoop.auth=; Path=/; Domain=127.0.0.1; Expires=jue., 01-ene.-1970 00:00:00 GMT; HttpOnly". Invalid 'expires' attribute: jue., 01-ene.-1970 00:00:00 GMT
   [junit4]   2> 508047 INFO  (TEST-TestSolrCloudWithDelegationTokens.testDelegationTokenRenewFail-seed#[FF652194F0E6FB5]) [    ] o.a.s.SolrTestCaseJ4 ###Ending testDelegationTokenRenewFail
   [junit4]   2> 508059 INFO  (TEST-TestSolrCloudWithDelegationTokens.testDelegationTokenCancelFail-seed#[FF652194F0E6FB5]) [    ] o.a.s.SolrTestCaseJ4 ###Starting testDelegationTokenCancelFail
   [junit4]   2> 508071 ERROR (qtp1715963317-5054) [    ] o.a.h.s.t.d.ZKDelegationTokenSecretManager No node in path [/ZKDTSMTokensRoot/DT_12]
   [junit4]   2> 508073 ERROR (qtp516765949-5055) [    ] o.a.h.s.t.d.ZKDelegationTokenSecretManager No node in path [/ZKDTSMTokensRoot/DT_12]
   [junit4]   2> 508084 ERROR (qtp1715963317-5058) [    ] o.a.h.s.t.d.ZKDelegationTokenSecretManager No node in path [/ZKDTSMTokensRoot/DT_13]
   [junit4]   2> 508088 INFO  (TEST-TestSolrCloudWithDelegationTokens.testDelegationTokenCancelFail-seed#[FF652194F0E6FB5]) [    ] o.a.s.SolrTestCaseJ4 ###Ending testDelegationTokenCancelFail
   [junit4]   2> NOTE: reproduce with: ant test  -Dtestcase=TestSolrCloudWithDelegationTokens -Dtests.method=testDelegationTokenCancelFail -Dtests.seed=FF652194F0E6FB5 -Dtests.multiplier=3 -Dtests.slow=true -Dtests.locale=es-ES -Dtests.timezone=Atlantic/Canary -Dtests.asserts=true -Dtests.file.encoding=US-ASCII
   [junit4] FAILURE 0.04s J1 | TestSolrCloudWithDelegationTokens.testDelegationTokenCancelFail <<<
   [junit4]    > Throwable #1: java.lang.AssertionError: expected:<200> but was:<404>
   [junit4]    > 	at __randomizedtesting.SeedInfo.seed([FF652194F0E6FB5:674967339F947D59]:0)
   [junit4]    > 	at org.apache.solr.cloud.TestSolrCloudWithDelegationTokens.cancelDelegationToken(TestSolrCloudWithDelegationTokens.java:141)
   [junit4]    > 	at org.apache.solr.cloud.TestSolrCloudWithDelegationTokens.testDelegationTokenCancelFail(TestSolrCloudWithDelegationTokens.java:305)
   [junit4]    > 	at java.base/jdk.internal.reflect.NativeMethodAccessorImpl.invoke0(Native Method)
   [junit4]    > 	at java.base/jdk.internal.reflect.NativeMethodAccessorImpl.invoke(NativeMethodAccessorImpl.java:62)
   [junit4]    > 	at java.base/jdk.internal.reflect.DelegatingMethodAccessorImpl.invoke(DelegatingMethodAccessorImpl.java:43)
   [junit4]    > 	at java.base/java.lang.reflect.Method.invoke(Method.java:538)
   [junit4]    > 	at java.base/java.lang.Thread.run(Thread.java:844)
   [junit4]   2> 508092 INFO  (jetty-launcher-792-thread-1) [    ] o.e.j.s.AbstractConnector Stopped ServerConnector@79018cfe{HTTP/1.1,[http/1.1]}{127.0.0.1:0}
   [junit4]   2> 508092 INFO  (jetty-launcher-792-thread-1) [    ] o.a.s.c.CoreContainer Shutting down CoreContainer instance=130520394
   [junit4]   2> 508093 INFO  (jetty-launcher-792-thread-2) [    ] o.e.j.s.AbstractConnector Stopped ServerConnector@363911f1{HTTP/1.1,[http/1.1]}{127.0.0.1:0}
   [junit4]   2> 508093 INFO  (jetty-launcher-792-thread-2) [    ] o.a.s.c.CoreContainer Shutting down CoreContainer instance=1117475199
   [junit4]   2> 508096 INFO  (jetty-launcher-792-thread-2) [    ] o.a.s.c.Overseer Overseer (id=97118161404887045-127.0.0.1:40872_solr-n_0000000000) closing
   [junit4]   2> 508096 INFO  (OverseerStateUpdate-97118161404887045-127.0.0.1:40872_solr-n_0000000000) [    ] o.a.s.c.Overseer Overseer Loop exiting : 127.0.0.1:40872_solr
   [junit4]   2> 509596 WARN  (zkCallback-802-thread-1) [    ] o.a.s.c.c.ZkStateReader ZooKeeper watch triggered, but Solr cannot talk to ZK: [KeeperErrorCode = Session expired for /live_nodes]
   [junit4]   2> 509596 WARN  (zkCallback-803-thread-1) [    ] o.a.s.c.c.ZkStateReader ZooKeeper watch triggered, but Solr cannot talk to ZK: [KeeperErrorCode = Session expired for /live_nodes]
   [junit4]   2> 509597 ERROR (Thread[Thread-1153,5,TGRP-TestSolrCloudWithDelegationTokens]) [    ] o.a.h.s.t.d.AbstractDelegationTokenSecretManager ExpiredTokenRemover received java.lang.InterruptedException: sleep interrupted
   [junit4]   2> 509597 ERROR (Thread[Thread-1154,5,TGRP-TestSolrCloudWithDelegationTokens]) [    ] o.a.h.s.t.d.AbstractDelegationTokenSecretManager ExpiredTokenRemover received java.lang.InterruptedException: sleep interrupted
   [junit4]   2> 509601 WARN  (NIOServerCxn.Factory:0.0.0.0/0.0.0.0:0) [    ] o.a.z.s.NIOServerCnxn caught end of stream exception
   [junit4]   2> EndOfStreamException: Unable to read additional data from client sessionid 0x159087407c70008, likely client has closed socket
   [junit4]   2> 	at org.apache.zookeeper.server.NIOServerCnxn.doIO(NIOServerCnxn.java:228)
   [junit4]   2> 	at org.apache.zookeeper.server.NIOServerCnxnFactory.run(NIOServerCnxnFactory.java:208)
   [junit4]   2> 	at java.base/java.lang.Thread.run(Thread.java:844)
   [junit4]   2> 509601 INFO  (jetty-launcher-792-thread-1) [    ] o.e.j.s.h.ContextHandler Stopped o.e.j.s.ServletContextHandler@11dc6fc{/solr,null,UNAVAILABLE}
   [junit4]   2> 509601 INFO  (jetty-launcher-792-thread-2) [    ] o.e.j.s.h.ContextHandler Stopped o.e.j.s.ServletContextHandler@18c57dde{/solr,null,UNAVAILABLE}
   [junit4]   2> 509602 INFO  (SUITE-TestSolrCloudWithDelegationTokens-seed#[FF652194F0E6FB5]-worker) [    ] o.a.s.c.ZkTestServer connecting to 127.0.0.1:35801 35801
   [junit4]   2> 509617 INFO  (Thread-1135) [    ] o.a.s.c.ZkTestServer connecting to 127.0.0.1:35801 35801
   [junit4]   2> 509617 WARN  (Thread-1135) [    ] o.a.s.c.ZkTestServer Watch limit violations: 
   [junit4]   2> Maximum concurrent create/delete watches above limit:
   [junit4]   2> 
   [junit4]   2> 	19	/solr/aliases.json
   [junit4]   2> 	19	/solr/clusterprops.json
   [junit4]   2> 	2	/solr/security.json
   [junit4]   2> 
   [junit4]   2> Maximum concurrent data watches above limit:
   [junit4]   2> 
   [junit4]   2> 	19	/solr/clusterstate.json
   [junit4]   2> 	4	/solr/security/zkdtsm/ZKDTSMRoot/ZKDTSMKeyIdRoot
   [junit4]   2> 	2	/solr/security/zkdtsm/ZKDTSMRoot/ZKDTSMTokensRoot/DT_7
   [junit4]   2> 	2	/solr/security/zkdtsm/ZKDTSMRoot/ZKDTSMTokensRoot/DT_6
   [junit4]   2> 	2	/solr/security/zkdtsm/ZKDTSMRoot/ZKDTSMTokensRoot/DT_9
   [junit4]   2> 	2	/solr/security/zkdtsm/ZKDTSMRoot/ZKDTSMTokensRoot/DT_8
   [junit4]   2> 	2	/solr/security/zkdtsm/ZKDTSMRoot/ZKDTSMMasterKeyRoot/DK_1
   [junit4]   2> 	2	/solr/security/zkdtsm/ZKDTSMRoot/ZKDTSMTokensRoot/DT_1
   [junit4]   2> 	2	/solr/security/zkdtsm/ZKDTSMRoot/ZKDTSMMasterKeyRoot/DK_3
   [junit4]   2> 	2	/solr/security/zkdtsm/ZKDTSMRoot/ZKDTSMTokensRoot/DT_3
   [junit4]   2> 	2	/solr/security/zkdtsm/ZKDTSMRoot/ZKDTSMMasterKeyRoot/DK_2
   [junit4]   2> 	2	/solr/security/zkdtsm/ZKDTSMRoot/ZKDTSMTokensRoot/DT_2
   [junit4]   2> 	2	/solr/security/zkdtsm/ZKDTSMRoot/ZKDTSMTokensRoot/DT_5
   [junit4]   2> 	2	/solr/security/zkdtsm/ZKDTSMRoot/ZKDTSMMasterKeyRoot/DK_4
   [junit4]   2> 	2	/solr/security/zkdtsm/ZKDTSMRoot/ZKDTSMTokensRoot/DT_4
   [junit4]   2> 	2	/solr/security/zkdtsm/ZKDTSMRoot/ZKDTSMTokensRoot/DT_13
   [junit4]   2> 	2	/solr/security/zkdtsm/ZKDTSMRoot/ZKDTSMTokensRoot/DT_12
   [junit4]   2> 	2	/solr/security/zkdtsm/ZKDTSMRoot/ZKDTSMSeqNumRoot
   [junit4]   2> 	2	/solr/security/zkdtsm/ZKDTSMRoot/ZKDTSMTokensRoot/DT_11
   [junit4]   2> 	2	/solr/security/zkdtsm/ZKDTSMRoot/ZKDTSMTokensRoot/DT_10
   [junit4]   2> 
   [junit4]   2> Maximum concurrent children watches above limit:
   [junit4]   2> 
   [junit4]   2> 	19	/solr/live_nodes
   [junit4]   2> 	19	/solr/collections
   [junit4]   2> 	2	/solr/overseer/queue
   [junit4]   2> 	2	/solr/security/zkdtsm/ZKDTSMRoot/ZKDTSMMasterKeyRoot
   [junit4]   2> 	2	/solr/overseer/queue-work
   [junit4]   2> 	2	/solr/security/zkdtsm/ZKDTSMRoot/ZKDTSMTokensRoot
   [junit4]   2> 
   [junit4]   2> 509617 INFO  (SUITE-TestSolrCloudWithDelegationTokens-seed#[FF652194F0E6FB5]-worker) [    ] o.a.s.SolrTestCaseJ4 ###deleteCore
   [junit4]   2> NOTE: leaving temporary files on disk at: /home/jenkins/workspace/Lucene-Solr-6.x-Linux/solr/build/solr-core/test/J1/temp/solr.cloud.TestSolrCloudWithDelegationTokens_FF652194F0E6FB5-001
   [junit4]   2> Dec 16, 2016 4:25:41 PM com.carrotsearch.randomizedtesting.ThreadLeakControl checkThreadLeaks
   [junit4]   2> WARNING: Will linger awaiting termination of 3 leaked thread(s).
   [junit4]   2> NOTE: test params are: codec=Lucene62, sim=RandomSimilarity(queryNorm=false,coord=yes): {}, locale=es-ES, timezone=Atlantic/Canary
   [junit4]   2> NOTE: Linux 4.4.0-53-generic amd64/Oracle Corporation 9-ea (64-bit)/cpus=12,threads=1,free=33891192,total=456130560
   [junit4]   2> NOTE: All tests run in this JVM: [TestPerFieldSimilarityClassic, DeleteNodeTest, ZkSolrClientTest, ZkCLITest, TestJettySolrRunner, IndexBasedSpellCheckerTest, MultiTermTest, IndexSchemaTest, DistributedMLTComponentTest, TestAddFieldRealTimeGet, ChaosMonkeySafeLeaderTest, ShardRoutingTest, CoreAdminCreateDiscoverTest, TestSolrIndexConfig, BasicFunctionalityTest, DistributedFacetPivotSmallAdvancedTest, TestSweetSpotSimilarityFactory, TestUpdate, CopyFieldTest, MultiThreadedOCPTest, TestExceedMaxTermLength, TestCoreContainer, HighlighterTest, TestFieldCacheSanityChecker, TestSolrQueryResponse, TestLockTree, FileUtilsTest, TestInitQParser, PKIAuthenticationIntegrationTest, TestGeoJSONResponseWriter, FullHLLTest, TestTestInjection, TestElisionMultitermQuery, TestMiniSolrCloudClusterSSL, SchemaVersionSpecificBehaviorTest, TestCloudPivotFacet, SoftAutoCommitTest, TestSchemaManager, SpellCheckCollatorTest, MoreLikeThisHandlerTest, TestSchemaVersionResource, TestRandomCollapseQParserPlugin, TestSuggestSpellingConverter, SolrIndexSplitterTest, TestFieldResource, CdcrReplicationHandlerTest, DateMathParserTest, TestHashPartitioner, TestRecoveryHdfs, VMParamsZkACLAndCredentialsProvidersTest, TestSubQueryTransformerCrossCore, TestManagedSchema, GraphQueryTest, OpenCloseCoreStressTest, TestPushWriter, ResponseHeaderTest, SpellingQueryConverterTest, SolrCmdDistributorTest, ConfigSetsAPITest, LeaderInitiatedRecoveryOnCommitTest, TestQuerySenderListener, TestBinaryResponseWriter, TestWordDelimiterFilterFactory, TestDeleteCollectionOnDownNodes, TestExactStatsCache, TestQueryUtils, CollectionReloadTest, TestFilteredDocIdSet, JsonLoaderTest, TestCursorMarkWithoutUniqueKey, HdfsTlogReplayBufferedWhileIndexingTest, TestObjectReleaseTracker, TestSolrCloudWithDelegationTokens]
   [junit4] Completed [153/662 (1!)] on J1 in 3.09s, 8 tests, 1 failure <<< FAILURES!

[...truncated 53121 lines...]


Mime
View raw message