lucene-dev mailing list archives

Site index · List index
Message view « Date » · « Thread »
Top « Date » · « Thread »
From Policeman Jenkins Server <jenk...@thetaphi.de>
Subject [JENKINS] Lucene-Solr-master-Solaris (64bit/jdk1.8.0) - Build # 1038 - Still Unstable!
Date Tue, 27 Dec 2016 22:24:45 GMT
Build: https://jenkins.thetaphi.de/job/Lucene-Solr-master-Solaris/1038/
Java: 64bit/jdk1.8.0 -XX:+UseCompressedOops -XX:+UseParallelGC

1 tests failed.
FAILED:  org.apache.solr.update.SolrCmdDistributorTest.test

Error Message:
expected:<1> but was:<0>

Stack Trace:
java.lang.AssertionError: expected:<1> but was:<0>
	at __randomizedtesting.SeedInfo.seed([AD845DDEFBD273FE:25D06204552E1E06]:0)
	at org.junit.Assert.fail(Assert.java:93)
	at org.junit.Assert.failNotEquals(Assert.java:647)
	at org.junit.Assert.assertEquals(Assert.java:128)
	at org.junit.Assert.assertEquals(Assert.java:472)
	at org.junit.Assert.assertEquals(Assert.java:456)
	at org.apache.solr.update.SolrCmdDistributorTest.test(SolrCmdDistributorTest.java:169)
	at sun.reflect.NativeMethodAccessorImpl.invoke0(Native Method)
	at sun.reflect.NativeMethodAccessorImpl.invoke(NativeMethodAccessorImpl.java:62)
	at sun.reflect.DelegatingMethodAccessorImpl.invoke(DelegatingMethodAccessorImpl.java:43)
	at java.lang.reflect.Method.invoke(Method.java:498)
	at com.carrotsearch.randomizedtesting.RandomizedRunner.invoke(RandomizedRunner.java:1713)
	at com.carrotsearch.randomizedtesting.RandomizedRunner$8.evaluate(RandomizedRunner.java:907)
	at com.carrotsearch.randomizedtesting.RandomizedRunner$9.evaluate(RandomizedRunner.java:943)
	at com.carrotsearch.randomizedtesting.RandomizedRunner$10.evaluate(RandomizedRunner.java:957)
	at org.apache.solr.BaseDistributedSearchTestCase$ShardsRepeatRule$ShardsFixedStatement.callStatement(BaseDistributedSearchTestCase.java:985)
	at org.apache.solr.BaseDistributedSearchTestCase$ShardsRepeatRule$ShardsStatement.evaluate(BaseDistributedSearchTestCase.java:960)
	at com.carrotsearch.randomizedtesting.rules.SystemPropertiesRestoreRule$1.evaluate(SystemPropertiesRestoreRule.java:57)
	at org.apache.lucene.util.TestRuleSetupTeardownChained$1.evaluate(TestRuleSetupTeardownChained.java:49)
	at org.apache.lucene.util.AbstractBeforeAfterRule$1.evaluate(AbstractBeforeAfterRule.java:45)
	at org.apache.lucene.util.TestRuleThreadAndTestName$1.evaluate(TestRuleThreadAndTestName.java:48)
	at org.apache.lucene.util.TestRuleIgnoreAfterMaxFailures$1.evaluate(TestRuleIgnoreAfterMaxFailures.java:64)
	at org.apache.lucene.util.TestRuleMarkFailure$1.evaluate(TestRuleMarkFailure.java:47)
	at com.carrotsearch.randomizedtesting.rules.StatementAdapter.evaluate(StatementAdapter.java:36)
	at com.carrotsearch.randomizedtesting.ThreadLeakControl$StatementRunner.run(ThreadLeakControl.java:367)
	at com.carrotsearch.randomizedtesting.ThreadLeakControl.forkTimeoutingTask(ThreadLeakControl.java:811)
	at com.carrotsearch.randomizedtesting.ThreadLeakControl$3.evaluate(ThreadLeakControl.java:462)
	at com.carrotsearch.randomizedtesting.RandomizedRunner.runSingleTest(RandomizedRunner.java:916)
	at com.carrotsearch.randomizedtesting.RandomizedRunner$5.evaluate(RandomizedRunner.java:802)
	at com.carrotsearch.randomizedtesting.RandomizedRunner$6.evaluate(RandomizedRunner.java:852)
	at com.carrotsearch.randomizedtesting.RandomizedRunner$7.evaluate(RandomizedRunner.java:863)
	at com.carrotsearch.randomizedtesting.rules.StatementAdapter.evaluate(StatementAdapter.java:36)
	at com.carrotsearch.randomizedtesting.rules.SystemPropertiesRestoreRule$1.evaluate(SystemPropertiesRestoreRule.java:57)
	at org.apache.lucene.util.AbstractBeforeAfterRule$1.evaluate(AbstractBeforeAfterRule.java:45)
	at com.carrotsearch.randomizedtesting.rules.StatementAdapter.evaluate(StatementAdapter.java:36)
	at org.apache.lucene.util.TestRuleStoreClassName$1.evaluate(TestRuleStoreClassName.java:41)
	at com.carrotsearch.randomizedtesting.rules.NoShadowingOrOverridesOnMethodsRule$1.evaluate(NoShadowingOrOverridesOnMethodsRule.java:40)
	at com.carrotsearch.randomizedtesting.rules.NoShadowingOrOverridesOnMethodsRule$1.evaluate(NoShadowingOrOverridesOnMethodsRule.java:40)
	at com.carrotsearch.randomizedtesting.rules.StatementAdapter.evaluate(StatementAdapter.java:36)
	at com.carrotsearch.randomizedtesting.rules.StatementAdapter.evaluate(StatementAdapter.java:36)
	at com.carrotsearch.randomizedtesting.rules.StatementAdapter.evaluate(StatementAdapter.java:36)
	at org.apache.lucene.util.TestRuleAssertionsRequired$1.evaluate(TestRuleAssertionsRequired.java:53)
	at org.apache.lucene.util.TestRuleMarkFailure$1.evaluate(TestRuleMarkFailure.java:47)
	at org.apache.lucene.util.TestRuleIgnoreAfterMaxFailures$1.evaluate(TestRuleIgnoreAfterMaxFailures.java:64)
	at org.apache.lucene.util.TestRuleIgnoreTestSuites$1.evaluate(TestRuleIgnoreTestSuites.java:54)
	at com.carrotsearch.randomizedtesting.rules.StatementAdapter.evaluate(StatementAdapter.java:36)
	at com.carrotsearch.randomizedtesting.ThreadLeakControl$StatementRunner.run(ThreadLeakControl.java:367)
	at java.lang.Thread.run(Thread.java:745)




Build Log:
[...truncated 11708 lines...]
   [junit4] Suite: org.apache.solr.update.SolrCmdDistributorTest
   [junit4]   2> Creating dataDir: /export/home/jenkins/workspace/Lucene-Solr-master-Solaris/solr/build/solr-core/test/J1/temp/solr.update.SolrCmdDistributorTest_AD845DDEFBD273FE-001/init-core-data-001
   [junit4]   2> 1432096 INFO  (SUITE-SolrCmdDistributorTest-seed#[AD845DDEFBD273FE]-worker) [    ] o.a.s.SolrTestCaseJ4 Randomized ssl (false) and clientAuth (false) via: @org.apache.solr.util.RandomizeSSL(reason=, value=NaN, ssl=NaN, clientAuth=NaN)
   [junit4]   2> 1432096 INFO  (SUITE-SolrCmdDistributorTest-seed#[AD845DDEFBD273FE]-worker) [    ] o.a.s.BaseDistributedSearchTestCase Setting hostContext system property: /
   [junit4]   2> 1432256 INFO  (TEST-SolrCmdDistributorTest.test-seed#[AD845DDEFBD273FE]) [    ] o.a.s.SolrTestCaseJ4 Writing core.properties file to /export/home/jenkins/workspace/Lucene-Solr-master-Solaris/solr/build/solr-core/test/J1/temp/solr.update.SolrCmdDistributorTest_AD845DDEFBD273FE-001/tempDir-001/control/cores/collection1
   [junit4]   2> 1432258 INFO  (TEST-SolrCmdDistributorTest.test-seed#[AD845DDEFBD273FE]) [    ] o.e.j.s.Server jetty-9.3.14.v20161028
   [junit4]   2> 1432259 INFO  (TEST-SolrCmdDistributorTest.test-seed#[AD845DDEFBD273FE]) [    ] o.e.j.s.h.ContextHandler Started o.e.j.s.ServletContextHandler@5eacdaa8{/,null,AVAILABLE}
   [junit4]   2> 1432259 INFO  (TEST-SolrCmdDistributorTest.test-seed#[AD845DDEFBD273FE]) [    ] o.e.j.s.AbstractConnector Started ServerConnector@3edc0f35{HTTP/1.1,[http/1.1]}{127.0.0.1:45468}
   [junit4]   2> 1432259 INFO  (TEST-SolrCmdDistributorTest.test-seed#[AD845DDEFBD273FE]) [    ] o.e.j.s.Server Started @1435723ms
   [junit4]   2> 1432259 INFO  (TEST-SolrCmdDistributorTest.test-seed#[AD845DDEFBD273FE]) [    ] o.a.s.c.s.e.JettySolrRunner Jetty properties: {solr.data.dir=/export/home/jenkins/workspace/Lucene-Solr-master-Solaris/solr/build/solr-core/test/J1/temp/solr.update.SolrCmdDistributorTest_AD845DDEFBD273FE-001/tempDir-001/control/data, schema=schema.xml, solrconfig=solrconfig-tlog.xml, hostContext=/, hostPort=45468, coreRootDirectory=/export/home/jenkins/workspace/Lucene-Solr-master-Solaris/solr/build/solr-core/test/J1/temp/solr.update.SolrCmdDistributorTest_AD845DDEFBD273FE-001/tempDir-001/control/cores}
   [junit4]   2> 1432260 ERROR (TEST-SolrCmdDistributorTest.test-seed#[AD845DDEFBD273FE]) [    ] o.a.s.s.StartupLoggingUtils Missing Java Option solr.log.dir. Logging may be missing or incomplete.
   [junit4]   2> 1432260 INFO  (TEST-SolrCmdDistributorTest.test-seed#[AD845DDEFBD273FE]) [    ] o.a.s.s.SolrDispatchFilter  ___      _       Welcome to Apache Solr™ version 7.0.0
   [junit4]   2> 1432260 INFO  (TEST-SolrCmdDistributorTest.test-seed#[AD845DDEFBD273FE]) [    ] o.a.s.s.SolrDispatchFilter / __| ___| |_ _   Starting in standalone mode on port null
   [junit4]   2> 1432261 INFO  (TEST-SolrCmdDistributorTest.test-seed#[AD845DDEFBD273FE]) [    ] o.a.s.s.SolrDispatchFilter \__ \/ _ \ | '_|  Install dir: null
   [junit4]   2> 1432261 INFO  (TEST-SolrCmdDistributorTest.test-seed#[AD845DDEFBD273FE]) [    ] o.a.s.s.SolrDispatchFilter |___/\___/_|_|    Start time: 2016-12-27T21:43:34.546Z
   [junit4]   2> 1432261 INFO  (TEST-SolrCmdDistributorTest.test-seed#[AD845DDEFBD273FE]) [    ] o.a.s.c.SolrXmlConfig Loading container configuration from /export/home/jenkins/workspace/Lucene-Solr-master-Solaris/solr/build/solr-core/test/J1/temp/solr.update.SolrCmdDistributorTest_AD845DDEFBD273FE-001/tempDir-001/control/solr.xml
   [junit4]   2> 1432270 INFO  (TEST-SolrCmdDistributorTest.test-seed#[AD845DDEFBD273FE]) [    ] o.a.s.c.CorePropertiesLocator Found 1 core definitions underneath /export/home/jenkins/workspace/Lucene-Solr-master-Solaris/solr/build/solr-core/test/J1/temp/solr.update.SolrCmdDistributorTest_AD845DDEFBD273FE-001/tempDir-001/control/cores
   [junit4]   2> 1432270 INFO  (TEST-SolrCmdDistributorTest.test-seed#[AD845DDEFBD273FE]) [    ] o.a.s.c.CorePropertiesLocator Cores are: [collection1]
   [junit4]   2> 1432272 INFO  (coreLoadExecutor-5975-thread-1) [    x:collection1] o.a.s.c.SolrResourceLoader [null] Added 2 libs to classloader, from paths: [/export/home/jenkins/workspace/Lucene-Solr-master-Solaris/solr/core/src/test-files/solr/collection1/lib, /export/home/jenkins/workspace/Lucene-Solr-master-Solaris/solr/core/src/test-files/solr/collection1/lib/classes]
   [junit4]   2> 1432302 INFO  (coreLoadExecutor-5975-thread-1) [    x:collection1] o.a.s.c.SolrConfig Using Lucene MatchVersion: 7.0.0
   [junit4]   2> 1432320 INFO  (coreLoadExecutor-5975-thread-1) [    x:collection1] o.a.s.s.IndexSchema [collection1] Schema name=test
   [junit4]   2> 1432386 WARN  (coreLoadExecutor-5975-thread-1) [    x:collection1] o.a.s.s.IndexSchema [collection1] default search field in schema is text. WARNING: Deprecated, please use 'df' on request instead.
   [junit4]   2> 1432387 INFO  (coreLoadExecutor-5975-thread-1) [    x:collection1] o.a.s.s.IndexSchema Loaded schema test/1.0 with uniqueid field id
   [junit4]   2> 1432394 INFO  (coreLoadExecutor-5975-thread-1) [    x:collection1] o.a.s.c.CoreContainer Creating SolrCore 'collection1' using configuration from configset /export/home/jenkins/workspace/Lucene-Solr-master-Solaris/solr/core/src/test-files/solr/collection1
   [junit4]   2> 1432394 INFO  (coreLoadExecutor-5975-thread-1) [    x:collection1] o.a.s.c.SolrCore [[collection1] ] Opening new SolrCore at [/export/home/jenkins/workspace/Lucene-Solr-master-Solaris/solr/core/src/test-files/solr/collection1], dataDir=[/export/home/jenkins/workspace/Lucene-Solr-master-Solaris/solr/build/solr-core/test/J1/temp/solr.update.SolrCmdDistributorTest_AD845DDEFBD273FE-001/tempDir-001/control/cores/collection1/data/]
   [junit4]   2> 1432394 INFO  (coreLoadExecutor-5975-thread-1) [    x:collection1] o.a.s.c.JmxMonitoredMap JMX monitoring is enabled. Adding Solr mbeans to JMX Server: com.sun.jmx.mbeanserver.JmxMBeanServer@f1944b5
   [junit4]   2> 1432403 WARN  (coreLoadExecutor-5975-thread-1) [    x:collection1] o.a.s.c.RequestHandlers INVALID paramSet a in requestHandler {type = requestHandler,name = /dump,class = DumpRequestHandler,attributes = {initParams=a, name=/dump, class=DumpRequestHandler},args = {defaults={a=A,b=B}}}
   [junit4]   2> 1432418 INFO  (coreLoadExecutor-5975-thread-1) [    x:collection1] o.a.s.u.UpdateHandler Using UpdateLog implementation: org.apache.solr.update.UpdateLog
   [junit4]   2> 1432418 INFO  (coreLoadExecutor-5975-thread-1) [    x:collection1] o.a.s.u.UpdateLog Initializing UpdateLog: dataDir= defaultSyncLevel=FLUSH numRecordsToKeep=100 maxNumLogsToKeep=10 numVersionBuckets=65536
   [junit4]   2> 1432419 INFO  (coreLoadExecutor-5975-thread-1) [    x:collection1] o.a.s.u.CommitTracker Hard AutoCommit: disabled
   [junit4]   2> 1432419 INFO  (coreLoadExecutor-5975-thread-1) [    x:collection1] o.a.s.u.CommitTracker Soft AutoCommit: disabled
   [junit4]   2> 1432420 INFO  (coreLoadExecutor-5975-thread-1) [    x:collection1] o.a.s.s.SolrIndexSearcher Opening [Searcher@2d314de2[collection1] main]
   [junit4]   2> 1432420 WARN  (coreLoadExecutor-5975-thread-1) [    x:collection1] o.a.s.r.ManagedResourceStorage Cannot write to config directory /export/home/jenkins/workspace/Lucene-Solr-master-Solaris/solr/core/src/test-files/solr/collection1/conf; switching to use InMemory storage instead.
   [junit4]   2> 1432420 INFO  (coreLoadExecutor-5975-thread-1) [    x:collection1] o.a.s.h.ReplicationHandler Commits will be reserved for  10000
   [junit4]   2> 1432420 INFO  (coreLoadExecutor-5975-thread-1) [    x:collection1] o.a.s.u.UpdateLog Could not find max version in index or recent updates, using new clock 1554907151419310080
   [junit4]   2> 1432424 INFO  (searcherExecutor-5976-thread-1-processing-x:collection1) [    x:collection1] o.a.s.c.SolrCore [collection1] Registered new searcher Searcher@2d314de2[collection1] main{ExitableDirectoryReader(UninvertingDirectoryReader())}
   [junit4]   2> 1433221 INFO  (TEST-SolrCmdDistributorTest.test-seed#[AD845DDEFBD273FE]) [    ] o.a.s.SolrTestCaseJ4 Writing core.properties file to /export/home/jenkins/workspace/Lucene-Solr-master-Solaris/solr/build/solr-core/test/J1/temp/solr.update.SolrCmdDistributorTest_AD845DDEFBD273FE-001/tempDir-001/shard0/cores/collection1
   [junit4]   2> 1433224 INFO  (TEST-SolrCmdDistributorTest.test-seed#[AD845DDEFBD273FE]) [    ] o.e.j.s.Server jetty-9.3.14.v20161028
   [junit4]   2> 1433226 INFO  (TEST-SolrCmdDistributorTest.test-seed#[AD845DDEFBD273FE]) [    ] o.e.j.s.h.ContextHandler Started o.e.j.s.ServletContextHandler@253fa4f8{/,null,AVAILABLE}
   [junit4]   2> 1433226 INFO  (TEST-SolrCmdDistributorTest.test-seed#[AD845DDEFBD273FE]) [    ] o.e.j.s.AbstractConnector Started ServerConnector@50a9f2db{HTTP/1.1,[http/1.1]}{127.0.0.1:54268}
   [junit4]   2> 1433227 INFO  (TEST-SolrCmdDistributorTest.test-seed#[AD845DDEFBD273FE]) [    ] o.e.j.s.Server Started @1436691ms
   [junit4]   2> 1433227 INFO  (TEST-SolrCmdDistributorTest.test-seed#[AD845DDEFBD273FE]) [    ] o.a.s.c.s.e.JettySolrRunner Jetty properties: {solr.data.dir=/export/home/jenkins/workspace/Lucene-Solr-master-Solaris/solr/build/solr-core/test/J1/temp/solr.update.SolrCmdDistributorTest_AD845DDEFBD273FE-001/tempDir-001/shard0/data, schema=schema.xml, solrconfig=solrconfig-tlog.xml, hostContext=/, hostPort=54268, coreRootDirectory=/export/home/jenkins/workspace/Lucene-Solr-master-Solaris/solr/build/solr-core/test/J1/temp/solr.update.SolrCmdDistributorTest_AD845DDEFBD273FE-001/tempDir-001/shard0/cores}
   [junit4]   2> 1433227 ERROR (TEST-SolrCmdDistributorTest.test-seed#[AD845DDEFBD273FE]) [    ] o.a.s.s.StartupLoggingUtils Missing Java Option solr.log.dir. Logging may be missing or incomplete.
   [junit4]   2> 1433228 INFO  (TEST-SolrCmdDistributorTest.test-seed#[AD845DDEFBD273FE]) [    ] o.a.s.s.SolrDispatchFilter  ___      _       Welcome to Apache Solr™ version 7.0.0
   [junit4]   2> 1433228 INFO  (TEST-SolrCmdDistributorTest.test-seed#[AD845DDEFBD273FE]) [    ] o.a.s.s.SolrDispatchFilter / __| ___| |_ _   Starting in standalone mode on port null
   [junit4]   2> 1433228 INFO  (TEST-SolrCmdDistributorTest.test-seed#[AD845DDEFBD273FE]) [    ] o.a.s.s.SolrDispatchFilter \__ \/ _ \ | '_|  Install dir: null
   [junit4]   2> 1433228 INFO  (TEST-SolrCmdDistributorTest.test-seed#[AD845DDEFBD273FE]) [    ] o.a.s.s.SolrDispatchFilter |___/\___/_|_|    Start time: 2016-12-27T21:43:35.513Z
   [junit4]   2> 1433228 INFO  (TEST-SolrCmdDistributorTest.test-seed#[AD845DDEFBD273FE]) [    ] o.a.s.c.SolrXmlConfig Loading container configuration from /export/home/jenkins/workspace/Lucene-Solr-master-Solaris/solr/build/solr-core/test/J1/temp/solr.update.SolrCmdDistributorTest_AD845DDEFBD273FE-001/tempDir-001/shard0/solr.xml
   [junit4]   2> 1433243 INFO  (TEST-SolrCmdDistributorTest.test-seed#[AD845DDEFBD273FE]) [    ] o.a.s.c.CorePropertiesLocator Found 1 core definitions underneath /export/home/jenkins/workspace/Lucene-Solr-master-Solaris/solr/build/solr-core/test/J1/temp/solr.update.SolrCmdDistributorTest_AD845DDEFBD273FE-001/tempDir-001/shard0/cores
   [junit4]   2> 1433243 INFO  (TEST-SolrCmdDistributorTest.test-seed#[AD845DDEFBD273FE]) [    ] o.a.s.c.CorePropertiesLocator Cores are: [collection1]
   [junit4]   2> 1433245 INFO  (coreLoadExecutor-5986-thread-1) [    x:collection1] o.a.s.c.SolrResourceLoader [null] Added 2 libs to classloader, from paths: [/export/home/jenkins/workspace/Lucene-Solr-master-Solaris/solr/core/src/test-files/solr/collection1/lib, /export/home/jenkins/workspace/Lucene-Solr-master-Solaris/solr/core/src/test-files/solr/collection1/lib/classes]
   [junit4]   2> 1433279 INFO  (coreLoadExecutor-5986-thread-1) [    x:collection1] o.a.s.c.SolrConfig Using Lucene MatchVersion: 7.0.0
   [junit4]   2> 1433288 INFO  (coreLoadExecutor-5986-thread-1) [    x:collection1] o.a.s.s.IndexSchema [collection1] Schema name=test
   [junit4]   2> 1433374 WARN  (coreLoadExecutor-5986-thread-1) [    x:collection1] o.a.s.s.IndexSchema [collection1] default search field in schema is text. WARNING: Deprecated, please use 'df' on request instead.
   [junit4]   2> 1433376 INFO  (coreLoadExecutor-5986-thread-1) [    x:collection1] o.a.s.s.IndexSchema Loaded schema test/1.0 with uniqueid field id
   [junit4]   2> 1433382 INFO  (coreLoadExecutor-5986-thread-1) [    x:collection1] o.a.s.c.CoreContainer Creating SolrCore 'collection1' using configuration from configset /export/home/jenkins/workspace/Lucene-Solr-master-Solaris/solr/core/src/test-files/solr/collection1
   [junit4]   2> 1433382 INFO  (coreLoadExecutor-5986-thread-1) [    x:collection1] o.a.s.c.SolrCore [[collection1] ] Opening new SolrCore at [/export/home/jenkins/workspace/Lucene-Solr-master-Solaris/solr/core/src/test-files/solr/collection1], dataDir=[/export/home/jenkins/workspace/Lucene-Solr-master-Solaris/solr/build/solr-core/test/J1/temp/solr.update.SolrCmdDistributorTest_AD845DDEFBD273FE-001/tempDir-001/shard0/cores/collection1/data/]
   [junit4]   2> 1433383 INFO  (coreLoadExecutor-5986-thread-1) [    x:collection1] o.a.s.c.JmxMonitoredMap JMX monitoring is enabled. Adding Solr mbeans to JMX Server: com.sun.jmx.mbeanserver.JmxMBeanServer@f1944b5
   [junit4]   2> 1433391 WARN  (coreLoadExecutor-5986-thread-1) [    x:collection1] o.a.s.c.RequestHandlers INVALID paramSet a in requestHandler {type = requestHandler,name = /dump,class = DumpRequestHandler,attributes = {initParams=a, name=/dump, class=DumpRequestHandler},args = {defaults={a=A,b=B}}}
   [junit4]   2> 1433403 INFO  (coreLoadExecutor-5986-thread-1) [    x:collection1] o.a.s.u.UpdateHandler Using UpdateLog implementation: org.apache.solr.update.UpdateLog
   [junit4]   2> 1433403 INFO  (coreLoadExecutor-5986-thread-1) [    x:collection1] o.a.s.u.UpdateLog Initializing UpdateLog: dataDir= defaultSyncLevel=FLUSH numRecordsToKeep=100 maxNumLogsToKeep=10 numVersionBuckets=65536
   [junit4]   2> 1433404 INFO  (coreLoadExecutor-5986-thread-1) [    x:collection1] o.a.s.u.CommitTracker Hard AutoCommit: disabled
   [junit4]   2> 1433404 INFO  (coreLoadExecutor-5986-thread-1) [    x:collection1] o.a.s.u.CommitTracker Soft AutoCommit: disabled
   [junit4]   2> 1433404 INFO  (coreLoadExecutor-5986-thread-1) [    x:collection1] o.a.s.s.SolrIndexSearcher Opening [Searcher@3311ba90[collection1] main]
   [junit4]   2> 1433405 WARN  (coreLoadExecutor-5986-thread-1) [    x:collection1] o.a.s.r.ManagedResourceStorage Cannot write to config directory /export/home/jenkins/workspace/Lucene-Solr-master-Solaris/solr/core/src/test-files/solr/collection1/conf; switching to use InMemory storage instead.
   [junit4]   2> 1433405 INFO  (coreLoadExecutor-5986-thread-1) [    x:collection1] o.a.s.h.ReplicationHandler Commits will be reserved for  10000
   [junit4]   2> 1433406 INFO  (searcherExecutor-5987-thread-1-processing-x:collection1) [    x:collection1] o.a.s.c.SolrCore [collection1] Registered new searcher Searcher@3311ba90[collection1] main{ExitableDirectoryReader(UninvertingDirectoryReader())}
   [junit4]   2> 1433406 INFO  (coreLoadExecutor-5986-thread-1) [    x:collection1] o.a.s.u.UpdateLog Could not find max version in index or recent updates, using new clock 1554907152453206016
   [junit4]   2> 1434263 INFO  (TEST-SolrCmdDistributorTest.test-seed#[AD845DDEFBD273FE]) [    ] o.a.s.SolrTestCaseJ4 Writing core.properties file to /export/home/jenkins/workspace/Lucene-Solr-master-Solaris/solr/build/solr-core/test/J1/temp/solr.update.SolrCmdDistributorTest_AD845DDEFBD273FE-001/tempDir-001/shard1/cores/collection1
   [junit4]   2> 1434264 INFO  (TEST-SolrCmdDistributorTest.test-seed#[AD845DDEFBD273FE]) [    ] o.e.j.s.Server jetty-9.3.14.v20161028
   [junit4]   2> 1434265 INFO  (TEST-SolrCmdDistributorTest.test-seed#[AD845DDEFBD273FE]) [    ] o.e.j.s.h.ContextHandler Started o.e.j.s.ServletContextHandler@fc8815c{/,null,AVAILABLE}
   [junit4]   2> 1434266 INFO  (TEST-SolrCmdDistributorTest.test-seed#[AD845DDEFBD273FE]) [    ] o.e.j.s.AbstractConnector Started ServerConnector@31a41e51{HTTP/1.1,[http/1.1]}{127.0.0.1:63250}
   [junit4]   2> 1434266 INFO  (TEST-SolrCmdDistributorTest.test-seed#[AD845DDEFBD273FE]) [    ] o.e.j.s.Server Started @1437731ms
   [junit4]   2> 1434266 INFO  (TEST-SolrCmdDistributorTest.test-seed#[AD845DDEFBD273FE]) [    ] o.a.s.c.s.e.JettySolrRunner Jetty properties: {solr.data.dir=/export/home/jenkins/workspace/Lucene-Solr-master-Solaris/solr/build/solr-core/test/J1/temp/solr.update.SolrCmdDistributorTest_AD845DDEFBD273FE-001/tempDir-001/shard1/data, schema=schema.xml, solrconfig=solrconfig-tlog.xml, hostContext=/, hostPort=63250, coreRootDirectory=/export/home/jenkins/workspace/Lucene-Solr-master-Solaris/solr/build/solr-core/test/J1/temp/solr.update.SolrCmdDistributorTest_AD845DDEFBD273FE-001/tempDir-001/shard1/cores}
   [junit4]   2> 1434266 ERROR (TEST-SolrCmdDistributorTest.test-seed#[AD845DDEFBD273FE]) [    ] o.a.s.s.StartupLoggingUtils Missing Java Option solr.log.dir. Logging may be missing or incomplete.
   [junit4]   2> 1434266 INFO  (TEST-SolrCmdDistributorTest.test-seed#[AD845DDEFBD273FE]) [    ] o.a.s.s.SolrDispatchFilter  ___      _       Welcome to Apache Solr™ version 7.0.0
   [junit4]   2> 1434266 INFO  (TEST-SolrCmdDistributorTest.test-seed#[AD845DDEFBD273FE]) [    ] o.a.s.s.SolrDispatchFilter / __| ___| |_ _   Starting in standalone mode on port null
   [junit4]   2> 1434266 INFO  (TEST-SolrCmdDistributorTest.test-seed#[AD845DDEFBD273FE]) [    ] o.a.s.s.SolrDispatchFilter \__ \/ _ \ | '_|  Install dir: null
   [junit4]   2> 1434266 INFO  (TEST-SolrCmdDistributorTest.test-seed#[AD845DDEFBD273FE]) [    ] o.a.s.s.SolrDispatchFilter |___/\___/_|_|    Start time: 2016-12-27T21:43:36.551Z
   [junit4]   2> 1434267 INFO  (TEST-SolrCmdDistributorTest.test-seed#[AD845DDEFBD273FE]) [    ] o.a.s.c.SolrXmlConfig Loading container configuration from /export/home/jenkins/workspace/Lucene-Solr-master-Solaris/solr/build/solr-core/test/J1/temp/solr.update.SolrCmdDistributorTest_AD845DDEFBD273FE-001/tempDir-001/shard1/solr.xml
   [junit4]   2> 1434277 INFO  (TEST-SolrCmdDistributorTest.test-seed#[AD845DDEFBD273FE]) [    ] o.a.s.c.CorePropertiesLocator Found 1 core definitions underneath /export/home/jenkins/workspace/Lucene-Solr-master-Solaris/solr/build/solr-core/test/J1/temp/solr.update.SolrCmdDistributorTest_AD845DDEFBD273FE-001/tempDir-001/shard1/cores
   [junit4]   2> 1434277 INFO  (TEST-SolrCmdDistributorTest.test-seed#[AD845DDEFBD273FE]) [    ] o.a.s.c.CorePropertiesLocator Cores are: [collection1]
   [junit4]   2> 1434278 INFO  (coreLoadExecutor-5997-thread-1) [    x:collection1] o.a.s.c.SolrResourceLoader [null] Added 2 libs to classloader, from paths: [/export/home/jenkins/workspace/Lucene-Solr-master-Solaris/solr/core/src/test-files/solr/collection1/lib, /export/home/jenkins/workspace/Lucene-Solr-master-Solaris/solr/core/src/test-files/solr/collection1/lib/classes]
   [junit4]   2> 1434310 INFO  (coreLoadExecutor-5997-thread-1) [    x:collection1] o.a.s.c.SolrConfig Using Lucene MatchVersion: 7.0.0
   [junit4]   2> 1434319 INFO  (coreLoadExecutor-5997-thread-1) [    x:collection1] o.a.s.s.IndexSchema [collection1] Schema name=test
   [junit4]   2> 1434395 WARN  (coreLoadExecutor-5997-thread-1) [    x:collection1] o.a.s.s.IndexSchema [collection1] default search field in schema is text. WARNING: Deprecated, please use 'df' on request instead.
   [junit4]   2> 1434397 INFO  (coreLoadExecutor-5997-thread-1) [    x:collection1] o.a.s.s.IndexSchema Loaded schema test/1.0 with uniqueid field id
   [junit4]   2> 1434404 INFO  (coreLoadExecutor-5997-thread-1) [    x:collection1] o.a.s.c.CoreContainer Creating SolrCore 'collection1' using configuration from configset /export/home/jenkins/workspace/Lucene-Solr-master-Solaris/solr/core/src/test-files/solr/collection1
   [junit4]   2> 1434405 INFO  (coreLoadExecutor-5997-thread-1) [    x:collection1] o.a.s.c.SolrCore [[collection1] ] Opening new SolrCore at [/export/home/jenkins/workspace/Lucene-Solr-master-Solaris/solr/core/src/test-files/solr/collection1], dataDir=[/export/home/jenkins/workspace/Lucene-Solr-master-Solaris/solr/build/solr-core/test/J1/temp/solr.update.SolrCmdDistributorTest_AD845DDEFBD273FE-001/tempDir-001/shard1/cores/collection1/data/]
   [junit4]   2> 1434405 INFO  (coreLoadExecutor-5997-thread-1) [    x:collection1] o.a.s.c.JmxMonitoredMap JMX monitoring is enabled. Adding Solr mbeans to JMX Server: com.sun.jmx.mbeanserver.JmxMBeanServer@f1944b5
   [junit4]   2> 1434414 WARN  (coreLoadExecutor-5997-thread-1) [    x:collection1] o.a.s.c.RequestHandlers INVALID paramSet a in requestHandler {type = requestHandler,name = /dump,class = DumpRequestHandler,attributes = {initParams=a, name=/dump, class=DumpRequestHandler},args = {defaults={a=A,b=B}}}
   [junit4]   2> 1434427 INFO  (coreLoadExecutor-5997-thread-1) [    x:collection1] o.a.s.u.UpdateHandler Using UpdateLog implementation: org.apache.solr.update.UpdateLog
   [junit4]   2> 1434427 INFO  (coreLoadExecutor-5997-thread-1) [    x:collection1] o.a.s.u.UpdateLog Initializing UpdateLog: dataDir= defaultSyncLevel=FLUSH numRecordsToKeep=100 maxNumLogsToKeep=10 numVersionBuckets=65536
   [junit4]   2> 1434427 INFO  (coreLoadExecutor-5997-thread-1) [    x:collection1] o.a.s.u.CommitTracker Hard AutoCommit: disabled
   [junit4]   2> 1434427 INFO  (coreLoadExecutor-5997-thread-1) [    x:collection1] o.a.s.u.CommitTracker Soft AutoCommit: disabled
   [junit4]   2> 1434428 INFO  (coreLoadExecutor-5997-thread-1) [    x:collection1] o.a.s.s.SolrIndexSearcher Opening [Searcher@74b97488[collection1] main]
   [junit4]   2> 1434428 WARN  (coreLoadExecutor-5997-thread-1) [    x:collection1] o.a.s.r.ManagedResourceStorage Cannot write to config directory /export/home/jenkins/workspace/Lucene-Solr-master-Solaris/solr/core/src/test-files/solr/collection1/conf; switching to use InMemory storage instead.
   [junit4]   2> 1434428 INFO  (coreLoadExecutor-5997-thread-1) [    x:collection1] o.a.s.h.ReplicationHandler Commits will be reserved for  10000
   [junit4]   2> 1434428 INFO  (coreLoadExecutor-5997-thread-1) [    x:collection1] o.a.s.u.UpdateLog Could not find max version in index or recent updates, using new clock 1554907153524850688
   [junit4]   2> 1434432 INFO  (searcherExecutor-5998-thread-1-processing-x:collection1) [    x:collection1] o.a.s.c.SolrCore [collection1] Registered new searcher Searcher@74b97488[collection1] main{ExitableDirectoryReader(UninvertingDirectoryReader())}
   [junit4]   2> 1435190 INFO  (TEST-SolrCmdDistributorTest.test-seed#[AD845DDEFBD273FE]) [    ] o.a.s.SolrTestCaseJ4 Writing core.properties file to /export/home/jenkins/workspace/Lucene-Solr-master-Solaris/solr/build/solr-core/test/J1/temp/solr.update.SolrCmdDistributorTest_AD845DDEFBD273FE-001/tempDir-001/shard2/cores/collection1
   [junit4]   2> 1435191 INFO  (TEST-SolrCmdDistributorTest.test-seed#[AD845DDEFBD273FE]) [    ] o.e.j.s.Server jetty-9.3.14.v20161028
   [junit4]   2> 1435193 INFO  (TEST-SolrCmdDistributorTest.test-seed#[AD845DDEFBD273FE]) [    ] o.e.j.s.h.ContextHandler Started o.e.j.s.ServletContextHandler@3bcc8436{/,null,AVAILABLE}
   [junit4]   2> 1435193 INFO  (TEST-SolrCmdDistributorTest.test-seed#[AD845DDEFBD273FE]) [    ] o.e.j.s.AbstractConnector Started ServerConnector@60a82443{HTTP/1.1,[http/1.1]}{127.0.0.1:54027}
   [junit4]   2> 1435193 INFO  (TEST-SolrCmdDistributorTest.test-seed#[AD845DDEFBD273FE]) [    ] o.e.j.s.Server Started @1438659ms
   [junit4]   2> 1435193 INFO  (TEST-SolrCmdDistributorTest.test-seed#[AD845DDEFBD273FE]) [    ] o.a.s.c.s.e.JettySolrRunner Jetty properties: {solr.data.dir=/export/home/jenkins/workspace/Lucene-Solr-master-Solaris/solr/build/solr-core/test/J1/temp/solr.update.SolrCmdDistributorTest_AD845DDEFBD273FE-001/tempDir-001/shard2/data, schema=schema.xml, solrconfig=solrconfig-tlog.xml, hostContext=/, hostPort=54027, coreRootDirectory=/export/home/jenkins/workspace/Lucene-Solr-master-Solaris/solr/build/solr-core/test/J1/temp/solr.update.SolrCmdDistributorTest_AD845DDEFBD273FE-001/tempDir-001/shard2/cores}
   [junit4]   2> 1435193 ERROR (TEST-SolrCmdDistributorTest.test-seed#[AD845DDEFBD273FE]) [    ] o.a.s.s.StartupLoggingUtils Missing Java Option solr.log.dir. Logging may be missing or incomplete.
   [junit4]   2> 1435194 INFO  (TEST-SolrCmdDistributorTest.test-seed#[AD845DDEFBD273FE]) [    ] o.a.s.s.SolrDispatchFilter  ___      _       Welcome to Apache Solr™ version 7.0.0
   [junit4]   2> 1435195 INFO  (TEST-SolrCmdDistributorTest.test-seed#[AD845DDEFBD273FE]) [    ] o.a.s.s.SolrDispatchFilter / __| ___| |_ _   Starting in standalone mode on port null
   [junit4]   2> 1435195 INFO  (TEST-SolrCmdDistributorTest.test-seed#[AD845DDEFBD273FE]) [    ] o.a.s.s.SolrDispatchFilter \__ \/ _ \ | '_|  Install dir: null
   [junit4]   2> 1435195 INFO  (TEST-SolrCmdDistributorTest.test-seed#[AD845DDEFBD273FE]) [    ] o.a.s.s.SolrDispatchFilter |___/\___/_|_|    Start time: 2016-12-27T21:43:37.480Z
   [junit4]   2> 1435195 INFO  (TEST-SolrCmdDistributorTest.test-seed#[AD845DDEFBD273FE]) [    ] o.a.s.c.SolrXmlConfig Loading container configuration from /export/home/jenkins/workspace/Lucene-Solr-master-Solaris/solr/build/solr-core/test/J1/temp/solr.update.SolrCmdDistributorTest_AD845DDEFBD273FE-001/tempDir-001/shard2/solr.xml
   [junit4]   2> 1435204 INFO  (TEST-SolrCmdDistributorTest.test-seed#[AD845DDEFBD273FE]) [    ] o.a.s.c.CorePropertiesLocator Found 1 core definitions underneath /export/home/jenkins/workspace/Lucene-Solr-master-Solaris/solr/build/solr-core/test/J1/temp/solr.update.SolrCmdDistributorTest_AD845DDEFBD273FE-001/tempDir-001/shard2/cores
   [junit4]   2> 1435204 INFO  (TEST-SolrCmdDistributorTest.test-seed#[AD845DDEFBD273FE]) [    ] o.a.s.c.CorePropertiesLocator Cores are: [collection1]
   [junit4]   2> 1435205 INFO  (coreLoadExecutor-6008-thread-1) [    x:collection1] o.a.s.c.SolrResourceLoader [null] Added 2 libs to classloader, from paths: [/export/home/jenkins/workspace/Lucene-Solr-master-Solaris/solr/core/src/test-files/solr/collection1/lib, /export/home/jenkins/workspace/Lucene-Solr-master-Solaris/solr/core/src/test-files/solr/collection1/lib/classes]
   [junit4]   2> 1435229 INFO  (coreLoadExecutor-6008-thread-1) [    x:collection1] o.a.s.c.SolrConfig Using Lucene MatchVersion: 7.0.0
   [junit4]   2> 1435248 INFO  (coreLoadExecutor-6008-thread-1) [    x:collection1] o.a.s.s.IndexSchema [collection1] Schema name=test
   [junit4]   2> 1435311 WARN  (coreLoadExecutor-6008-thread-1) [    x:collection1] o.a.s.s.IndexSchema [collection1] default search field in schema is text. WARNING: Deprecated, please use 'df' on request instead.
   [junit4]   2> 1435313 INFO  (coreLoadExecutor-6008-thread-1) [    x:collection1] o.a.s.s.IndexSchema Loaded schema test/1.0 with uniqueid field id
   [junit4]   2> 1435319 INFO  (coreLoadExecutor-6008-thread-1) [    x:collection1] o.a.s.c.CoreContainer Creating SolrCore 'collection1' using configuration from configset /export/home/jenkins/workspace/Lucene-Solr-master-Solaris/solr/core/src/test-files/solr/collection1
   [junit4]   2> 1435319 INFO  (coreLoadExecutor-6008-thread-1) [    x:collection1] o.a.s.c.SolrCore [[collection1] ] Opening new SolrCore at [/export/home/jenkins/workspace/Lucene-Solr-master-Solaris/solr/core/src/test-files/solr/collection1], dataDir=[/export/home/jenkins/workspace/Lucene-Solr-master-Solaris/solr/build/solr-core/test/J1/temp/solr.update.SolrCmdDistributorTest_AD845DDEFBD273FE-001/tempDir-001/shard2/cores/collection1/data/]
   [junit4]   2> 1435320 INFO  (coreLoadExecutor-6008-thread-1) [    x:collection1] o.a.s.c.JmxMonitoredMap JMX monitoring is enabled. Adding Solr mbeans to JMX Server: com.sun.jmx.mbeanserver.JmxMBeanServer@f1944b5
   [junit4]   2> 1435328 WARN  (coreLoadExecutor-6008-thread-1) [    x:collection1] o.a.s.c.RequestHandlers INVALID paramSet a in requestHandler {type = requestHandler,name = /dump,class = DumpRequestHandler,attributes = {initParams=a, name=/dump, class=DumpRequestHandler},args = {defaults={a=A,b=B}}}
   [junit4]   2> 1435341 INFO  (coreLoadExecutor-6008-thread-1) [    x:collection1] o.a.s.u.UpdateHandler Using UpdateLog implementation: org.apache.solr.update.UpdateLog
   [junit4]   2> 1435341 INFO  (coreLoadExecutor-6008-thread-1) [    x:collection1] o.a.s.u.UpdateLog Initializing UpdateLog: dataDir= defaultSyncLevel=FLUSH numRecordsToKeep=100 maxNumLogsToKeep=10 numVersionBuckets=65536
   [junit4]   2> 1435342 INFO  (coreLoadExecutor-6008-thread-1) [    x:collection1] o.a.s.u.CommitTracker Hard AutoCommit: disabled
   [junit4]   2> 1435342 INFO  (coreLoadExecutor-6008-thread-1) [    x:collection1] o.a.s.u.CommitTracker Soft AutoCommit: disabled
   [junit4]   2> 1435342 INFO  (coreLoadExecutor-6008-thread-1) [    x:collection1] o.a.s.s.SolrIndexSearcher Opening [Searcher@6e323dc5[collection1] main]
   [junit4]   2> 1435342 WARN  (coreLoadExecutor-6008-thread-1) [    x:collection1] o.a.s.r.ManagedResourceStorage Cannot write to config directory /export/home/jenkins/workspace/Lucene-Solr-master-Solaris/solr/core/src/test-files/solr/collection1/conf; switching to use InMemory storage instead.
   [junit4]   2> 1435343 INFO  (coreLoadExecutor-6008-thread-1) [    x:collection1] o.a.s.h.ReplicationHandler Commits will be reserved for  10000
   [junit4]   2> 1435343 INFO  (coreLoadExecutor-6008-thread-1) [    x:collection1] o.a.s.u.UpdateLog Could not find max version in index or recent updates, using new clock 1554907154484297728
   [junit4]   2> 1435346 INFO  (searcherExecutor-6009-thread-1-processing-x:collection1) [    x:collection1] o.a.s.c.SolrCore [collection1] Registered new searcher Searcher@6e323dc5[collection1] main{ExitableDirectoryReader(UninvertingDirectoryReader())}
   [junit4]   2> 1436133 INFO  (TEST-SolrCmdDistributorTest.test-seed#[AD845DDEFBD273FE]) [    ] o.a.s.SolrTestCaseJ4 Writing core.properties file to /export/home/jenkins/workspace/Lucene-Solr-master-Solaris/solr/build/solr-core/test/J1/temp/solr.update.SolrCmdDistributorTest_AD845DDEFBD273FE-001/tempDir-001/shard3/cores/collection1
   [junit4]   2> 1436134 INFO  (TEST-SolrCmdDistributorTest.test-seed#[AD845DDEFBD273FE]) [    ] o.e.j.s.Server jetty-9.3.14.v20161028
   [junit4]   2> 1436136 INFO  (TEST-SolrCmdDistributorTest.test-seed#[AD845DDEFBD273FE]) [    ] o.e.j.s.h.ContextHandler Started o.e.j.s.ServletContextHandler@1ff9c9e9{/,null,AVAILABLE}
   [junit4]   2> 1436136 INFO  (TEST-SolrCmdDistributorTest.test-seed#[AD845DDEFBD273FE]) [    ] o.e.j.s.AbstractConnector Started ServerConnector@6e7d8838{HTTP/1.1,[http/1.1]}{127.0.0.1:54741}
   [junit4]   2> 1436136 INFO  (TEST-SolrCmdDistributorTest.test-seed#[AD845DDEFBD273FE]) [    ] o.e.j.s.Server Started @1439602ms
   [junit4]   2> 1436136 INFO  (TEST-SolrCmdDistributorTest.test-seed#[AD845DDEFBD273FE]) [    ] o.a.s.c.s.e.JettySolrRunner Jetty properties: {solr.data.dir=/export/home/jenkins/workspace/Lucene-Solr-master-Solaris/solr/build/solr-core/test/J1/temp/solr.update.SolrCmdDistributorTest_AD845DDEFBD273FE-001/tempDir-001/shard3/data, schema=schema.xml, solrconfig=solrconfig-tlog.xml, hostContext=/, hostPort=54741, coreRootDirectory=/export/home/jenkins/workspace/Lucene-Solr-master-Solaris/solr/build/solr-core/test/J1/temp/solr.update.SolrCmdDistributorTest_AD845DDEFBD273FE-001/tempDir-001/shard3/cores}
   [junit4]   2> 1436136 ERROR (TEST-SolrCmdDistributorTest.test-seed#[AD845DDEFBD273FE]) [    ] o.a.s.s.StartupLoggingUtils Missing Java Option solr.log.dir. Logging may be missing or incomplete.
   [junit4]   2> 1436136 INFO  (TEST-SolrCmdDistributorTest.test-seed#[AD845DDEFBD273FE]) [    ] o.a.s.s.SolrDispatchFilter  ___      _       Welcome to Apache Solr™ version 7.0.0
   [junit4]   2> 1436137 INFO  (TEST-SolrCmdDistributorTest.test-seed#[AD845DDEFBD273FE]) [    ] o.a.s.s.SolrDispatchFilter / __| ___| |_ _   Starting in standalone mode on port null
   [junit4]   2> 1436137 INFO  (TEST-SolrCmdDistributorTest.test-seed#[AD845DDEFBD273FE]) [    ] o.a.s.s.SolrDispatchFilter \__ \/ _ \ | '_|  Install dir: null
   [junit4]   2> 1436137 INFO  (TEST-SolrCmdDistributorTest.test-seed#[AD845DDEFBD273FE]) [    ] o.a.s.s.SolrDispatchFilter |___/\___/_|_|    Start time: 2016-12-27T21:43:38.422Z
   [junit4]   2> 1436138 INFO  (TEST-SolrCmdDistributorTest.test-seed#[AD845DDEFBD273FE]) [    ] o.a.s.c.SolrXmlConfig Loading container configuration from /export/home/jenkins/workspace/Lucene-Solr-master-Solaris/solr/build/solr-core/test/J1/temp/solr.update.SolrCmdDistributorTest_AD845DDEFBD273FE-001/tempDir-001/shard3/solr.xml
   [junit4]   2> 1436147 INFO  (TEST-SolrCmdDistributorTest.test-seed#[AD845DDEFBD273FE]) [    ] o.a.s.c.CorePropertiesLocator Found 1 core definitions underneath /export/home/jenkins/workspace/Lucene-Solr-master-Solaris/solr/build/solr-core/test/J1/temp/solr.update.SolrCmdDistributorTest_AD845DDEFBD273FE-001/tempDir-001/shard3/cores
   [junit4]   2> 1436147 INFO  (TEST-SolrCmdDistributorTest.test-seed#[AD845DDEFBD273FE]) [    ] o.a.s.c.CorePropertiesLocator Cores are: [collection1]
   [junit4]   2> 1436149 INFO  (coreLoadExecutor-6019-thread-1) [    x:collection1] o.a.s.c.SolrResourceLoader [null] Added 2 libs to classloader, from paths: [/export/home/jenkins/workspace/Lucene-Solr-master-Solaris/solr/core/src/test-files/solr/collection1/lib, /export/home/jenkins/workspace/Lucene-Solr-master-Solaris/solr/core/src/test-files/solr/collection1/lib/classes]
   [junit4]   2> 1436176 INFO  (coreLoadExecutor-6019-thread-1) [    x:collection1] o.a.s.c.SolrConfig Using Lucene MatchVersion: 7.0.0
   [junit4]   2> 1436186 INFO  (coreLoadExecutor-6019-thread-1) [    x:collection1] o.a.s.s.IndexSchema [collection1] Schema name=test
   [junit4]   2> 1436265 WARN  (coreLoadExecutor-6019-thread-1) [    x:collection1] o.a.s.s.IndexSchema [collection1] default search field in schema is text. WARNING: Deprecated, please use 'df' on request instead.
   [junit4]   2> 1436266 INFO  (coreLoadExecutor-6019-thread-1) [    x:collection1] o.a.s.s.IndexSchema Loaded schema test/1.0 with uniqueid field id
   [junit4]   2> 1436273 INFO  (coreLoadExecutor-6019-thread-1) [    x:collection1] o.a.s.c.CoreContainer Creating SolrCore 'collection1' using configuration from configset /export/home/jenkins/workspace/Lucene-Solr-master-Solaris/solr/core/src/test-files/solr/collection1
   [junit4]   2> 1436273 INFO  (coreLoadExecutor-6019-thread-1) [    x:collection1] o.a.s.c.SolrCore [[collection1] ] Opening new SolrCore at [/export/home/jenkins/workspace/Lucene-Solr-master-Solaris/solr/core/src/test-files/solr/collection1], dataDir=[/export/home/jenkins/workspace/Lucene-Solr-master-Solaris/solr/build/solr-core/test/J1/temp/solr.update.SolrCmdDistributorTest_AD845DDEFBD273FE-001/tempDir-001/shard3/cores/collection1/data/]
   [junit4]   2> 1436273 INFO  (coreLoadExecutor-6019-thread-1) [    x:collection1] o.a.s.c.JmxMonitoredMap JMX monitoring is enabled. Adding Solr mbeans to JMX Server: com.sun.jmx.mbeanserver.JmxMBeanServer@f1944b5
   [junit4]   2> 1436286 WARN  (coreLoadExecutor-6019-thread-1) [    x:collection1] o.a.s.c.RequestHandlers INVALID paramSet a in requestHandler {type = requestHandler,name = /dump,class = DumpRequestHandler,attributes = {initParams=a, name=/dump, class=DumpRequestHandler},args = {defaults={a=A,b=B}}}
   [junit4]   2> 1436300 INFO  (coreLoadExecutor-6019-thread-1) [    x:collection1] o.a.s.u.UpdateHandler Using UpdateLog implementation: org.apache.solr.update.UpdateLog
   [junit4]   2> 1436300 INFO  (coreLoadExecutor-6019-thread-1) [    x:collection1] o.a.s.u.UpdateLog Initializing UpdateLog: dataDir= defaultSyncLevel=FLUSH numRecordsToKeep=100 maxNumLogsToKeep=10 numVersionBuckets=65536
   [junit4]   2> 1436300 INFO  (coreLoadExecutor-6019-thread-1) [    x:collection1] o.a.s.u.CommitTracker Hard AutoCommit: disabled
   [junit4]   2> 1436300 INFO  (coreLoadExecutor-6019-thread-1) [    x:collection1] o.a.s.u.CommitTracker Soft AutoCommit: disabled
   [junit4]   2> 1436301 INFO  (coreLoadExecutor-6019-thread-1) [    x:collection1] o.a.s.s.SolrIndexSearcher Opening [Searcher@7d94b39b[collection1] main]
   [junit4]   2> 1436301 WARN  (coreLoadExecutor-6019-thread-1) [    x:collection1] o.a.s.r.ManagedResourceStorage Cannot write to config directory /export/home/jenkins/workspace/Lucene-Solr-master-Solaris/solr/core/src/test-files/solr/collection1/conf; switching to use InMemory storage instead.
   [junit4]   2> 1436301 INFO  (coreLoadExecutor-6019-thread-1) [    x:collection1] o.a.s.h.ReplicationHandler Commits will be reserved for  10000
   [junit4]   2> 1436302 INFO  (searcherExecutor-6020-thread-1-processing-x:collection1) [    x:collection1] o.a.s.c.SolrCore [collection1] Registered new searcher Searcher@7d94b39b[collection1] main{ExitableDirectoryReader(UninvertingDirectoryReader())}
   [junit4]   2> 1436302 INFO  (coreLoadExecutor-6019-thread-1) [    x:collection1] o.a.s.u.UpdateLog Could not find max version in index or recent updates, using new clock 1554907155489882112
   [junit4]   2> 1436867 INFO  (TEST-SolrCmdDistributorTest.test-seed#[AD845DDEFBD273FE]) [    ] o.a.s.SolrTestCaseJ4 ###Starting test
   [junit4]   2> 1436872 INFO  (qtp548542361-15558) [    x:collection1] o.a.s.u.p.LogUpdateProcessorFactory [collection1]  webapp= path=/update params={wt=javabin&version=2}{deleteByQuery=*:* (-1554907156085473280)} 0 2
   [junit4]   2> 1436876 INFO  (qtp718674862-15574) [    x:collection1] o.a.s.u.p.LogUpdateProcessorFactory [collection1]  webapp= path=/update params={wt=javabin&version=2}{deleteByQuery=*:* (-1554907156090716160)} 0 1
   [junit4]   2> 1436880 INFO  (qtp226644346-15601) [    x:collection1] o.a.s.u.p.LogUpdateProcessorFactory [collection1]  webapp= path=/update params={wt=javabin&version=2}{deleteByQuery=*:* (-1554907156094910464)} 0 1
   [junit4]   2> 1436885 INFO  (qtp509324700-15609) [    x:collection1] o.a.s.u.p.LogUpdateProcessorFactory [collection1]  webapp= path=/update params={wt=javabin&version=2}{deleteByQuery=*:* (-1554907156098056192)} 0 2
   [junit4]   2> 1436890 INFO  (qtp1394029253-15628) [    x:collection1] o.a.s.u.p.LogUpdateProcessorFactory [collection1]  webapp= path=/update params={wt=javabin&version=2}{deleteByQuery=*:* (-1554907156104347648)} 0 1
   [junit4]   2> 1436892 ERROR (updateExecutor-2108-thread-1-processing-http:////127.0.0.1:45468////collection1) [    ] o.a.s.u.StreamingSolrClients error
   [junit4]   2> java.lang.AssertionError
   [junit4]   2> 	at org.apache.solr.util.stats.InstrumentedHttpRequestExecutor.execute(InstrumentedHttpRequestExecutor.java:56)
   [junit4]   2> 	at org.apache.http.impl.execchain.MainClientExec.execute(MainClientExec.java:271)
   [junit4]   2> 	at org.apache.http.impl.execchain.ProtocolExec.execute(ProtocolExec.java:184)
   [junit4]   2> 	at org.apache.http.impl.execchain.RetryExec.execute(RetryExec.java:88)
   [junit4]   2> 	at org.apache.http.impl.execchain.RedirectExec.execute(RedirectExec.java:110)
   [junit4]   2> 	at org.apache.http.impl.client.InternalHttpClient.doExecute(InternalHttpClient.java:184)
   [junit4]   2> 	at org.apache.http.impl.client.CloseableHttpClient.execute(CloseableHttpClient.java:82)
   [junit4]   2> 	at org.apache.http.impl.client.CloseableHttpClient.execute(CloseableHttpClient.java:55)
   [junit4]   2> 	at org.apache.solr.client.solrj.impl.ConcurrentUpdateSolrClient$Runner.sendUpdateStream(ConcurrentUpdateSolrClient.java:323)
   [junit4]   2> 	at org.apache.solr.client.solrj.impl.ConcurrentUpdateSolrClient$Runner.run(ConcurrentUpdateSolrClient.java:186)
   [junit4]   2> 	at org.apache.solr.common.util.ExecutorUtil$MDCAwareThreadPoolExecutor.lambda$execute$0(ExecutorUtil.java:229)
   [junit4]   2> 	at java.util.concurrent.ThreadPoolExecutor.runWorker(ThreadPoolExecutor.java:1142)
   [junit4]   2> 	at java.util.concurrent.ThreadPoolExecutor$Worker.run(ThreadPoolExecutor.java:617)
   [junit4]   2> 	at java.lang.Thread.run(Thread.java:745)
   [junit4]   2> 1436895 INFO  (qtp548542361-15559) [    x:collection1] o.a.s.c.S.Request [collection1]  webapp= path=/select params={q=*:*&wt=javabin&version=2} hits=0 status=0 QTime=0
   [junit4]   2> 1436896 INFO  (TEST-SolrCmdDistributorTest.test-seed#[AD845DDEFBD273FE]) [    ] o.a.s.SolrTestCaseJ4 ###Ending test
   [junit4]   2> 1436898 INFO  (TEST-SolrCmdDistributorTest.test-seed#[AD845DDEFBD273FE]) [    ] o.e.j.s.AbstractConnector Stopped ServerConnector@3edc0f35{HTTP/1.1,[http/1.1]}{127.0.0.1:0}
   [junit4]   2> 1436898 INFO  (TEST-SolrCmdDistributorTest.test-seed#[AD845DDEFBD273FE]) [    ] o.a.s.c.CoreContainer Shutting down CoreContainer instance=1321861753
   [junit4]   2> 1436899 INFO  (coreCloseExecutor-6025-thread-1) [    x:collection1] o.a.s.c.SolrCore [collection1]  CLOSING SolrCore org.apache.solr.core.SolrCore@6d7e0505
   [junit4]   2> 1436900 INFO  (coreCloseExecutor-6025-thread-1) [    x:collection1] o.a.s.u.DirectUpdateHandler2 Committing on IndexWriter close.
   [junit4]   2> 1436900 INFO  (coreCloseExecutor-6025-thread-1) [    x:collection1] o.a.s.u.SolrIndexWriter Calling setCommitData with IW:org.apache.solr.update.SolrIndexWriter@3ff3ddd4
   [junit4]   2> 1436906 INFO  (coreCloseExecutor-6025-thread-1) [    x:collection1] o.a.s.m.SolrMetricManager Closing metric reporters for: solr.core.collection1
   [junit4]   2> 1436907 INFO  (TEST-SolrCmdDistributorTest.test-seed#[AD845DDEFBD273FE]) [    ] o.a.s.m.SolrMetricManager Closing metric reporters for: solr.node
   [junit4]   2> 1436908 INFO  (TEST-SolrCmdDistributorTest.test-seed#[AD845DDEFBD273FE]) [    ] o.e.j.s.h.ContextHandler Stopped o.e.j.s.ServletContextHandler@5eacdaa8{/,null,UNAVAILABLE}
   [junit4]   2> 1436912 INFO  (TEST-SolrCmdDistributorTest.test-seed#[AD845DDEFBD273FE]) [    ] o.e.j.s.AbstractConnector Stopped ServerConnector@50a9f2db{HTTP/1.1,[http/1.1]}{127.0.0.1:0}
   [junit4]   2> 1436912 INFO  (TEST-SolrCmdDistributorTest.test-seed#[AD845DDEFBD273FE]) [    ] o.a.s.c.CoreContainer Shutting down CoreContainer instance=1762147085
   [junit4]   2> 1436914 INFO  (coreCloseExecutor-6027-thread-1) [    x:collection1] o.a.s.c.SolrCore [collection1]  CLOSING SolrCore org.apache.solr.core.SolrCore@56e0006c
   [junit4]   2> 1436914 INFO  (coreCloseExecutor-6027-thread-1) [    x:collection1] o.a.s.u.DirectUpdateHandler2 Committing on IndexWriter close.
   [junit4]   2> 1436914 INFO  (coreCloseExecutor-6027-thread-1) [    x:collection1] o.a.s.u.SolrIndexWriter Calling setCommitData with IW:org.apache.solr.update.SolrIndexWriter@2af9ba5f
   [junit4]   2> 1436921 INFO  (coreCloseExecutor-6027-thread-1) [    x:collection1] o.a.s.m.SolrMetricManager Closing metric reporters for: solr.core.collection1
   [junit4]   2> 1436922 INFO  (TEST-SolrCmdDistributorTest.test-seed#[AD845DDEFBD273FE]) [    ] o.a.s.m.SolrMetricManager Closing metric reporters for: solr.node
   [junit4]   2> 1436923 INFO  (TEST-SolrCmdDistributorTest.test-seed#[AD845DDEFBD273FE]) [    ] o.e.j.s.h.ContextHandler Stopped o.e.j.s.ServletContextHandler@253fa4f8{/,null,UNAVAILABLE}
   [junit4]   2> 1436928 INFO  (TEST-SolrCmdDistributorTest.test-seed#[AD845DDEFBD273FE]) [    ] o.e.j.s.AbstractConnector Stopped ServerConnector@31a41e51{HTTP/1.1,[http/1.1]}{127.0.0.1:0}
   [junit4]   2> 1436928 INFO  (TEST-SolrCmdDistributorTest.test-seed#[AD845DDEFBD273FE]) [    ] o.a.s.c.CoreContainer Shutting down CoreContainer instance=2119203228
   [junit4]   2> 1436929 INFO  (coreCloseExecutor-6029-thread-1) [    x:collection1] o.a.s.c.SolrCore [collection1]  CLOSING SolrCore org.apache.solr.core.SolrCore@1df6f189
   [junit4]   2> 1436929 INFO  (coreCloseExecutor-6029-thread-1) [    x:collection1] o.a.s.u.DirectUpdateHandler2 Committing on IndexWriter close.
   [junit4]   2> 1436929 INFO  (coreCloseExecutor-6029-thread-1) [    x:collection1] o.a.s.u.SolrIndexWriter Calling setCommitData with IW:org.apache.solr.update.SolrIndexWriter@5f5188b3
   [junit4]   2> 1436936 INFO  (coreCloseExecutor-6029-thread-1) [    x:collection1] o.a.s.m.SolrMetricManager Closing metric reporters for: solr.core.collection1
   [junit4]   2> 1436937 INFO  (TEST-SolrCmdDistributorTest.test-seed#[AD845DDEFBD273FE]) [    ] o.a.s.m.SolrMetricManager Closing metric reporters for: solr.node
   [junit4]   2> 1436938 INFO  (TEST-SolrCmdDistributorTest.test-seed#[AD845DDEFBD273FE]) [    ] o.e.j.s.h.ContextHandler Stopped o.e.j.s.ServletContextHandler@fc8815c{/,null,UNAVAILABLE}
   [junit4]   2> 1436947 INFO  (TEST-SolrCmdDistributorTest.test-seed#[AD845DDEFBD273FE]) [    ] o.e.j.s.AbstractConnector Stopped ServerConnector@60a82443{HTTP/1.1,[http/1.1]}{127.0.0.1:0}
   [junit4]   2> 1436947 INFO  (TEST-SolrCmdDistributorTest.test-seed#[AD845DDEFBD273FE]) [    ] o.a.s.c.CoreContainer Shutting down CoreContainer instance=258479179
   [junit4]   2> 1436948 INFO  (coreCloseExecutor-6031-thread-1) [    x:collection1] o.a.s.c.SolrCore [collection1]  CLOSING SolrCore org.apache.solr.core.SolrCore@7dc17d1a
   [junit4]   2> 1436949 INFO  (coreCloseExecutor-6031-thread-1) [    x:collection1] o.a.s.u.DirectUpdateHandler2 Committing on IndexWriter close.
   [junit4]   2> 1436949 INFO  (coreCloseExecutor-6031-thread-1) [    x:collection1] o.a.s.u.SolrIndexWriter Calling setCommitData with IW:org.apache.solr.update.SolrIndexWriter@472a205d
   [junit4]   2> 1436953 INFO  (coreCloseExecutor-6031-thread-1) [    x:collection1] o.a.s.m.SolrMetricManager Closing metric reporters for: solr.core.collection1
   [junit4]   2> 1436954 INFO  (TEST-SolrCmdDistributorTest.test-seed#[AD845DDEFBD273FE]) [    ] o.a.s.m.SolrMetricManager Closing metric reporters for: solr.node
   [junit4]   2> 1436954 INFO  (TEST-SolrCmdDistributorTest.test-seed#[AD845DDEFBD273FE]) [    ] o.e.j.s.h.ContextHandler Stopped o.e.j.s.ServletContextHandler@3bcc8436{/,null,UNAVAILABLE}
   [junit4]   2> 1436959 INFO  (TEST-SolrCmdDistributorTest.test-seed#[AD845DDEFBD273FE]) [    ] o.e.j.s.AbstractConnector Stopped ServerConnector@6e7d8838{HTTP/1.1,[http/1.1]}{127.0.0.1:0}
   [junit4]   2> 1436959 INFO  (TEST-SolrCmdDistributorTest.test-seed#[AD845DDEFBD273FE]) [    ] o.a.s.c.CoreContainer Shutting down CoreContainer instance=178431684
   [junit4]   2> 1436960 INFO  (coreCloseExecutor-6033-thread-1) [    x:collection1] o.a.s.c.SolrCore [collection1]  CLOSING SolrCore org.apache.solr.core.SolrCore@2ecafd0a
   [junit4]   2> 1436960 INFO  (coreCloseExecutor-6033-thread-1) [    x:collection1] o.a.s.u.DirectUpdateHandler2 Committing on IndexWriter close.
   [junit4]   2> 1436960 INFO  (coreCloseExecutor-6033-thread-1) [    x:collection1] o.a.s.u.SolrIndexWriter Calling setCommitData with IW:org.apache.solr.update.SolrIndexWriter@37ecdaff
   [junit4]   2> 1436971 INFO  (coreCloseExecutor-6033-thread-1) [    x:collection1] o.a.s.m.SolrMetricManager Closing metric reporters for: solr.core.collection1
   [junit4]   2> 1436972 INFO  (TEST-SolrCmdDistributorTest.test-seed#[AD845DDEFBD273FE]) [    ] o.a.s.m.SolrMetricManager Closing metric reporters for: solr.node
   [junit4]   2> 1436973 INFO  (TEST-SolrCmdDistributorTest.test-seed#[AD845DDEFBD273FE]) [    ] o.e.j.s.h.ContextHandler Stopped o.e.j.s.ServletContextHandler@1ff9c9e9{/,null,UNAVAILABLE}
   [junit4]   2> NOTE: reproduce with: ant test  -Dtestcase=SolrCmdDistributorTest -Dtests.method=test -Dtests.seed=AD845DDEFBD273FE -Dtests.slow=true -Dtests.locale=ja-JP -Dtests.timezone=Asia/Thimbu -Dtests.asserts=true -Dtests.file.encoding=UTF-8
   [junit4] FAILURE 4.88s J1 | SolrCmdDistributorTest.test <<<
   [junit4]    > Throwable #1: java.lang.AssertionError: expected:<1> but was:<0>
   [junit4]    > 	at __randomizedtesting.SeedInfo.seed([AD845DDEFBD273FE:25D06204552E1E06]:0)
   [junit4]    > 	at org.apache.solr.update.SolrCmdDistributorTest.test(SolrCmdDistributorTest.java:169)
   [junit4]    > 	at org.apache.solr.BaseDistributedSearchTestCase$ShardsRepeatRule$ShardsFixedStatement.callStatement(BaseDistributedSearchTestCase.java:985)
   [junit4]    > 	at org.apache.solr.BaseDistributedSearchTestCase$ShardsRepeatRule$ShardsStatement.evaluate(BaseDistributedSearchTestCase.java:960)
   [junit4]    > 	at java.lang.Thread.run(Thread.java:745)
   [junit4]   2> 1436980 INFO  (SUITE-SolrCmdDistributorTest-seed#[AD845DDEFBD273FE]-worker) [    ] o.a.s.SolrTestCaseJ4 ###deleteCore
   [junit4]   2> NOTE: leaving temporary files on disk at: /export/home/jenkins/workspace/Lucene-Solr-master-Solaris/solr/build/solr-core/test/J1/temp/solr.update.SolrCmdDistributorTest_AD845DDEFBD273FE-001
   [junit4]   2> NOTE: test params are: codec=Asserting(Lucene70): {}, docValues:{}, maxPointsInLeafNode=225, maxMBSortInHeap=6.459019640613606, sim=RandomSimilarity(queryNorm=false): {}, locale=ja-JP, timezone=Asia/Thimbu
   [junit4]   2> NOTE: SunOS 5.11 amd64/Oracle Corporation 1.8.0_112 (64-bit)/cpus=3,threads=1,free=165708040,total=484442112
   [junit4]   2> NOTE: All tests run in this JVM: [FieldMutatingUpdateProcessorTest, CollectionTooManyReplicasTest, ChaosMonkeySafeLeaderTest, TestRecovery, BadIndexSchemaTest, TestRangeQuery, FieldAnalysisRequestHandlerTest, DistribJoinFromCollectionTest, TestTrie, IndexSchemaTest, TestBadConfig, TestCloudPseudoReturnFields, TestGraphTermsQParserPlugin, RulesTest, BasicDistributedZk2Test, TestComplexPhraseQParserPlugin, DateMathParserTest, TestComponentsName, HdfsUnloadDistributedZkTest, DistributedExpandComponentTest, TestRawTransformer, TestSolrDynamicMBean, SortSpecParsingTest, TestMacroExpander, TestLegacyFieldCache, RollingRestartTest, ResourceLoaderTest, TestReload, CoreAdminRequestStatusTest, TestShortCircuitedRequests, DistributedVersionInfoTest, SuggesterTSTTest, TestAtomicUpdateErrorCases, SolrJmxReporterTest, TestFieldCacheReopen, TestRuleBasedAuthorizationPlugin, TestInitQParser, JavabinLoaderTest, RAMDirectoryFactoryTest, TestSQLHandlerNonCloud, TestDynamicFieldResource, SuggestComponentContextFilterQueryTest, CollectionsAPIDistributedZkTest, TestRestManager, CSVRequestHandlerTest, LeaderInitiatedRecoveryOnShardRestartTest, TestSearcherReuse, BasicAuthStandaloneTest, HdfsChaosMonkeyNothingIsSafeTest, TestConfig, CdcrBootstrapTest, TestDefaultSearchFieldResource, TestFileDictionaryLookup, SparseHLLTest, ForceLeaderTest, TestManagedSynonymFilterFactory, TestDocSet, BadComponentTest, TestDownShardTolerantSearch, TestDefaultStatsCache, TestGraphMLResponseWriter, TestConfigReload, TestFieldSortValues, TestCollationFieldDocValues, CreateCollectionCleanupTest, TestFastWriter, TestHdfsCloudBackupRestore, TestSearchPerf, TestAnalyzedSuggestions, SaslZkACLProviderTest, BasicZkTest, BooleanFieldTest, TestCorePropertiesReload, DefaultValueUpdateProcessorTest, SpellCheckComponentTest, HdfsCollectionsAPIDistributedZkTest, SolrCoreMetricManagerTest, CdcrReplicationHandlerTest, TestZkChroot, TestSolrFieldCacheMBean, DistributedFacetPivotLargeTest, TestQueryWrapperFilter, TestReplicationHandlerBackup, TestFieldCacheSort, VersionInfoTest, TestQueryTypes, AsyncCallRequestStatusResponseTest, TestSolrCloudWithSecureImpersonation, AddBlockUpdateTest, TestCoreDiscovery, SolrCoreCheckLockOnStartupTest, UpdateParamsTest, JsonLoaderTest, ClusterStateTest, TestPivotHelperCode, TestFuzzyAnalyzedSuggestions, ExitableDirectoryReaderTest, DebugComponentTest, TestRequestForwarding, TestDFISimilarityFactory, CloneFieldUpdateProcessorFactoryTest, TestUnifiedSolrHighlighter, DistribCursorPagingTest, TestWriterPerf, DateRangeFieldTest, TestMaxScoreQueryParser, ShardRoutingCustomTest, TestQuerySenderListener, TestDeleteCollectionOnDownNodes, TestJsonRequest, TestSuggestSpellingConverter, DistanceFunctionTest, ZkStateReaderTest, UUIDFieldTest, RequestHandlersTest, SolrIndexSplitterTest, TestValueSourceCache, DeleteNodeTest, TestPerFieldSimilarityWithDefaultOverride, TestExactSharedStatsCache, TestFieldResource, URLClassifyProcessorTest, TestChildDocTransformer, TestXmlQParser, ReplicationFactorTest, TestDistributedStatsComponentCardinality, TestConfigOverlay, PreAnalyzedUpdateProcessorTest, AtomicUpdatesTest, InfoHandlerTest, TestRecoveryHdfs, TestUtils, ScriptEngineTest, TestShardHandlerFactory, TestExportWriter, TestIndexingPerformance, TestSmileRequest, TestFiltering, TestAnalyzeInfixSuggestions, TestLMJelinekMercerSimilarityFactory, CurrencyFieldOpenExchangeTest, CdcrVersionReplicationTest, HdfsRestartWhileUpdatingTest, TestLRUStatsCache, BasicFunctionalityTest, HdfsRecoverLeaseTest, TestScoreJoinQPNoScore, EnumFieldTest, LeaderElectionIntegrationTest, TestSolrCloudWithHadoopAuthPlugin, ConfigSetsAPITest, UpdateRequestProcessorFactoryTest, TestUseDocValuesAsStored2, TestSolrCoreProperties, TestHighFrequencyDictionaryFactory, TestSolrCloudWithDelegationTokens, TestObjectReleaseTracker, IgnoreCommitOptimizeUpdateProcessorFactoryTest, MinimalSchemaTest, HdfsDirectoryTest, OpenCloseCoreStressTest, OverseerTest, FullSolrCloudDistribCmdsTest, ClusterStateUpdateTest, TestRandomFaceting, LeaderElectionTest, ZkSolrClientTest, ZkCLITest, TestDistributedSearch, AutoCommitTest, TestDistributedGrouping, TestFaceting, TermVectorComponentDistributedTest, ZkControllerTest, TestRealTimeGet, TestJoin, HardAutoCommitTest, DistributedTermsComponentTest, TestSolr4Spatial, SolrCoreTest, StatsComponentTest, SolrCmdDistributorTest]
   [junit4] Completed [337/673 (1!)] on J1 in 4.90s, 1 test, 1 failure <<< FAILURES!

[...truncated 63482 lines...]


Mime
View raw message