lucene-dev mailing list archives

Site index · List index
Message view « Date » · « Thread »
Top « Date » · « Thread »
From Policeman Jenkins Server <jenk...@thetaphi.de>
Subject [JENKINS] Lucene-Solr-master-Windows (64bit/jdk1.8.0_102) - Build # 6267 - Unstable!
Date Sun, 04 Dec 2016 19:49:32 GMT
Build: https://jenkins.thetaphi.de/job/Lucene-Solr-master-Windows/6267/
Java: 64bit/jdk1.8.0_102 -XX:+UseCompressedOops -XX:+UseConcMarkSweepGC

1 tests failed.
FAILED:  org.apache.solr.cloud.TestSolrCloudWithDelegationTokens.testDelegationTokenCancelFail

Error Message:
expected:<200> but was:<404>

Stack Trace:
java.lang.AssertionError: expected:<200> but was:<404>
	at __randomizedtesting.SeedInfo.seed([BFE9220F6A99053:6341A70A263382BF]:0)
	at org.junit.Assert.fail(Assert.java:93)
	at org.junit.Assert.failNotEquals(Assert.java:647)
	at org.junit.Assert.assertEquals(Assert.java:128)
	at org.junit.Assert.assertEquals(Assert.java:472)
	at org.junit.Assert.assertEquals(Assert.java:456)
	at org.apache.solr.cloud.TestSolrCloudWithDelegationTokens.cancelDelegationToken(TestSolrCloudWithDelegationTokens.java:140)
	at org.apache.solr.cloud.TestSolrCloudWithDelegationTokens.testDelegationTokenCancelFail(TestSolrCloudWithDelegationTokens.java:294)
	at sun.reflect.NativeMethodAccessorImpl.invoke0(Native Method)
	at sun.reflect.NativeMethodAccessorImpl.invoke(NativeMethodAccessorImpl.java:62)
	at sun.reflect.DelegatingMethodAccessorImpl.invoke(DelegatingMethodAccessorImpl.java:43)
	at java.lang.reflect.Method.invoke(Method.java:498)
	at com.carrotsearch.randomizedtesting.RandomizedRunner.invoke(RandomizedRunner.java:1713)
	at com.carrotsearch.randomizedtesting.RandomizedRunner$8.evaluate(RandomizedRunner.java:907)
	at com.carrotsearch.randomizedtesting.RandomizedRunner$9.evaluate(RandomizedRunner.java:943)
	at com.carrotsearch.randomizedtesting.RandomizedRunner$10.evaluate(RandomizedRunner.java:957)
	at com.carrotsearch.randomizedtesting.rules.SystemPropertiesRestoreRule$1.evaluate(SystemPropertiesRestoreRule.java:57)
	at org.apache.lucene.util.TestRuleSetupTeardownChained$1.evaluate(TestRuleSetupTeardownChained.java:49)
	at org.apache.lucene.util.AbstractBeforeAfterRule$1.evaluate(AbstractBeforeAfterRule.java:45)
	at org.apache.lucene.util.TestRuleThreadAndTestName$1.evaluate(TestRuleThreadAndTestName.java:48)
	at org.apache.lucene.util.TestRuleIgnoreAfterMaxFailures$1.evaluate(TestRuleIgnoreAfterMaxFailures.java:64)
	at org.apache.lucene.util.TestRuleMarkFailure$1.evaluate(TestRuleMarkFailure.java:47)
	at com.carrotsearch.randomizedtesting.rules.StatementAdapter.evaluate(StatementAdapter.java:36)
	at com.carrotsearch.randomizedtesting.ThreadLeakControl$StatementRunner.run(ThreadLeakControl.java:367)
	at com.carrotsearch.randomizedtesting.ThreadLeakControl.forkTimeoutingTask(ThreadLeakControl.java:811)
	at com.carrotsearch.randomizedtesting.ThreadLeakControl$3.evaluate(ThreadLeakControl.java:462)
	at com.carrotsearch.randomizedtesting.RandomizedRunner.runSingleTest(RandomizedRunner.java:916)
	at com.carrotsearch.randomizedtesting.RandomizedRunner$5.evaluate(RandomizedRunner.java:802)
	at com.carrotsearch.randomizedtesting.RandomizedRunner$6.evaluate(RandomizedRunner.java:852)
	at com.carrotsearch.randomizedtesting.RandomizedRunner$7.evaluate(RandomizedRunner.java:863)
	at com.carrotsearch.randomizedtesting.rules.StatementAdapter.evaluate(StatementAdapter.java:36)
	at com.carrotsearch.randomizedtesting.rules.SystemPropertiesRestoreRule$1.evaluate(SystemPropertiesRestoreRule.java:57)
	at org.apache.lucene.util.AbstractBeforeAfterRule$1.evaluate(AbstractBeforeAfterRule.java:45)
	at com.carrotsearch.randomizedtesting.rules.StatementAdapter.evaluate(StatementAdapter.java:36)
	at org.apache.lucene.util.TestRuleStoreClassName$1.evaluate(TestRuleStoreClassName.java:41)
	at com.carrotsearch.randomizedtesting.rules.NoShadowingOrOverridesOnMethodsRule$1.evaluate(NoShadowingOrOverridesOnMethodsRule.java:40)
	at com.carrotsearch.randomizedtesting.rules.NoShadowingOrOverridesOnMethodsRule$1.evaluate(NoShadowingOrOverridesOnMethodsRule.java:40)
	at com.carrotsearch.randomizedtesting.rules.StatementAdapter.evaluate(StatementAdapter.java:36)
	at com.carrotsearch.randomizedtesting.rules.StatementAdapter.evaluate(StatementAdapter.java:36)
	at com.carrotsearch.randomizedtesting.rules.StatementAdapter.evaluate(StatementAdapter.java:36)
	at org.apache.lucene.util.TestRuleAssertionsRequired$1.evaluate(TestRuleAssertionsRequired.java:53)
	at org.apache.lucene.util.TestRuleMarkFailure$1.evaluate(TestRuleMarkFailure.java:47)
	at org.apache.lucene.util.TestRuleIgnoreAfterMaxFailures$1.evaluate(TestRuleIgnoreAfterMaxFailures.java:64)
	at org.apache.lucene.util.TestRuleIgnoreTestSuites$1.evaluate(TestRuleIgnoreTestSuites.java:54)
	at com.carrotsearch.randomizedtesting.rules.StatementAdapter.evaluate(StatementAdapter.java:36)
	at com.carrotsearch.randomizedtesting.ThreadLeakControl$StatementRunner.run(ThreadLeakControl.java:367)
	at java.lang.Thread.run(Thread.java:745)




Build Log:
[...truncated 12291 lines...]
   [junit4] Suite: org.apache.solr.cloud.TestSolrCloudWithDelegationTokens
   [junit4]   2> Creating dataDir: C:\Users\jenkins\workspace\Lucene-Solr-master-Windows\solr\build\solr-core\test\J0\temp\solr.cloud.TestSolrCloudWithDelegationTokens_BFE9220F6A99053-001\init-core-data-001
   [junit4]   2> 2678131 INFO  (SUITE-TestSolrCloudWithDelegationTokens-seed#[BFE9220F6A99053]-worker) [    ] o.a.s.SolrTestCaseJ4 Randomized ssl (true) and clientAuth (true) via: @org.apache.solr.util.RandomizeSSL(reason=, value=NaN, ssl=NaN, clientAuth=NaN)
   [junit4]   2> 2678153 INFO  (SUITE-TestSolrCloudWithDelegationTokens-seed#[BFE9220F6A99053]-worker) [    ] o.a.s.c.MiniSolrCloudCluster Starting cluster of 2 servers in C:\Users\jenkins\workspace\Lucene-Solr-master-Windows\solr\build\solr-core\test\J0\temp\solr.cloud.TestSolrCloudWithDelegationTokens_BFE9220F6A99053-001\tempDir-001
   [junit4]   2> 2678154 INFO  (SUITE-TestSolrCloudWithDelegationTokens-seed#[BFE9220F6A99053]-worker) [    ] o.a.s.c.ZkTestServer STARTING ZK TEST SERVER
   [junit4]   2> 2678155 INFO  (Thread-4663) [    ] o.a.s.c.ZkTestServer client port:0.0.0.0/0.0.0.0:0
   [junit4]   2> 2678156 INFO  (Thread-4663) [    ] o.a.s.c.ZkTestServer Starting server
   [junit4]   2> 2678255 INFO  (SUITE-TestSolrCloudWithDelegationTokens-seed#[BFE9220F6A99053]-worker) [    ] o.a.s.c.ZkTestServer start zk server on port:51997
   [junit4]   2> 2678291 INFO  (jetty-launcher-3117-thread-2) [    ] o.e.j.s.Server jetty-9.3.14.v20161028
   [junit4]   2> 2678291 INFO  (jetty-launcher-3117-thread-1) [    ] o.e.j.s.Server jetty-9.3.14.v20161028
   [junit4]   2> 2678293 INFO  (jetty-launcher-3117-thread-1) [    ] o.e.j.s.h.ContextHandler Started o.e.j.s.ServletContextHandler@73f12453{/solr,null,AVAILABLE}
   [junit4]   2> 2678293 INFO  (jetty-launcher-3117-thread-2) [    ] o.e.j.s.h.ContextHandler Started o.e.j.s.ServletContextHandler@4fc41b5b{/solr,null,AVAILABLE}
   [junit4]   2> 2678298 INFO  (jetty-launcher-3117-thread-1) [    ] o.e.j.s.AbstractConnector Started ServerConnector@70b4ae7e{SSL,[ssl, http/1.1]}{127.0.0.1:52001}
   [junit4]   2> 2678299 INFO  (jetty-launcher-3117-thread-1) [    ] o.e.j.s.Server Started @2682329ms
   [junit4]   2> 2678299 INFO  (jetty-launcher-3117-thread-1) [    ] o.a.s.c.s.e.JettySolrRunner Jetty properties: {hostContext=/solr, hostPort=52001}
   [junit4]   2> 2678299 ERROR (jetty-launcher-3117-thread-1) [    ] o.a.s.s.StartupLoggingUtils Missing Java Option solr.log.dir. Logging may be missing or incomplete.
   [junit4]   2> 2678299 INFO  (jetty-launcher-3117-thread-1) [    ] o.a.s.s.SolrDispatchFilter  ___      _       Welcome to Apache Solr™ version 7.0.0
   [junit4]   2> 2678300 INFO  (jetty-launcher-3117-thread-1) [    ] o.a.s.s.SolrDispatchFilter / __| ___| |_ _   Starting in cloud mode on port null
   [junit4]   2> 2678300 INFO  (jetty-launcher-3117-thread-1) [    ] o.a.s.s.SolrDispatchFilter \__ \/ _ \ | '_|  Install dir: null
   [junit4]   2> 2678300 INFO  (jetty-launcher-3117-thread-1) [    ] o.a.s.s.SolrDispatchFilter |___/\___/_|_|    Start time: 2016-12-04T19:14:56.696Z
   [junit4]   2> 2678300 INFO  (jetty-launcher-3117-thread-2) [    ] o.e.j.s.AbstractConnector Started ServerConnector@14305799{SSL,[ssl, http/1.1]}{127.0.0.1:52002}
   [junit4]   2> 2678300 INFO  (jetty-launcher-3117-thread-2) [    ] o.e.j.s.Server Started @2682331ms
   [junit4]   2> 2678300 INFO  (jetty-launcher-3117-thread-2) [    ] o.a.s.c.s.e.JettySolrRunner Jetty properties: {hostContext=/solr, hostPort=52002}
   [junit4]   2> 2678300 ERROR (jetty-launcher-3117-thread-2) [    ] o.a.s.s.StartupLoggingUtils Missing Java Option solr.log.dir. Logging may be missing or incomplete.
   [junit4]   2> 2678301 INFO  (jetty-launcher-3117-thread-2) [    ] o.a.s.s.SolrDispatchFilter  ___      _       Welcome to Apache Solr™ version 7.0.0
   [junit4]   2> 2678301 INFO  (jetty-launcher-3117-thread-2) [    ] o.a.s.s.SolrDispatchFilter / __| ___| |_ _   Starting in cloud mode on port null
   [junit4]   2> 2678301 INFO  (jetty-launcher-3117-thread-2) [    ] o.a.s.s.SolrDispatchFilter \__ \/ _ \ | '_|  Install dir: null
   [junit4]   2> 2678301 INFO  (jetty-launcher-3117-thread-2) [    ] o.a.s.s.SolrDispatchFilter |___/\___/_|_|    Start time: 2016-12-04T19:14:56.697Z
   [junit4]   2> 2678321 INFO  (jetty-launcher-3117-thread-2) [    ] o.a.s.s.SolrDispatchFilter solr.xml found in ZooKeeper. Loading...
   [junit4]   2> 2678324 INFO  (jetty-launcher-3117-thread-1) [    ] o.a.s.s.SolrDispatchFilter solr.xml found in ZooKeeper. Loading...
   [junit4]   2> 2678356 INFO  (jetty-launcher-3117-thread-2) [    ] o.a.s.c.ZkContainer Zookeeper client=127.0.0.1:51997/solr
   [junit4]   2> 2678370 WARN  (NIOServerCxn.Factory:0.0.0.0/0.0.0.0:0) [    ] o.a.z.s.NIOServerCnxn caught end of stream exception
   [junit4]   2> EndOfStreamException: Unable to read additional data from client sessionid 0x158cb42b5b40002, likely client has closed socket
   [junit4]   2> 	at org.apache.zookeeper.server.NIOServerCnxn.doIO(NIOServerCnxn.java:228)
   [junit4]   2> 	at org.apache.zookeeper.server.NIOServerCnxnFactory.run(NIOServerCnxnFactory.java:208)
   [junit4]   2> 	at java.lang.Thread.run(Thread.java:745)
   [junit4]   2> 2678375 INFO  (jetty-launcher-3117-thread-1) [    ] o.a.s.c.ZkContainer Zookeeper client=127.0.0.1:51997/solr
   [junit4]   2> 2678426 INFO  (jetty-launcher-3117-thread-1) [n:127.0.0.1:52001_solr    ] o.a.s.c.OverseerElectionContext I am going to be the leader 127.0.0.1:52001_solr
   [junit4]   2> 2678427 INFO  (jetty-launcher-3117-thread-2) [n:127.0.0.1:52002_solr    ] o.a.s.c.ZkController Register node as live in ZooKeeper:/live_nodes/127.0.0.1:52002_solr
   [junit4]   2> 2678428 INFO  (jetty-launcher-3117-thread-1) [n:127.0.0.1:52001_solr    ] o.a.s.c.Overseer Overseer (id=97050879365218310-127.0.0.1:52001_solr-n_0000000000) starting
   [junit4]   2> 2678433 INFO  (zkCallback-3124-thread-1-processing-n:127.0.0.1:52002_solr) [n:127.0.0.1:52002_solr    ] o.a.s.c.c.ZkStateReader Updated live nodes from ZooKeeper... (0) -> (1)
   [junit4]   2> 2678435 INFO  (zkCallback-3128-thread-1-processing-n:127.0.0.1:52001_solr) [n:127.0.0.1:52001_solr    ] o.a.s.c.c.ZkStateReader Updated live nodes from ZooKeeper... (0) -> (1)
   [junit4]   2> 2678448 INFO  (jetty-launcher-3117-thread-1) [n:127.0.0.1:52001_solr    ] o.a.s.c.ZkController Register node as live in ZooKeeper:/live_nodes/127.0.0.1:52001_solr
   [junit4]   2> 2678450 INFO  (zkCallback-3128-thread-1-processing-n:127.0.0.1:52001_solr) [n:127.0.0.1:52001_solr    ] o.a.s.c.c.ZkStateReader Updated live nodes from ZooKeeper... (1) -> (2)
   [junit4]   2> 2678450 INFO  (zkCallback-3124-thread-1-processing-n:127.0.0.1:52002_solr) [n:127.0.0.1:52002_solr    ] o.a.s.c.c.ZkStateReader Updated live nodes from ZooKeeper... (1) -> (2)
   [junit4]   2> 2678497 INFO  (jetty-launcher-3117-thread-2) [n:127.0.0.1:52002_solr    ] o.a.s.c.CoreContainer Initializing authentication plugin: org.apache.solr.security.HttpParamDelegationTokenPlugin
   [junit4]   2> 2678549 INFO  (jetty-launcher-3117-thread-1) [n:127.0.0.1:52001_solr    ] o.a.s.c.CoreContainer Initializing authentication plugin: org.apache.solr.security.HttpParamDelegationTokenPlugin
   [junit4]   2> 2678630 INFO  (jetty-launcher-3117-thread-2) [n:127.0.0.1:52002_solr    ] o.a.s.s.KerberosPlugin Params: {token.valid=30, delegation-token.token-kind=solr-dt, cookie.domain=127.0.0.1, cookie.path=/, zk-dt-secret-manager.znodeWorkingPath=solr/security/zkdtsm, token.validity=36000, signer.secret.provider.zookeeper.path=/token, type=kerberos, zk-dt-secret-manager.enable=true, kerberos.name.rules=DEFAULT, signer.secret.provider=zookeeper}
   [junit4]   2> 2678630 INFO  (jetty-launcher-3117-thread-1) [n:127.0.0.1:52001_solr    ] o.a.s.s.KerberosPlugin Params: {token.valid=30, delegation-token.token-kind=solr-dt, cookie.domain=127.0.0.1, cookie.path=/, zk-dt-secret-manager.znodeWorkingPath=solr/security/zkdtsm, token.validity=36000, signer.secret.provider.zookeeper.path=/token, type=kerberos, zk-dt-secret-manager.enable=true, kerberos.name.rules=DEFAULT, signer.secret.provider=zookeeper}
   [junit4]   2> 2679283 INFO  (jetty-launcher-3117-thread-1) [n:127.0.0.1:52001_solr    ] o.a.c.f.i.CuratorFrameworkImpl Starting
   [junit4]   2> 2679283 INFO  (jetty-launcher-3117-thread-2) [n:127.0.0.1:52002_solr    ] o.a.c.f.i.CuratorFrameworkImpl Starting
   [junit4]   2> 2679398 INFO  (jetty-launcher-3117-thread-1-EventThread) [n:127.0.0.1:52001_solr    ] o.a.c.f.s.ConnectionStateManager State change: CONNECTED
   [junit4]   2> 2679398 INFO  (jetty-launcher-3117-thread-2-EventThread) [n:127.0.0.1:52002_solr    ] o.a.c.f.s.ConnectionStateManager State change: CONNECTED
   [junit4]   2> 2679849 ERROR (jetty-launcher-3117-thread-2) [n:127.0.0.1:52002_solr    ] o.a.h.u.Shell Failed to locate the winutils binary in the hadoop binary path
   [junit4]   2> java.io.IOException: Could not locate executable null\bin\winutils.exe in the Hadoop binaries.
   [junit4]   2> 	at org.apache.hadoop.util.Shell.getQualifiedBinPath(Shell.java:356)
   [junit4]   2> 	at org.apache.hadoop.util.Shell.getWinUtilsPath(Shell.java:371)
   [junit4]   2> 	at org.apache.hadoop.util.Shell.<clinit>(Shell.java:364)
   [junit4]   2> 	at org.apache.hadoop.util.StringUtils.<clinit>(StringUtils.java:80)
   [junit4]   2> 	at org.apache.hadoop.conf.Configuration.getBoolean(Configuration.java:1437)
   [junit4]   2> 	at org.apache.hadoop.security.token.delegation.web.DelegationTokenManager.<init>(DelegationTokenManager.java:115)
   [junit4]   2> 	at org.apache.hadoop.security.token.delegation.web.DelegationTokenAuthenticationHandler.initTokenManager(DelegationTokenAuthenticationHandler.java:148)
   [junit4]   2> 	at org.apache.hadoop.security.token.delegation.web.DelegationTokenAuthenticationHandler.init(DelegationTokenAuthenticationHandler.java:118)
   [junit4]   2> 	at org.apache.solr.security.HttpParamDelegationTokenPlugin$HttpParamDelegationTokenAuthenticationHandler.init(HttpParamDelegationTokenPlugin.java:178)
   [junit4]   2> 	at org.apache.hadoop.security.authentication.server.AuthenticationFilter.initializeAuthHandler(AuthenticationFilter.java:238)
   [junit4]   2> 	at org.apache.hadoop.security.token.delegation.web.DelegationTokenAuthenticationFilter.initializeAuthHandler(DelegationTokenAuthenticationFilter.java:209)
   [junit4]   2> 	at org.apache.solr.security.DelegationTokenKerberosFilter.initializeAuthHandler(DelegationTokenKerberosFilter.java:142)
   [junit4]   2> 	at org.apache.hadoop.security.authentication.server.AuthenticationFilter.init(AuthenticationFilter.java:227)
   [junit4]   2> 	at org.apache.hadoop.security.token.delegation.web.DelegationTokenAuthenticationFilter.init(DelegationTokenAuthenticationFilter.java:175)
   [junit4]   2> 	at org.apache.solr.security.DelegationTokenKerberosFilter.init(DelegationTokenKerberosFilter.java:71)
   [junit4]   2> 	at org.apache.solr.security.HttpParamDelegationTokenPlugin.init(HttpParamDelegationTokenPlugin.java:134)
   [junit4]   2> 	at org.apache.solr.core.CoreContainer.initializeAuthenticationPlugin(CoreContainer.java:320)
   [junit4]   2> 	at org.apache.solr.core.CoreContainer.reloadSecurityProperties(CoreContainer.java:577)
   [junit4]   2> 	at org.apache.solr.core.CoreContainer.load(CoreContainer.java:467)
   [junit4]   2> 	at org.apache.solr.servlet.SolrDispatchFilter.createCoreContainer(SolrDispatchFilter.java:204)
   [junit4]   2> 	at org.apache.solr.servlet.SolrDispatchFilter.init(SolrDispatchFilter.java:153)
   [junit4]   2> 	at org.eclipse.jetty.servlet.FilterHolder.initialize(FilterHolder.java:137)
   [junit4]   2> 	at org.eclipse.jetty.servlet.ServletHandler.initialize(ServletHandler.java:873)
   [junit4]   2> 	at org.eclipse.jetty.servlet.ServletHandler.updateMappings(ServletHandler.java:1565)
   [junit4]   2> 	at org.eclipse.jetty.servlet.ServletHandler.setFilterMappings(ServletHandler.java:1599)
   [junit4]   2> 	at org.eclipse.jetty.servlet.ServletHandler.addFilterMapping(ServletHandler.java:1285)
   [junit4]   2> 	at org.eclipse.jetty.servlet.ServletHandler.addFilterWithMapping(ServletHandler.java:1130)
   [junit4]   2> 	at org.eclipse.jetty.servlet.ServletContextHandler.addFilter(ServletContextHandler.java:448)
   [junit4]   2> 	at org.apache.solr.client.solrj.embedded.JettySolrRunner$1.lifeCycleStarted(JettySolrRunner.java:260)
   [junit4]   2> 	at org.eclipse.jetty.util.component.AbstractLifeCycle.setStarted(AbstractLifeCycle.java:179)
   [junit4]   2> 	at org.eclipse.jetty.util.component.AbstractLifeCycle.start(AbstractLifeCycle.java:69)
   [junit4]   2> 	at org.apache.solr.client.solrj.embedded.JettySolrRunner.start(JettySolrRunner.java:348)
   [junit4]   2> 	at org.apache.solr.client.solrj.embedded.JettySolrRunner.start(JettySolrRunner.java:321)
   [junit4]   2> 	at org.apache.solr.cloud.MiniSolrCloudCluster.startJettySolrRunner(MiniSolrCloudCluster.java:349)
   [junit4]   2> 	at org.apache.solr.cloud.MiniSolrCloudCluster.lambda$new$0(MiniSolrCloudCluster.java:212)
   [junit4]   2> 	at java.util.concurrent.FutureTask.run(FutureTask.java:266)
   [junit4]   2> 	at org.apache.solr.common.util.ExecutorUtil$MDCAwareThreadPoolExecutor.lambda$execute$0(ExecutorUtil.java:229)
   [junit4]   2> 	at java.util.concurrent.ThreadPoolExecutor.runWorker(ThreadPoolExecutor.java:1142)
   [junit4]   2> 	at java.util.concurrent.ThreadPoolExecutor$Worker.run(ThreadPoolExecutor.java:617)
   [junit4]   2> 	at java.lang.Thread.run(Thread.java:745)
   [junit4]   2> 2680354 INFO  (jetty-launcher-3117-thread-1) [n:127.0.0.1:52001_solr    ] o.a.s.c.CorePropertiesLocator Found 0 core definitions underneath C:\Users\jenkins\workspace\Lucene-Solr-master-Windows\solr\build\solr-core\test\J0\temp\solr.cloud.TestSolrCloudWithDelegationTokens_BFE9220F6A99053-001\tempDir-001\node1\.
   [junit4]   2> 2680354 INFO  (jetty-launcher-3117-thread-2) [n:127.0.0.1:52002_solr    ] o.a.s.c.CorePropertiesLocator Found 0 core definitions underneath C:\Users\jenkins\workspace\Lucene-Solr-master-Windows\solr\build\solr-core\test\J0\temp\solr.cloud.TestSolrCloudWithDelegationTokens_BFE9220F6A99053-001\tempDir-001\node2\.
   [junit4]   2> 2680414 INFO  (TEST-TestSolrCloudWithDelegationTokens.testDelegationTokenRenewFail-seed#[BFE9220F6A99053]) [    ] o.a.s.SolrTestCaseJ4 ###Starting testDelegationTokenRenewFail
   [junit4]   2> 2682841 WARN  (qtp1362553611-20075) [    ] o.a.h.s.a.s.AuthenticationFilter Authentication exception: org.apache.hadoop.security.AccessControlException: foo tries to renew a token with renewer bar
   [junit4]   2> 2682856 WARN  (qtp1362553611-20075) [    ] o.a.s.s.KerberosPlugin Could not find org.apache.solr.security.kerberosplugin.requestcontinues
   [junit4]   2> 2682878 WARN  (TEST-TestSolrCloudWithDelegationTokens.testDelegationTokenRenewFail-seed#[BFE9220F6A99053]) [    ] o.a.h.c.p.ResponseProcessCookies Invalid cookie header: "Set-Cookie: hadoop.auth=; Path=/; Domain=127.0.0.1; Expires=to, 01-tammikuuta-1970 00:00:00 GMT; Secure; HttpOnly". Invalid 'expires' attribute: to, 01-tammikuuta-1970 00:00:00 GMT
   [junit4]   2> 2682925 WARN  (qtp810807233-20087) [    ] o.a.h.s.a.s.AuthenticationFilter Authentication exception: org.apache.hadoop.security.AccessControlException: foo tries to renew a token with renewer bar
   [junit4]   2> 2682926 WARN  (qtp810807233-20087) [    ] o.a.s.s.KerberosPlugin Could not find org.apache.solr.security.kerberosplugin.requestcontinues
   [junit4]   2> 2682926 WARN  (TEST-TestSolrCloudWithDelegationTokens.testDelegationTokenRenewFail-seed#[BFE9220F6A99053]) [    ] o.a.h.c.p.ResponseProcessCookies Invalid cookie header: "Set-Cookie: hadoop.auth=; Path=/; Domain=127.0.0.1; Expires=to, 01-tammikuuta-1970 00:00:00 GMT; Secure; HttpOnly". Invalid 'expires' attribute: to, 01-tammikuuta-1970 00:00:00 GMT
   [junit4]   2> 2682944 WARN  (qtp1362553611-20096) [    ] o.a.h.s.a.s.AuthenticationFilter Authentication exception: org.apache.hadoop.security.AccessControlException: notRenewUser tries to renew a token with renewer renewUser
   [junit4]   2> 2682945 WARN  (qtp1362553611-20096) [    ] o.a.s.s.KerberosPlugin Could not find org.apache.solr.security.kerberosplugin.requestcontinues
   [junit4]   2> 2682946 WARN  (TEST-TestSolrCloudWithDelegationTokens.testDelegationTokenRenewFail-seed#[BFE9220F6A99053]) [    ] o.a.h.c.p.ResponseProcessCookies Invalid cookie header: "Set-Cookie: hadoop.auth=; Path=/; Domain=127.0.0.1; Expires=to, 01-tammikuuta-1970 00:00:00 GMT; Secure; HttpOnly". Invalid 'expires' attribute: to, 01-tammikuuta-1970 00:00:00 GMT
   [junit4]   2> 2682946 WARN  (qtp810807233-20086) [    ] o.a.h.s.a.s.AuthenticationFilter Authentication exception: org.apache.hadoop.security.AccessControlException: notRenewUser tries to renew a token with renewer renewUser
   [junit4]   2> 2682947 WARN  (qtp810807233-20086) [    ] o.a.s.s.KerberosPlugin Could not find org.apache.solr.security.kerberosplugin.requestcontinues
   [junit4]   2> 2682947 WARN  (TEST-TestSolrCloudWithDelegationTokens.testDelegationTokenRenewFail-seed#[BFE9220F6A99053]) [    ] o.a.h.c.p.ResponseProcessCookies Invalid cookie header: "Set-Cookie: hadoop.auth=; Path=/; Domain=127.0.0.1; Expires=to, 01-tammikuuta-1970 00:00:00 GMT; Secure; HttpOnly". Invalid 'expires' attribute: to, 01-tammikuuta-1970 00:00:00 GMT
   [junit4]   2> 2682947 INFO  (TEST-TestSolrCloudWithDelegationTokens.testDelegationTokenRenewFail-seed#[BFE9220F6A99053]) [    ] o.a.s.SolrTestCaseJ4 ###Ending testDelegationTokenRenewFail
   [junit4]   2> 2682991 INFO  (TEST-TestSolrCloudWithDelegationTokens.testZNodePaths-seed#[BFE9220F6A99053]) [    ] o.a.s.SolrTestCaseJ4 ###Starting testZNodePaths
   [junit4]   2> 2683037 WARN  (NIOServerCxn.Factory:0.0.0.0/0.0.0.0:0) [    ] o.a.z.s.NIOServerCnxn caught end of stream exception
   [junit4]   2> EndOfStreamException: Unable to read additional data from client sessionid 0x158cb42b5b4000a, likely client has closed socket
   [junit4]   2> 	at org.apache.zookeeper.server.NIOServerCnxn.doIO(NIOServerCnxn.java:228)
   [junit4]   2> 	at org.apache.zookeeper.server.NIOServerCnxnFactory.run(NIOServerCnxnFactory.java:208)
   [junit4]   2> 	at java.lang.Thread.run(Thread.java:745)
   [junit4]   2> 2683037 INFO  (TEST-TestSolrCloudWithDelegationTokens.testZNodePaths-seed#[BFE9220F6A99053]) [    ] o.a.s.SolrTestCaseJ4 ###Ending testZNodePaths
   [junit4]   2> 2683087 INFO  (TEST-TestSolrCloudWithDelegationTokens.testDelegationTokenCancel-seed#[BFE9220F6A99053]) [    ] o.a.s.SolrTestCaseJ4 ###Starting testDelegationTokenCancel
   [junit4]   2> 2683189 INFO  (TEST-TestSolrCloudWithDelegationTokens.testDelegationTokenCancel-seed#[BFE9220F6A99053]) [    ] o.a.s.c.c.ZkStateReader Updated live nodes from ZooKeeper... (0) -> (2)
   [junit4]   2> 2683189 INFO  (TEST-TestSolrCloudWithDelegationTokens.testDelegationTokenCancel-seed#[BFE9220F6A99053]) [    ] o.a.s.c.s.i.ZkClientClusterStateProvider Cluster at 127.0.0.1:51997/solr ready
   [junit4]   2> 2683207 ERROR (qtp1362553611-20076) [    ] o.a.h.s.t.d.ZKDelegationTokenSecretManager No node in path [/ZKDTSMTokensRoot/DT_4]
   [junit4]   2> 2683273 WARN  (TEST-TestSolrCloudWithDelegationTokens.testDelegationTokenCancel-seed#[BFE9220F6A99053]) [    ] o.a.h.c.p.ResponseProcessCookies Invalid cookie header: "Set-Cookie: hadoop.auth=; Path=/; Domain=127.0.0.1; Expires=to, 01-tammikuuta-1970 00:00:00 GMT; Secure; HttpOnly". Invalid 'expires' attribute: to, 01-tammikuuta-1970 00:00:00 GMT
   [junit4]   2> 2683287 WARN  (TEST-TestSolrCloudWithDelegationTokens.testDelegationTokenCancel-seed#[BFE9220F6A99053]) [    ] o.a.h.c.p.ResponseProcessCookies Invalid cookie header: "Set-Cookie: hadoop.auth=; Path=/; Domain=127.0.0.1; Expires=to, 01-tammikuuta-1970 00:00:00 GMT; Secure; HttpOnly". Invalid 'expires' attribute: to, 01-tammikuuta-1970 00:00:00 GMT
   [junit4]   2> 2683328 INFO  (TEST-TestSolrCloudWithDelegationTokens.testDelegationTokenCancel-seed#[BFE9220F6A99053]) [    ] o.a.s.c.c.ZkStateReader Updated live nodes from ZooKeeper... (0) -> (2)
   [junit4]   2> 2683331 INFO  (TEST-TestSolrCloudWithDelegationTokens.testDelegationTokenCancel-seed#[BFE9220F6A99053]) [    ] o.a.s.c.s.i.ZkClientClusterStateProvider Cluster at 127.0.0.1:51997/solr ready
   [junit4]   2> 2683342 ERROR (qtp1362553611-20076) [    ] o.a.h.s.t.d.ZKDelegationTokenSecretManager No node in path [/ZKDTSMTokensRoot/DT_5]
   [junit4]   2> 2683349 WARN  (NIOServerCxn.Factory:0.0.0.0/0.0.0.0:0) [    ] o.a.z.s.NIOServerCnxn caught end of stream exception
   [junit4]   2> EndOfStreamException: Unable to read additional data from client sessionid 0x158cb42b5b4000c, likely client has closed socket
   [junit4]   2> 	at org.apache.zookeeper.server.NIOServerCnxn.doIO(NIOServerCnxn.java:228)
   [junit4]   2> 	at org.apache.zookeeper.server.NIOServerCnxnFactory.run(NIOServerCnxnFactory.java:208)
   [junit4]   2> 	at java.lang.Thread.run(Thread.java:745)
   [junit4]   2> 2683374 INFO  (TEST-TestSolrCloudWithDelegationTokens.testDelegationTokenCancel-seed#[BFE9220F6A99053]) [    ] o.a.s.c.c.ZkStateReader Updated live nodes from ZooKeeper... (0) -> (2)
   [junit4]   2> 2683377 INFO  (TEST-TestSolrCloudWithDelegationTokens.testDelegationTokenCancel-seed#[BFE9220F6A99053]) [    ] o.a.s.c.s.i.ZkClientClusterStateProvider Cluster at 127.0.0.1:51997/solr ready
   [junit4]   2> 2683385 WARN  (TEST-TestSolrCloudWithDelegationTokens.testDelegationTokenCancel-seed#[BFE9220F6A99053]) [    ] o.a.h.c.p.ResponseProcessCookies Invalid cookie header: "Set-Cookie: hadoop.auth=; Path=/; Domain=127.0.0.1; Expires=to, 01-tammikuuta-1970 00:00:00 GMT; Secure; HttpOnly". Invalid 'expires' attribute: to, 01-tammikuuta-1970 00:00:00 GMT
   [junit4]   2> 2683387 WARN  (NIOServerCxn.Factory:0.0.0.0/0.0.0.0:0) [    ] o.a.z.s.NIOServerCnxn caught end of stream exception
   [junit4]   2> EndOfStreamException: Unable to read additional data from client sessionid 0x158cb42b5b4000d, likely client has closed socket
   [junit4]   2> 	at org.apache.zookeeper.server.NIOServerCnxn.doIO(NIOServerCnxn.java:228)
   [junit4]   2> 	at org.apache.zookeeper.server.NIOServerCnxnFactory.run(NIOServerCnxnFactory.java:208)
   [junit4]   2> 	at java.lang.Thread.run(Thread.java:745)
   [junit4]   2> 2683401 WARN  (TEST-TestSolrCloudWithDelegationTokens.testDelegationTokenCancel-seed#[BFE9220F6A99053]) [    ] o.a.h.c.p.ResponseProcessCookies Invalid cookie header: "Set-Cookie: hadoop.auth=; Path=/; Domain=127.0.0.1; Expires=to, 01-tammikuuta-1970 00:00:00 GMT; Secure; HttpOnly". Invalid 'expires' attribute: to, 01-tammikuuta-1970 00:00:00 GMT
   [junit4]   2> 2683403 INFO  (TEST-TestSolrCloudWithDelegationTokens.testDelegationTokenCancel-seed#[BFE9220F6A99053]) [    ] o.a.s.SolrTestCaseJ4 ###Ending testDelegationTokenCancel
   [junit4]   2> 2683443 INFO  (TEST-TestSolrCloudWithDelegationTokens.testDelegationOtherOp-seed#[BFE9220F6A99053]) [    ] o.a.s.SolrTestCaseJ4 ###Starting testDelegationOtherOp
   [junit4]   2> 2683482 INFO  (qtp1362553611-20098) [n:127.0.0.1:52001_solr    ] o.a.s.h.a.CollectionsHandler Invoked Collection Action :list with params op=someSolrOperation&action=LIST&wt=javabin&version=2 and sendToOCPQueue=true
   [junit4]   2> 2683482 INFO  (qtp1362553611-20098) [n:127.0.0.1:52001_solr    ] o.a.s.s.HttpSolrCall [admin] webapp=null path=/admin/collections params={op=someSolrOperation&action=LIST&wt=javabin&version=2} status=0 QTime=0
   [junit4]   2> 2683483 WARN  (TEST-TestSolrCloudWithDelegationTokens.testDelegationOtherOp-seed#[BFE9220F6A99053]) [    ] o.a.h.c.p.ResponseProcessCookies Invalid cookie header: "Set-Cookie: hadoop.auth="u=bar&p=bar&t=test&e=1480914901853&s=4PM87a5YICLUzbhxWmwSFJqBZUo="; Path=/; Domain=127.0.0.1; Expires=ma, 05-joulukuuta-2016 05:15:01 GMT; Secure; HttpOnly". Invalid 'expires' attribute: ma, 05-joulukuuta-2016 05:15:01 GMT
   [junit4]   2> 2683483 INFO  (TEST-TestSolrCloudWithDelegationTokens.testDelegationOtherOp-seed#[BFE9220F6A99053]) [    ] o.a.s.SolrTestCaseJ4 ###Ending testDelegationOtherOp
   [junit4]   2> 2683519 INFO  (TEST-TestSolrCloudWithDelegationTokens.testDelegationTokenSolrClient-seed#[BFE9220F6A99053]) [    ] o.a.s.SolrTestCaseJ4 ###Starting testDelegationTokenSolrClient
   [junit4]   2> 2683540 WARN  (TEST-TestSolrCloudWithDelegationTokens.testDelegationTokenSolrClient-seed#[BFE9220F6A99053]) [    ] o.a.h.c.p.ResponseProcessCookies Invalid cookie header: "Set-Cookie: hadoop.auth=; Path=/; Domain=127.0.0.1; Expires=to, 01-tammikuuta-1970 00:00:00 GMT; Secure; HttpOnly". Invalid 'expires' attribute: to, 01-tammikuuta-1970 00:00:00 GMT
   [junit4]   2> 2683564 INFO  (qtp1362553611-20096) [n:127.0.0.1:52001_solr    ] o.a.s.h.a.CollectionsHandler Invoked Collection Action :list with params action=LIST&delegation=GgADYmFyA2JhcgCKAVjLQsqcigFY709OnAYDFIhDtsq_R4id09N3VqfVRAQVKlgTB3NvbHItZHQA&wt=javabin&version=2 and sendToOCPQueue=true
   [junit4]   2> 2683564 INFO  (qtp1362553611-20096) [n:127.0.0.1:52001_solr    ] o.a.s.s.HttpSolrCall [admin] webapp=null path=/admin/collections params={action=LIST&delegation=GgADYmFyA2JhcgCKAVjLQsqcigFY709OnAYDFIhDtsq_R4id09N3VqfVRAQVKlgTB3NvbHItZHQA&wt=javabin&version=2} status=0 QTime=0
   [junit4]   2> 2683565 INFO  (TEST-TestSolrCloudWithDelegationTokens.testDelegationTokenSolrClient-seed#[BFE9220F6A99053]) [    ] o.a.s.SolrTestCaseJ4 ###Ending testDelegationTokenSolrClient
   [junit4]   2> 2683604 INFO  (TEST-TestSolrCloudWithDelegationTokens.testDelegationTokenVerify-seed#[BFE9220F6A99053]) [    ] o.a.s.SolrTestCaseJ4 ###Starting testDelegationTokenVerify
   [junit4]   2> 2683632 INFO  (TEST-TestSolrCloudWithDelegationTokens.testDelegationTokenVerify-seed#[BFE9220F6A99053]) [    ] o.a.s.c.c.ZkStateReader Updated live nodes from ZooKeeper... (0) -> (2)
   [junit4]   2> 2683633 INFO  (TEST-TestSolrCloudWithDelegationTokens.testDelegationTokenVerify-seed#[BFE9220F6A99053]) [    ] o.a.s.c.s.i.ZkClientClusterStateProvider Cluster at 127.0.0.1:51997/solr ready
   [junit4]   2> 2683644 INFO  (qtp1362553611-20080) [n:127.0.0.1:52001_solr    ] o.a.s.h.a.CollectionsHandler Invoked Collection Action :list with params action=LIST&delegation=GgADYmFyA2JhcgCKAVjLQsrxigFY709O8QcDFIKLkq6yyVLHqxAF3IlgH_yIjmreB3NvbHItZHQA&wt=javabin&version=2 and sendToOCPQueue=true
   [junit4]   2> 2683644 INFO  (qtp1362553611-20080) [n:127.0.0.1:52001_solr    ] o.a.s.s.HttpSolrCall [admin] webapp=null path=/admin/collections params={action=LIST&delegation=GgADYmFyA2JhcgCKAVjLQsrxigFY709O8QcDFIKLkq6yyVLHqxAF3IlgH_yIjmreB3NvbHItZHQA&wt=javabin&version=2} status=0 QTime=0
   [junit4]   2> 2683645 WARN  (NIOServerCxn.Factory:0.0.0.0/0.0.0.0:0) [    ] o.a.z.s.NIOServerCnxn caught end of stream exception
   [junit4]   2> EndOfStreamException: Unable to read additional data from client sessionid 0x158cb42b5b4000e, likely client has closed socket
   [junit4]   2> 	at org.apache.zookeeper.server.NIOServerCnxn.doIO(NIOServerCnxn.java:228)
   [junit4]   2> 	at org.apache.zookeeper.server.NIOServerCnxnFactory.run(NIOServerCnxnFactory.java:208)
   [junit4]   2> 	at java.lang.Thread.run(Thread.java:745)
   [junit4]   2> 2683654 INFO  (TEST-TestSolrCloudWithDelegationTokens.testDelegationTokenVerify-seed#[BFE9220F6A99053]) [    ] o.a.s.c.c.ZkStateReader Updated live nodes from ZooKeeper... (0) -> (2)
   [junit4]   2> 2683655 INFO  (TEST-TestSolrCloudWithDelegationTokens.testDelegationTokenVerify-seed#[BFE9220F6A99053]) [    ] o.a.s.c.s.i.ZkClientClusterStateProvider Cluster at 127.0.0.1:51997/solr ready
   [junit4]   2> 2683666 WARN  (TEST-TestSolrCloudWithDelegationTokens.testDelegationTokenVerify-seed#[BFE9220F6A99053]) [    ] o.a.h.c.p.ResponseProcessCookies Invalid cookie header: "Set-Cookie: hadoop.auth=; Path=/; Domain=127.0.0.1; Expires=to, 01-tammikuuta-1970 00:00:00 GMT; Secure; HttpOnly". Invalid 'expires' attribute: to, 01-tammikuuta-1970 00:00:00 GMT
   [junit4]   2> 2683668 WARN  (NIOServerCxn.Factory:0.0.0.0/0.0.0.0:0) [    ] o.a.z.s.NIOServerCnxn caught end of stream exception
   [junit4]   2> EndOfStreamException: Unable to read additional data from client sessionid 0x158cb42b5b4000f, likely client has closed socket
   [junit4]   2> 	at org.apache.zookeeper.server.NIOServerCnxn.doIO(NIOServerCnxn.java:228)
   [junit4]   2> 	at org.apache.zookeeper.server.NIOServerCnxnFactory.run(NIOServerCnxnFactory.java:208)
   [junit4]   2> 	at java.lang.Thread.run(Thread.java:745)
   [junit4]   2> 2683690 INFO  (qtp810807233-20094) [n:127.0.0.1:52002_solr    ] o.a.s.h.a.CollectionsHandler Invoked Collection Action :list with params action=LIST&delegation=GgADYmFyA2JhcgCKAVjLQsrxigFY709O8QcDFIKLkq6yyVLHqxAF3IlgH_yIjmreB3NvbHItZHQA&wt=javabin&version=2 and sendToOCPQueue=true
   [junit4]   2> 2683691 INFO  (qtp810807233-20094) [n:127.0.0.1:52002_solr    ] o.a.s.s.HttpSolrCall [admin] webapp=null path=/admin/collections params={action=LIST&delegation=GgADYmFyA2JhcgCKAVjLQsrxigFY709O8QcDFIKLkq6yyVLHqxAF3IlgH_yIjmreB3NvbHItZHQA&wt=javabin&version=2} status=0 QTime=0
   [junit4]   2> 2683722 WARN  (TEST-TestSolrCloudWithDelegationTokens.testDelegationTokenVerify-seed#[BFE9220F6A99053]) [    ] o.a.h.c.p.ResponseProcessCookies Invalid cookie header: "Set-Cookie: hadoop.auth=; Path=/; Domain=127.0.0.1; Expires=to, 01-tammikuuta-1970 00:00:00 GMT; Secure; HttpOnly". Invalid 'expires' attribute: to, 01-tammikuuta-1970 00:00:00 GMT
   [junit4]   2> 2683723 INFO  (TEST-TestSolrCloudWithDelegationTokens.testDelegationTokenVerify-seed#[BFE9220F6A99053]) [    ] o.a.s.SolrTestCaseJ4 ###Ending testDelegationTokenVerify
   [junit4]   2> 2683762 INFO  (TEST-TestSolrCloudWithDelegationTokens.testDelegationTokenRenew-seed#[BFE9220F6A99053]) [    ] o.a.s.SolrTestCaseJ4 ###Starting testDelegationTokenRenew
   [junit4]   2> 2683811 INFO  (TEST-TestSolrCloudWithDelegationTokens.testDelegationTokenRenew-seed#[BFE9220F6A99053]) [    ] o.a.s.c.c.ZkStateReader Updated live nodes from ZooKeeper... (0) -> (2)
   [junit4]   2> 2683812 INFO  (TEST-TestSolrCloudWithDelegationTokens.testDelegationTokenRenew-seed#[BFE9220F6A99053]) [    ] o.a.s.c.s.i.ZkClientClusterStateProvider Cluster at 127.0.0.1:51997/solr ready
   [junit4]   2> 2683821 INFO  (qtp1362553611-20075) [n:127.0.0.1:52001_solr    ] o.a.s.h.a.CollectionsHandler Invoked Collection Action :list with params action=LIST&delegation=GgADYmFyA2JhcgCKAVjLQsuPigFY709PjwgDFCkgdYEcX-6kyOAypMOm35kvh59SB3NvbHItZHQA&wt=javabin&version=2 and sendToOCPQueue=true
   [junit4]   2> 2683821 INFO  (qtp1362553611-20075) [n:127.0.0.1:52001_solr    ] o.a.s.s.HttpSolrCall [admin] webapp=null path=/admin/collections params={action=LIST&delegation=GgADYmFyA2JhcgCKAVjLQsuPigFY709PjwgDFCkgdYEcX-6kyOAypMOm35kvh59SB3NvbHItZHQA&wt=javabin&version=2} status=0 QTime=0
   [junit4]   2> 2683822 WARN  (NIOServerCxn.Factory:0.0.0.0/0.0.0.0:0) [    ] o.a.z.s.NIOServerCnxn caught end of stream exception
   [junit4]   2> EndOfStreamException: Unable to read additional data from client sessionid 0x158cb42b5b40010, likely client has closed socket
   [junit4]   2> 	at org.apache.zookeeper.server.NIOServerCnxn.doIO(NIOServerCnxn.java:228)
   [junit4]   2> 	at org.apache.zookeeper.server.NIOServerCnxnFactory.run(NIOServerCnxnFactory.java:208)
   [junit4]   2> 	at java.lang.Thread.run(Thread.java:745)
   [junit4]   2> 2683836 WARN  (TEST-TestSolrCloudWithDelegationTokens.testDelegationTokenRenew-seed#[BFE9220F6A99053]) [    ] o.a.h.c.p.ResponseProcessCookies Invalid cookie header: "Set-Cookie: hadoop.auth=; Path=/; Domain=127.0.0.1; Expires=to, 01-tammikuuta-1970 00:00:00 GMT; Secure; HttpOnly". Invalid 'expires' attribute: to, 01-tammikuuta-1970 00:00:00 GMT
   [junit4]   2> 2683846 INFO  (qtp810807233-20085) [n:127.0.0.1:52002_solr    ] o.a.s.h.a.CollectionsHandler Invoked Collection Action :list with params action=LIST&delegation=GgADYmFyA2JhcgCKAVjLQsuPigFY709PjwgDFCkgdYEcX-6kyOAypMOm35kvh59SB3NvbHItZHQA&wt=javabin&version=2 and sendToOCPQueue=true
   [junit4]   2> 2683847 INFO  (qtp810807233-20085) [n:127.0.0.1:52002_solr    ] o.a.s.s.HttpSolrCall [admin] webapp=null path=/admin/collections params={action=LIST&delegation=GgADYmFyA2JhcgCKAVjLQsuPigFY709PjwgDFCkgdYEcX-6kyOAypMOm35kvh59SB3NvbHItZHQA&wt=javabin&version=2} status=0 QTime=0
   [junit4]   2> 2683861 WARN  (TEST-TestSolrCloudWithDelegationTokens.testDelegationTokenRenew-seed#[BFE9220F6A99053]) [    ] o.a.h.c.p.ResponseProcessCookies Invalid cookie header: "Set-Cookie: hadoop.auth=; Path=/; Domain=127.0.0.1; Expires=to, 01-tammikuuta-1970 00:00:00 GMT; Secure; HttpOnly". Invalid 'expires' attribute: to, 01-tammikuuta-1970 00:00:00 GMT
   [junit4]   2> 2683892 INFO  (qtp1362553611-20075) [n:127.0.0.1:52001_solr    ] o.a.s.h.a.CollectionsHandler Invoked Collection Action :list with params action=LIST&delegation=GgADYmFyA2JhcgCKAVjLQsvzigFY709P8wkDFGMVVcyjzavAMqMLQOtIido7sA0xB3NvbHItZHQA&wt=javabin&version=2 and sendToOCPQueue=true
   [junit4]   2> 2683893 INFO  (qtp1362553611-20075) [n:127.0.0.1:52001_solr    ] o.a.s.s.HttpSolrCall [admin] webapp=null path=/admin/collections params={action=LIST&delegation=GgADYmFyA2JhcgCKAVjLQsvzigFY709P8wkDFGMVVcyjzavAMqMLQOtIido7sA0xB3NvbHItZHQA&wt=javabin&version=2} status=0 QTime=0
   [junit4]   2> 2683915 INFO  (TEST-TestSolrCloudWithDelegationTokens.testDelegationTokenRenew-seed#[BFE9220F6A99053]) [    ] o.a.s.c.c.ZkStateReader Updated live nodes from ZooKeeper... (0) -> (2)
   [junit4]   2> 2683917 INFO  (TEST-TestSolrCloudWithDelegationTokens.testDelegationTokenRenew-seed#[BFE9220F6A99053]) [    ] o.a.s.c.s.i.ZkClientClusterStateProvider Cluster at 127.0.0.1:51997/solr ready
   [junit4]   2> 2683929 WARN  (TEST-TestSolrCloudWithDelegationTokens.testDelegationTokenRenew-seed#[BFE9220F6A99053]) [    ] o.a.h.c.p.ResponseProcessCookies Invalid cookie header: "Set-Cookie: hadoop.auth=; Path=/; Domain=127.0.0.1; Expires=to, 01-tammikuuta-1970 00:00:00 GMT; Secure; HttpOnly". Invalid 'expires' attribute: to, 01-tammikuuta-1970 00:00:00 GMT
   [junit4]   2> 2683931 WARN  (NIOServerCxn.Factory:0.0.0.0/0.0.0.0:0) [    ] o.a.z.s.NIOServerCnxn caught end of stream exception
   [junit4]   2> EndOfStreamException: Unable to read additional data from client sessionid 0x158cb42b5b40011, likely client has closed socket
   [junit4]   2> 	at org.apache.zookeeper.server.NIOServerCnxn.doIO(NIOServerCnxn.java:228)
   [junit4]   2> 	at org.apache.zookeeper.server.NIOServerCnxnFactory.run(NIOServerCnxnFactory.java:208)
   [junit4]   2> 	at java.lang.Thread.run(Thread.java:745)
   [junit4]   2> 2683946 INFO  (qtp810807233-20085) [n:127.0.0.1:52002_solr    ] o.a.s.h.a.CollectionsHandler Invoked Collection Action :list with params action=LIST&delegation=GgADYmFyA2JhcgCKAVjLQsvzigFY709P8wkDFGMVVcyjzavAMqMLQOtIido7sA0xB3NvbHItZHQA&wt=javabin&version=2 and sendToOCPQueue=true
   [junit4]   2> 2683946 INFO  (qtp810807233-20085) [n:127.0.0.1:52002_solr    ] o.a.s.s.HttpSolrCall [admin] webapp=null path=/admin/collections params={action=LIST&delegation=GgADYmFyA2JhcgCKAVjLQsvzigFY709P8wkDFGMVVcyjzavAMqMLQOtIido7sA0xB3NvbHItZHQA&wt=javabin&version=2} status=0 QTime=0
   [junit4]   2> 2683963 INFO  (TEST-TestSolrCloudWithDelegationTokens.testDelegationTokenRenew-seed#[BFE9220F6A99053]) [    ] o.a.s.c.c.ZkStateReader Updated live nodes from ZooKeeper... (0) -> (2)
   [junit4]   2> 2683965 INFO  (TEST-TestSolrCloudWithDelegationTokens.testDelegationTokenRenew-seed#[BFE9220F6A99053]) [    ] o.a.s.c.s.i.ZkClientClusterStateProvider Cluster at 127.0.0.1:51997/solr ready
   [junit4]   2> 2683973 WARN  (TEST-TestSolrCloudWithDelegationTokens.testDelegationTokenRenew-seed#[BFE9220F6A99053]) [    ] o.a.h.c.p.ResponseProcessCookies Invalid cookie header: "Set-Cookie: hadoop.auth=; Path=/; Domain=127.0.0.1; Expires=to, 01-tammikuuta-1970 00:00:00 GMT; Secure; HttpOnly". Invalid 'expires' attribute: to, 01-tammikuuta-1970 00:00:00 GMT
   [junit4]   2> 2683975 WARN  (NIOServerCxn.Factory:0.0.0.0/0.0.0.0:0) [    ] o.a.z.s.NIOServerCnxn caught end of stream exception
   [junit4]   2> EndOfStreamException: Unable to read additional data from client sessionid 0x158cb42b5b40012, likely client has closed socket
   [junit4]   2> 	at org.apache.zookeeper.server.NIOServerCnxn.doIO(NIOServerCnxn.java:228)
   [junit4]   2> 	at org.apache.zookeeper.server.NIOServerCnxnFactory.run(NIOServerCnxnFactory.java:208)
   [junit4]   2> 	at java.lang.Thread.run(Thread.java:745)
   [junit4]   2> 2684018 INFO  (qtp1362553611-20098) [n:127.0.0.1:52001_solr    ] o.a.s.h.a.CollectionsHandler Invoked Collection Action :list with params action=LIST&delegation=GgADYmFyA2JhcgCKAVjLQsxligFY709QZQoDFAgVYgoStVgOqSPS8cqSg8exne7gB3NvbHItZHQA&wt=javabin&version=2 and sendToOCPQueue=true
   [junit4]   2> 2684018 INFO  (qtp1362553611-20098) [n:127.0.0.1:52001_solr    ] o.a.s.s.HttpSolrCall [admin] webapp=null path=/admin/collections params={action=LIST&delegation=GgADYmFyA2JhcgCKAVjLQsxligFY709QZQoDFAgVYgoStVgOqSPS8cqSg8exne7gB3NvbHItZHQA&wt=javabin&version=2} status=0 QTime=0
   [junit4]   2> 2684029 INFO  (TEST-TestSolrCloudWithDelegationTokens.testDelegationTokenRenew-seed#[BFE9220F6A99053]) [    ] o.a.s.c.c.ZkStateReader Updated live nodes from ZooKeeper... (0) -> (2)
   [junit4]   2> 2684030 INFO  (TEST-TestSolrCloudWithDelegationTokens.testDelegationTokenRenew-seed#[BFE9220F6A99053]) [    ] o.a.s.c.s.i.ZkClientClusterStateProvider Cluster at 127.0.0.1:51997/solr ready
   [junit4]   2> 2684040 WARN  (TEST-TestSolrCloudWithDelegationTokens.testDelegationTokenRenew-seed#[BFE9220F6A99053]) [    ] o.a.h.c.p.ResponseProcessCookies Invalid cookie header: "Set-Cookie: hadoop.auth=; Path=/; Domain=127.0.0.1; Expires=to, 01-tammikuuta-1970 00:00:00 GMT; Secure; HttpOnly". Invalid 'expires' attribute: to, 01-tammikuuta-1970 00:00:00 GMT
   [junit4]   2> 2684041 WARN  (NIOServerCxn.Factory:0.0.0.0/0.0.0.0:0) [    ] o.a.z.s.NIOServerCnxn caught end of stream exception
   [junit4]   2> EndOfStreamException: Unable to read additional data from client sessionid 0x158cb42b5b40013, likely client has closed socket
   [junit4]   2> 	at org.apache.zookeeper.server.NIOServerCnxn.doIO(NIOServerCnxn.java:228)
   [junit4]   2> 	at org.apache.zookeeper.server.NIOServerCnxnFactory.run(NIOServerCnxnFactory.java:208)
   [junit4]   2> 	at java.lang.Thread.run(Thread.java:745)
   [junit4]   2> 2684054 INFO  (qtp810807233-20072) [n:127.0.0.1:52002_solr    ] o.a.s.h.a.CollectionsHandler Invoked Collection Action :list with params action=LIST&delegation=GgADYmFyA2JhcgCKAVjLQsxligFY709QZQoDFAgVYgoStVgOqSPS8cqSg8exne7gB3NvbHItZHQA&wt=javabin&version=2 and sendToOCPQueue=true
   [junit4]   2> 2684054 INFO  (qtp810807233-20072) [n:127.0.0.1:52002_solr    ] o.a.s.s.HttpSolrCall [admin] webapp=null path=/admin/collections params={action=LIST&delegation=GgADYmFyA2JhcgCKAVjLQsxligFY709QZQoDFAgVYgoStVgOqSPS8cqSg8exne7gB3NvbHItZHQA&wt=javabin&version=2} status=0 QTime=0
   [junit4]   2> 2684061 WARN  (TEST-TestSolrCloudWithDelegationTokens.testDelegationTokenRenew-seed#[BFE9220F6A99053]) [    ] o.a.h.c.p.ResponseProcessCookies Invalid cookie header: "Set-Cookie: hadoop.auth=; Path=/; Domain=127.0.0.1; Expires=to, 01-tammikuuta-1970 00:00:00 GMT; Secure; HttpOnly". Invalid 'expires' attribute: to, 01-tammikuuta-1970 00:00:00 GMT
   [junit4]   2> 2684099 INFO  (qtp1362553611-20098) [n:127.0.0.1:52001_solr    ] o.a.s.h.a.CollectionsHandler Invoked Collection Action :list with params action=LIST&delegation=GgADYmFyA2JhcgCKAVjLQsy8igFY709QvAsDFBXM1Xbfec5EQTmR3neGgA8B3-ctB3NvbHItZHQA&wt=javabin&version=2 and sendToOCPQueue=true
   [junit4]   2> 2684100 INFO  (qtp1362553611-20098) [n:127.0.0.1:52001_solr    ] o.a.s.s.HttpSolrCall [admin] webapp=null path=/admin/collections params={action=LIST&delegation=GgADYmFyA2JhcgCKAVjLQsy8igFY709QvAsDFBXM1Xbfec5EQTmR3neGgA8B3-ctB3NvbHItZHQA&wt=javabin&version=2} status=0 QTime=0
   [junit4]   2> 2684108 INFO  (TEST-TestSolrCloudWithDelegationTokens.testDelegationTokenRenew-seed#[BFE9220F6A99053]) [    ] o.a.s.c.c.ZkStateReader Updated live nodes from ZooKeeper... (0) -> (2)
   [junit4]   2> 2684110 INFO  (TEST-TestSolrCloudWithDelegationTokens.testDelegationTokenRenew-seed#[BFE9220F6A99053]) [    ] o.a.s.c.s.i.ZkClientClusterStateProvider Cluster at 127.0.0.1:51997/solr ready
   [junit4]   2> 2684117 WARN  (TEST-TestSolrCloudWithDelegationTokens.testDelegationTokenRenew-seed#[BFE9220F6A99053]) [    ] o.a.h.c.p.ResponseProcessCookies Invalid cookie header: "Set-Cookie: hadoop.auth=; Path=/; Domain=127.0.0.1; Expires=to, 01-tammikuuta-1970 00:00:00 GMT; Secure; HttpOnly". Invalid 'expires' attribute: to, 01-tammikuuta-1970 00:00:00 GMT
   [junit4]   2> 2684119 WARN  (NIOServerCxn.Factory:0.0.0.0/0.0.0.0:0) [    ] o.a.z.s.NIOServerCnxn caught end of stream exception
   [junit4]   2> EndOfStreamException: Unable to read additional data from client sessionid 0x158cb42b5b40014, likely client has closed socket
   [junit4]   2> 	at org.apache.zookeeper.server.NIOServerCnxn.doIO(NIOServerCnxn.java:228)
   [junit4]   2> 	at org.apache.zookeeper.server.NIOServerCnxnFactory.run(NIOServerCnxnFactory.java:208)
   [junit4]   2> 	at java.lang.Thread.run(Thread.java:745)
   [junit4]   2> 2684126 INFO  (TEST-TestSolrCloudWithDelegationTokens.testDelegationTokenRenew-seed#[BFE9220F6A99053]) [    ] o.a.s.c.c.ZkStateReader Updated live nodes from ZooKeeper... (0) -> (2)
   [junit4]   2> 2684128 INFO  (TEST-TestSolrCloudWithDelegationTokens.testDelegationTokenRenew-seed#[BFE9220F6A99053]) [    ] o.a.s.c.s.i.ZkClientClusterStateProvider Cluster at 127.0.0.1:51997/solr ready
   [junit4]   2> 2684134 INFO  (qtp1362553611-20097) [n:127.0.0.1:52001_solr    ] o.a.s.h.a.CollectionsHandler Invoked Collection Action :list with params action=LIST&delegation=GgADYmFyA2JhcgCKAVjLQsy8igFY709QvAsDFBXM1Xbfec5EQTmR3neGgA8B3-ctB3NvbHItZHQA&wt=javabin&version=2 and sendToOCPQueue=true
   [junit4]   2> 2684134 INFO  (qtp1362553611-20097) [n:127.0.0.1:52001_solr    ] o.a.s.s.HttpSolrCall [admin] webapp=null path=/admin/collections params={action=LIST&delegation=GgADYmFyA2JhcgCKAVjLQsy8igFY709QvAsDFBXM1Xbfec5EQTmR3neGgA8B3-ctB3NvbHItZHQA&wt=javabin&version=2} status=0 QTime=0
   [junit4]   2> 2684135 WARN  (NIOServerCxn.Factory:0.0.0.0/0.0.0.0:0) [    ] o.a.z.s.NIOServerCnxn caught end of stream exception
   [junit4]   2> EndOfStreamException: Unable to read additional data from client sessionid 0x158cb42b5b40015, likely client has closed socket
   [junit4]   2> 	at org.apache.zookeeper.server.NIOServerCnxn.doIO(NIOServerCnxn.java:228)
   [junit4]   2> 	at org.apache.zookeeper.server.NIOServerCnxnFactory.run(NIOServerCnxnFactory.java:208)
   [junit4]   2> 	at java.lang.Thread.run(Thread.java:745)
   [junit4]   2> 2684143 INFO  (TEST-TestSolrCloudWithDelegationTokens.testDelegationTokenRenew-seed#[BFE9220F6A99053]) [    ] o.a.s.c.c.ZkStateReader Updated live nodes from ZooKeeper... (0) -> (2)
   [junit4]   2> 2684145 INFO  (TEST-TestSolrCloudWithDelegationTokens.testDelegationTokenRenew-seed#[BFE9220F6A99053]) [    ] o.a.s.c.s.i.ZkClientClusterStateProvider Cluster at 127.0.0.1:51997/solr ready
   [junit4]   2> 2684153 WARN  (TEST-TestSolrCloudWithDelegationTokens.testDelegationTokenRenew-seed#[BFE9220F6A99053]) [    ] o.a.h.c.p.ResponseProcessCookies Invalid cookie header: "Set-Cookie: hadoop.auth=; Path=/; Domain=127.0.0.1; Expires=to, 01-tammikuuta-1970 00:00:00 GMT; Secure; HttpOnly". Invalid 'expires' attribute: to, 01-tammikuuta-1970 00:00:00 GMT
   [junit4]   2> 2684155 WARN  (NIOServerCxn.Factory:0.0.0.0/0.0.0.0:0) [    ] o.a.z.s.NIOServerCnxn caught end of stream exception
   [junit4]   2> EndOfStreamException: Unable to read additional data from client sessionid 0x158cb42b5b40016, likely client has closed socket
   [junit4]   2> 	at org.apache.zookeeper.server.NIOServerCnxn.doIO(NIOServerCnxn.java:228)
   [junit4]   2> 	at org.apache.zookeeper.server.NIOServerCnxnFactory.run(NIOServerCnxnFactory.java:208)
   [junit4]   2> 	at java.lang.Thread.run(Thread.java:745)
   [junit4]   2> 2684155 INFO  (TEST-TestSolrCloudWithDelegationTokens.testDelegationTokenRenew-seed#[BFE9220F6A99053]) [    ] o.a.s.SolrTestCaseJ4 ###Ending testDelegationTokenRenew
   [junit4]   2> 2684191 INFO  (TEST-TestSolrCloudWithDelegationTokens.testDelegationTokenCancelFail-seed#[BFE9220F6A99053]) [    ] o.a.s.SolrTestCaseJ4 ###Starting testDelegationTokenCancelFail
   [junit4]   2> 2684211 INFO  (TEST-TestSolrCloudWithDelegationTokens.testDelegationTokenCancelFail-seed#[BFE9220F6A99053]) [    ] o.a.s.SolrTestCaseJ4 ###Ending testDelegationTokenCancelFail
   [junit4]   2> NOTE: reproduce with: ant test  -Dtestcase=TestSolrCloudWithDelegationTokens -Dtests.method=testDelegationTokenCancelFail -Dtests.seed=BFE9220F6A99053 -Dtests.slow=true -Dtests.locale=fi-FI -Dtests.timezone=Universal -Dtests.asserts=true -Dtests.file.encoding=UTF-8
   [junit4] FAILURE 0.06s J0 | TestSolrCloudWithDelegationTokens.testDelegationTokenCancelFail <<<
   [junit4]    > Throwable #1: java.lang.AssertionError: expected:<200> but was:<404>
   [junit4]    > 	at __randomizedtesting.SeedInfo.seed([BFE9220F6A99053:6341A70A263382BF]:0)
   [junit4]    > 	at org.apache.solr.cloud.TestSolrCloudWithDelegationTokens.cancelDelegationToken(TestSolrCloudWithDelegationTokens.java:140)
   [junit4]    > 	at org.apache.solr.cloud.TestSolrCloudWithDelegationTokens.testDelegationTokenCancelFail(TestSolrCloudWithDelegationTokens.java:294)
   [junit4]    > 	at java.lang.Thread.run(Thread.java:745)
   [junit4]   2> 2684218 INFO  (jetty-launcher-3117-thread-1) [    ] o.e.j.s.AbstractConnector Stopped ServerConnector@14305799{SSL,[ssl, http/1.1]}{127.0.0.1:0}
   [junit4]   2> 2684225 INFO  (jetty-launcher-3117-thread-1) [    ] o.a.s.c.CoreContainer Shutting down CoreContainer instance=298147566
   [junit4]   2> 2684228 INFO  (jetty-launcher-3117-thread-2) [    ] o.e.j.s.AbstractConnector Stopped ServerConnector@70b4ae7e{SSL,[ssl, http/1.1]}{127.0.0.1:0}
   [junit4]   2> 2684229 INFO  (jetty-launcher-3117-thread-2) [    ] o.a.s.c.CoreContainer Shutting down CoreContainer instance=2087692252
   [junit4]   2> 2684241 INFO  (jetty-launcher-3117-thread-2) [    ] o.a.s.c.Overseer Overseer (id=97050879365218310-127.0.0.1:52001_solr-n_0000000000) closing
   [junit4]   2> 2684242 INFO  (OverseerStateUpdate-97050879365218310-127.0.0.1:52001_solr-n_0000000000) [n:127.0.0.1:52001_solr    ] o.a.s.c.Overseer Overseer Loop exiting : 127.0.0.1:52001_solr
   [junit4]   2> 2684243 WARN  (NIOServerCxn.Factory:0.0.0.0/0.0.0.0:0) [    ] o.a.z.s.NIOServerCnxn caught end of stream exception
   [junit4]   2> EndOfStreamException: Unable to read additional data from client sessionid 0x158cb42b5b40004, likely client has closed socket
   [junit4]   2> 	at org.apache.zookeeper.server.NIOServerCnxn.doIO(NIOServerCnxn.java:228)
   [junit4]   2> 	at org.apache.zookeeper.server.NIOServerCnxnFactory.run(NIOServerCnxnFactory.java:208)
   [junit4]   2> 	at java.lang.Thread.run(Thread.java:745)
   [junit4]   2> 2684244 WARN  (zkCallback-3124-thread-1-processing-n:127.0.0.1:52002_solr) [n:127.0.0.1:52002_solr    ] o.a.s.c.c.ZkStateReader ZooKeeper watch triggered, but Solr cannot talk to ZK: [KeeperErrorCode = Session expired for /live_nodes]
   [junit4]   2> 2684245 ERROR (Thread[Thread-4686,5,TGRP-TestSolrCloudWithDelegationTokens]) [n:127.0.0.1:52002_solr    ] o.a.h.s.t.d.AbstractDelegationTokenSecretManager ExpiredTokenRemover received java.lang.InterruptedException: sleep interrupted
   [junit4]   2> 2684327 WARN  (NIOServerCxn.Factory:0.0.0.0/0.0.0.0:0) [    ] o.a.z.s.NIOServerCnxn caught end of stream exception
   [junit4]   2> EndOfStreamException: Unable to read additional data from client sessionid 0x158cb42b5b40008, likely client has closed socket
   [junit4]   2> 	at org.apache.zookeeper.server.NIOServerCnxn.doIO(NIOServerCnxn.java:228)
   [junit4]   2> 	at org.apache.zookeeper.server.NIOServerCnxnFactory.run(NIOServerCnxnFactory.java:208)
   [junit4]   2> 	at java.lang.Thread.run(Thread.java:745)
   [junit4]   2> 2684328 INFO  (jetty-launcher-3117-thread-1) [    ] o.e.j.s.h.ContextHandler Stopped o.e.j.s.ServletContextHandler@4fc41b5b{/solr,null,UNAVAILABLE}
   [junit4]   2> 2685744 WARN  (zkCallback-3128-thread-2-processing-n:127.0.0.1:52001_solr) [n:127.0.0.1:52001_solr    ] o.a.s.c.c.ZkStateReader ZooKeeper watch triggered, but Solr cannot talk to ZK: [KeeperErrorCode = Session expired for /live_nodes]
   [junit4]   2> 2685745 ERROR (Thread[Thread-4687,5,TGRP-TestSolrCloudWithDelegationTokens]) [n:127.0.0.1:52001_solr    ] o.a.h.s.t.d.AbstractDelegationTokenSecretManager ExpiredTokenRemover received java.lang.InterruptedException: sleep interrupted
   [junit4]   2> 2685751 INFO  (jetty-launcher-3117-thread-2) [    ] o.e.j.s.h.ContextHandler Stopped o.e.j.s.ServletContextHandler@73f12453{/solr,null,UNAVAILABLE}
   [junit4]   2> 2685753 INFO  (SUITE-TestSolrCloudWithDelegationTokens-seed#[BFE9220F6A99053]-worker) [    ] o.a.s.c.ZkTestServer connecting to 127.0.0.1:51997 51997
   [junit4]   2> 2685755 INFO  (Thread-4663) [    ] o.a.s.c.ZkTestServer connecting to 127.0.0.1:51997 51997
   [junit4]   2> 2685757 WARN  (Thread-4663) [    ] o.a.s.c.ZkTestServer Watch limit violations: 
   [junit4]   2> Maximum concurrent create/delete watches above limit:
   [junit4]   2> 
   [junit4]   2> 	14	/solr/aliases.json
   [junit4]   2> 	2	/solr/security.json
   [junit4]   2> 
   [junit4]   2> Maximum concurrent data watches above limit:
   [junit4]   2> 
   [junit4]   2> 	14	/solr/clusterprops.json
   [junit4]   2> 	14	/solr/clusterstate.json
   [junit4]   2> 	4	/solr/security/zkdtsm/ZKDTSMRoot/ZKDTSMKeyIdRoot
   [junit4]   2> 	2	/solr/security/zkdtsm/ZKDTSMRoot/ZKDTSMTokensRoot/DT_7
   [junit4]   2> 	2	/solr/security/zkdtsm/ZKDTSMRoot/ZKDTSMTokensRoot/DT_6
   [junit4]   2> 	2	/solr/security/zkdtsm/ZKDTSMRoot/ZKDTSMTokensRoot/DT_9
   [junit4]   2> 	2	/solr/security/zkdtsm/ZKDTSMRoot/ZKDTSMTokensRoot/DT_8
   [junit4]   2> 	2	/solr/security/zkdtsm/ZKDTSMRoot/ZKDTSMMasterKeyRoot/DK_1
   [junit4]   2> 	2	/solr/security/zkdtsm/ZKDTSMRoot/ZKDTSMTokensRoot/DT_1
   [junit4]   2> 	2	/solr/security/zkdtsm/ZKDTSMRoot/ZKDTSMMasterKeyRoot/DK_3
   [junit4]   2> 	2	/solr/security/zkdtsm/ZKDTSMRoot/ZKDTSMTokensRoot/DT_3
   [junit4]   2> 	2	/solr/security/zkdtsm/ZKDTSMRoot/ZKDTSMMasterKeyRoot/DK_2
   [junit4]   2> 	2	/solr/security/zkdtsm/ZKDTSMRoot/ZKDTSMTokensRoot/DT_2
   [junit4]   2> 	2	/solr/security/zkdtsm/ZKDTSMRoot/ZKDTSMTokensRoot/DT_5
   [junit4]   2> 	2	/solr/security/zkdtsm/ZKDTSMRoot/ZKDTSMMasterKeyRoot/DK_4
   [junit4]   2> 	2	/solr/security/zkdtsm/ZKDTSMRoot/ZKDTSMTokensRoot/DT_4
   [junit4]   2> 	2	/solr/security/zkdtsm/ZKDTSMRoot/ZKDTSMTokensRoot/DT_12
   [junit4]   2> 	2	/solr/security/zkdtsm/ZKDTSMRoot/ZKDTSMSeqNumRoot
   [junit4]   2> 	2	/solr/security/zkdtsm/ZKDTSMRoot/ZKDTSMTokensRoot/DT_11
   [junit4]   2> 	2	/solr/security/zkdtsm/ZKDTSMRoot/ZKDTSMTokensRoot/DT_10
   [junit4]   2> 
   [junit4]   2> Maximum concurrent children watches above limit:
   [junit4]   2> 
   [junit4]   2> 	14	/solr/live_nodes
   [junit4]   2> 	14	/solr/collections
   [junit4]   2> 	5	/solr/overseer/collection-queue-work
   [junit4]   2> 	3	/solr/overseer/queue
   [junit4]   2> 	2	/solr/security/zkdtsm/ZKDTSMRoot/ZKDTSMMasterKeyRoot
   [junit4]   2> 	2	/solr/overseer/queue-work
   [junit4]   2> 	2	/solr/security/zkdtsm/ZKDTSMRoot/ZKDTSMTokensRoot
   [junit4]   2> 
   [junit4]   2> 2685759 INFO  (SUITE-TestSolrCloudWithDelegationTokens-seed#[BFE9220F6A99053]-worker) [    ] o.a.s.SolrTestCaseJ4 ###deleteCore
   [junit4]   2> NOTE: leaving temporary files on disk at: C:\Users\jenkins\workspace\Lucene-Solr-master-Windows\solr\build\solr-core\test\J0\temp\solr.cloud.TestSolrCloudWithDelegationTokens_BFE9220F6A99053-001
   [junit4]   2> Dec 04, 2016 7:15:04 PM com.carrotsearch.randomizedtesting.ThreadLeakControl checkThreadLeaks
   [junit4]   2> WARNING: Will linger awaiting termination of 2 leaked thread(s).
   [junit4]   2> NOTE: test params are: codec=CheapBastard, sim=RandomSimilarity(queryNorm=true): {}, locale=fi-FI, timezone=Universal
   [junit4]   2> NOTE: Windows 10 10.0 amd64/Oracle Corporation 1.8.0_102 (64-bit)/cpus=3,threads=1,free=50990264,total=508952576
   [junit4]   2> NOTE: All tests run in this JVM: [DistributedDebugComponentTest, HdfsBasicDistributedZk2Test, DocValuesMultiTest, HdfsChaosMonkeyNothingIsSafeTest, ResponseHeaderTest, TestTrackingShardHandlerFactory, TestLeaderInitiatedRecoveryThread, DisMaxRequestHandlerTest, DistributedSuggestComponentTest, TestMergePolicyConfig, TestInfoStreamLogging, TestCSVLoader, TestFieldTypeResource, TestConfigSetProperties, TestSimpleQParserPlugin, TestSchemaResource, TestPhraseSuggestions, ShardSplitTest, StandardRequestHandlerTest, TestSQLHandlerNonCloud, DocValuesNotIndexedTest, AddBlockUpdateTest, TestQuerySenderNoQuery, CurrencyFieldXmlFileTest, QueryElevationComponentTest, TestSolrQueryParserDefaultOperatorResource, BooleanFieldTest, SchemaVersionSpecificBehaviorTest, TestAddFieldRealTimeGet, TestSlowCompositeReaderWrapper, DistributedQueryComponentCustomSortTest, TestSha256AuthenticationProvider, SolrCoreTest, BlockDirectoryTest, CdcrReplicationDistributedZkTest, SharedFSAutoReplicaFailoverUtilsTest, TestObjectReleaseTracker, MigrateRouteKeyTest, TestCloudRecovery, TestNonDefinedSimilarityFactory, AtomicUpdatesTest, TestOrdValues, TestCorePropertiesReload, TestCursorMarkWithoutUniqueKey, ConcurrentDeleteAndCreateCollectionTest, PolyFieldTest, SegmentsInfoRequestHandlerTest, DateFieldTest, SimplePostToolTest, TestRestManager, TestTrieFacet, OpenExchangeRatesOrgProviderTest, ZkNodePropsTest, OutOfBoxZkACLAndCredentialsProvidersTest, TestCharFilters, RequiredFieldsTest, DistributedQueryElevationComponentTest, PeerSyncWithIndexFingerprintCachingTest, TestGraphMLResponseWriter, RestartWhileUpdatingTest, ExitableDirectoryReaderTest, CursorMarkTest, TestSurroundQueryParser, TestConfigOverlay, DistributedFacetPivotLongTailTest, TestCustomSort, AnalysisAfterCoreReloadTest, SoftAutoCommitTest, TestNRTOpen, CollectionStateFormat2Test, TestCloudSchemaless, TestPseudoReturnFields, TestShortCircuitedRequests, TestSolrDeletionPolicy1, BasicAuthIntegrationTest, DirectUpdateHandlerTest, TestPushWriter, DistributedQueueTest, ZkStateReaderTest, SpatialFilterTest, TestStressLucene, TestCSVResponseWriter, TestManagedSchemaThreadSafety, HdfsRecoverLeaseTest, ClassificationUpdateProcessorIntegrationTest, TestNumericTerms64, TestPerFieldSimilarity, GraphQueryTest, TestExportWriter, DistributedFacetPivotSmallTest, TestRTGBase, TestHashQParserPlugin, XmlUpdateRequestHandlerTest, TestSort, DistributedFacetExistsSmallTest, TestFileDictionaryLookup, TestNamedUpdateProcessors, TestFieldCacheSort, NumericFieldsTest, TestLegacyNumericRangeQueryBuilder, TestUseDocValuesAsStored, TriLevelCompositeIdRoutingTest, TestElisionMultitermQuery, TestReplicaProperties, TimeZoneUtilsTest, CheckHdfsIndexTest, MoreLikeThisHandlerTest, HttpPartitionTest, HLLSerializationTest, SolrRequestParserTest, BlockJoinFacetRandomTest, RulesTest, DeleteReplicaTest, TestExactStatsCache, IndexSchemaRuntimeFieldTest, TestManagedResource, CustomCollectionTest, TestManagedSynonymFilterFactory, PingRequestHandlerTest, PreAnalyzedUpdateProcessorTest, TestExclusionRuleCollectionAccess, TestIBSimilarityFactory, TestSolrConfigHandlerConcurrent, TestLeaderElectionWithEmptyReplica, TestSweetSpotSimilarityFactory, TestXmlQParserPlugin, TestAnalyzeInfixSuggestions, ZkCLITest, TestCloudDeleteByQuery, TestStressReorder, SearchHandlerTest, VersionInfoTest, BigEndianAscendingWordSerializerTest, TestUniqueKeyFieldResource, TestCloudManagedSchema, TestDistribDocBasedVersion, HdfsThreadLeakTest, TestReplicationHandlerBackup, DistribDocExpirationUpdateProcessorTest, TestTolerantUpdateProcessorRandomCloud, TestJettySolrRunner, PluginInfoTest, TestExceedMaxTermLength, TestReloadDeadlock, BJQParserTest, TestBinaryField, CdcrRequestHandlerTest, TestSchemaVersionResource, TestFilteredDocIdSet, BinaryUpdateRequestHandlerTest, IndexBasedSpellCheckerTest, HardAutoCommitTest, TestLazyCores, TestLockTree, ShardRoutingTest, PrimitiveFieldTypeTest, ZkControllerTest, TestSolrCloudWithSecureImpersonation, TestBM25SimilarityFactory, TestDocTermOrds, BasicDistributedZkTest, UnloadDistributedZkTest, CollectionsAPIDistributedZkTest, SyncSliceTest, RecoveryZkTest, FullSolrCloudDistribCmdsTest, ClusterStateUpdateTest, LeaderElectionTest, ZkSolrClientTest, TestRandomDVFaceting, TestDistributedSearch, TestRealTimeGet, TestReload, DistributedTermsComponentTest, SpellCheckComponentTest, TestGroupingSearch, PeerSyncTest, ConvertedLegacyTest, BasicFunctionalityTest, HighlighterTest, SolrIndexSplitterTest, SignatureUpdateProcessorFactoryTest, SuggesterFSTTest, TestFoldingMultitermQuery, DocValuesTest, XsltUpdateRequestHandlerTest, DebugComponentTest, TestQueryUtils, TestWriterPerf, TestOmitPositions, DocumentBuilderTest, PathHierarchyTokenizerFactoryTest, FieldAnalysisRequestHandlerTest, SolrPluginUtilsTest, UpdateRequestProcessorFactoryTest, QueryParsingTest, TestAnalyzedSuggestions, TestPartialUpdateDeduplication, TestComponentsName, HighlighterConfigTest, SOLR749Test, TestQuerySenderListener, AlternateDirectoryTest, CopyFieldTest, ResponseLogComponentTest, SolrIndexConfigTest, TestSolrDeletionPolicy2, MultiTermTest, SampleTest, TestDocSet, TestSearchPerf, MinimalSchemaTest, OutputWriterTest, TestFuzzyAnalyzedSuggestions, TestPostingsSolrHighlighter, DirectSolrConnectionTest, TestLuceneMatchVersion, TestCodecSupport, SynonymTokenizerTest, TestXIncludeConfig, EchoParamsTest, TestJmxMonitoredMap, ResourceLoaderTest, TestFastOutputStream, ScriptEngineTest, TestFastLRUCache, ChaosMonkeyNothingIsSafeTest, CdcrReplicationHandlerTest, CleanupOldIndexTest, CloudExitableDirectoryReaderTest, CollectionReloadTest, CollectionTooManyReplicasTest, ConnectionManagerTest, CreateCollectionCleanupTest, DeleteLastCustomShardedReplicaTest, DeleteStatusTest, LeaderElectionContextKeyTest, LeaderFailoverAfterPartitionTest, LeaderFailureAfterFreshStartTest, MultiThreadedOCPTest, OverseerTaskQueueTest, RecoveryAfterSoftCommitTest, RollingRestartTest, SolrCLIZkUtilsTest, TestAuthenticationFramework, TestCollectionAPI, TestDownShardTolerantSearch, TestLocalFSCloudBackupRestore, TestOnReconnectListenerSupport, TestRandomRequestDistribution, TestRequestForwarding, TestRequestStatusCollectionAPI, TestSolrCloudWithDelegationTokens]
   [junit4] Completed [515/658 (1!)] on J0 in 8.70s, 8 tests, 1 failure <<< FAILURES!

[...truncated 62880 lines...]


Mime
View raw message