lucene-dev mailing list archives

Site index · List index
Message view « Date » · « Thread »
Top « Date » · « Thread »
From Policeman Jenkins Server <jenk...@thetaphi.de>
Subject [JENKINS-EA] Lucene-Solr-6.x-Linux (32bit/jdk-9-ea+140) - Build # 2309 - Unstable!
Date Thu, 01 Dec 2016 00:16:05 GMT
Build: https://jenkins.thetaphi.de/job/Lucene-Solr-6.x-Linux/2309/
Java: 32bit/jdk-9-ea+140 -server -XX:+UseConcMarkSweepGC

1 tests failed.
FAILED:  org.apache.solr.cloud.ShardSplitTest.testSplitAfterFailedSplit

Error Message:
expected:<1> but was:<2>

Stack Trace:
java.lang.AssertionError: expected:<1> but was:<2>
	at __randomizedtesting.SeedInfo.seed([9948F3F46B1CCD3E:6005605B576980B4]:0)
	at org.junit.Assert.fail(Assert.java:93)
	at org.junit.Assert.failNotEquals(Assert.java:647)
	at org.junit.Assert.assertEquals(Assert.java:128)
	at org.junit.Assert.assertEquals(Assert.java:472)
	at org.junit.Assert.assertEquals(Assert.java:456)
	at org.apache.solr.cloud.ShardSplitTest.testSplitAfterFailedSplit(ShardSplitTest.java:284)
	at jdk.internal.reflect.NativeMethodAccessorImpl.invoke0(java.base@9-ea/Native Method)
	at jdk.internal.reflect.NativeMethodAccessorImpl.invoke(java.base@9-ea/NativeMethodAccessorImpl.java:62)
	at jdk.internal.reflect.DelegatingMethodAccessorImpl.invoke(java.base@9-ea/DelegatingMethodAccessorImpl.java:43)
	at java.lang.reflect.Method.invoke(java.base@9-ea/Method.java:535)
	at com.carrotsearch.randomizedtesting.RandomizedRunner.invoke(RandomizedRunner.java:1713)
	at com.carrotsearch.randomizedtesting.RandomizedRunner$8.evaluate(RandomizedRunner.java:907)
	at com.carrotsearch.randomizedtesting.RandomizedRunner$9.evaluate(RandomizedRunner.java:943)
	at com.carrotsearch.randomizedtesting.RandomizedRunner$10.evaluate(RandomizedRunner.java:957)
	at org.apache.solr.BaseDistributedSearchTestCase$ShardsRepeatRule$ShardsFixedStatement.callStatement(BaseDistributedSearchTestCase.java:992)
	at org.apache.solr.BaseDistributedSearchTestCase$ShardsRepeatRule$ShardsStatement.evaluate(BaseDistributedSearchTestCase.java:967)
	at com.carrotsearch.randomizedtesting.rules.SystemPropertiesRestoreRule$1.evaluate(SystemPropertiesRestoreRule.java:57)
	at org.apache.lucene.util.TestRuleSetupTeardownChained$1.evaluate(TestRuleSetupTeardownChained.java:49)
	at org.apache.lucene.util.AbstractBeforeAfterRule$1.evaluate(AbstractBeforeAfterRule.java:45)
	at org.apache.lucene.util.TestRuleThreadAndTestName$1.evaluate(TestRuleThreadAndTestName.java:48)
	at org.apache.lucene.util.TestRuleIgnoreAfterMaxFailures$1.evaluate(TestRuleIgnoreAfterMaxFailures.java:64)
	at org.apache.lucene.util.TestRuleMarkFailure$1.evaluate(TestRuleMarkFailure.java:47)
	at com.carrotsearch.randomizedtesting.rules.StatementAdapter.evaluate(StatementAdapter.java:36)
	at com.carrotsearch.randomizedtesting.ThreadLeakControl$StatementRunner.run(ThreadLeakControl.java:367)
	at com.carrotsearch.randomizedtesting.ThreadLeakControl.forkTimeoutingTask(ThreadLeakControl.java:811)
	at com.carrotsearch.randomizedtesting.ThreadLeakControl$3.evaluate(ThreadLeakControl.java:462)
	at com.carrotsearch.randomizedtesting.RandomizedRunner.runSingleTest(RandomizedRunner.java:916)
	at com.carrotsearch.randomizedtesting.RandomizedRunner$5.evaluate(RandomizedRunner.java:802)
	at com.carrotsearch.randomizedtesting.RandomizedRunner$6.evaluate(RandomizedRunner.java:852)
	at com.carrotsearch.randomizedtesting.RandomizedRunner$7.evaluate(RandomizedRunner.java:863)
	at com.carrotsearch.randomizedtesting.rules.StatementAdapter.evaluate(StatementAdapter.java:36)
	at com.carrotsearch.randomizedtesting.rules.SystemPropertiesRestoreRule$1.evaluate(SystemPropertiesRestoreRule.java:57)
	at org.apache.lucene.util.AbstractBeforeAfterRule$1.evaluate(AbstractBeforeAfterRule.java:45)
	at com.carrotsearch.randomizedtesting.rules.StatementAdapter.evaluate(StatementAdapter.java:36)
	at org.apache.lucene.util.TestRuleStoreClassName$1.evaluate(TestRuleStoreClassName.java:41)
	at com.carrotsearch.randomizedtesting.rules.NoShadowingOrOverridesOnMethodsRule$1.evaluate(NoShadowingOrOverridesOnMethodsRule.java:40)
	at com.carrotsearch.randomizedtesting.rules.NoShadowingOrOverridesOnMethodsRule$1.evaluate(NoShadowingOrOverridesOnMethodsRule.java:40)
	at com.carrotsearch.randomizedtesting.rules.StatementAdapter.evaluate(StatementAdapter.java:36)
	at com.carrotsearch.randomizedtesting.rules.StatementAdapter.evaluate(StatementAdapter.java:36)
	at com.carrotsearch.randomizedtesting.rules.StatementAdapter.evaluate(StatementAdapter.java:36)
	at org.apache.lucene.util.TestRuleAssertionsRequired$1.evaluate(TestRuleAssertionsRequired.java:53)
	at org.apache.lucene.util.TestRuleMarkFailure$1.evaluate(TestRuleMarkFailure.java:47)
	at org.apache.lucene.util.TestRuleIgnoreAfterMaxFailures$1.evaluate(TestRuleIgnoreAfterMaxFailures.java:64)
	at org.apache.lucene.util.TestRuleIgnoreTestSuites$1.evaluate(TestRuleIgnoreTestSuites.java:54)
	at com.carrotsearch.randomizedtesting.rules.StatementAdapter.evaluate(StatementAdapter.java:36)
	at com.carrotsearch.randomizedtesting.ThreadLeakControl$StatementRunner.run(ThreadLeakControl.java:367)
	at java.lang.Thread.run(java.base@9-ea/Thread.java:843)




Build Log:
[...truncated 11612 lines...]
   [junit4] Suite: org.apache.solr.cloud.ShardSplitTest
   [junit4]   2> Creating dataDir: /home/jenkins/workspace/Lucene-Solr-6.x-Linux/solr/build/solr-core/test/J0/temp/solr.cloud.ShardSplitTest_9948F3F46B1CCD3E-001/init-core-data-001
   [junit4]   2> 764518 INFO  (SUITE-ShardSplitTest-seed#[9948F3F46B1CCD3E]-worker) [    ] o.a.s.SolrTestCaseJ4 Randomized ssl (false) and clientAuth (false) via: @org.apache.solr.SolrTestCaseJ4$SuppressSSL(bugUrl="https://issues.apache.org/jira/browse/SOLR-5776")
   [junit4]   2> 764518 INFO  (SUITE-ShardSplitTest-seed#[9948F3F46B1CCD3E]-worker) [    ] o.a.s.BaseDistributedSearchTestCase Setting hostContext system property: /_/c
   [junit4]   2> 764519 INFO  (TEST-ShardSplitTest.testSplitStaticIndexReplication-seed#[9948F3F46B1CCD3E]) [    ] o.a.s.c.ZkTestServer STARTING ZK TEST SERVER
   [junit4]   2> 764520 INFO  (Thread-1590) [    ] o.a.s.c.ZkTestServer client port:0.0.0.0/0.0.0.0:0
   [junit4]   2> 764520 INFO  (Thread-1590) [    ] o.a.s.c.ZkTestServer Starting server
   [junit4]   2> 764620 INFO  (TEST-ShardSplitTest.testSplitStaticIndexReplication-seed#[9948F3F46B1CCD3E]) [    ] o.a.s.c.ZkTestServer start zk server on port:37606
   [junit4]   2> 764626 INFO  (TEST-ShardSplitTest.testSplitStaticIndexReplication-seed#[9948F3F46B1CCD3E]) [    ] o.a.s.c.AbstractZkTestCase put /home/jenkins/workspace/Lucene-Solr-6.x-Linux/solr/core/src/test-files/solr/collection1/conf/solrconfig-tlog.xml to /configs/conf1/solrconfig.xml
   [junit4]   2> 764629 INFO  (TEST-ShardSplitTest.testSplitStaticIndexReplication-seed#[9948F3F46B1CCD3E]) [    ] o.a.s.c.AbstractZkTestCase put /home/jenkins/workspace/Lucene-Solr-6.x-Linux/solr/core/src/test-files/solr/collection1/conf/schema15.xml to /configs/conf1/schema.xml
   [junit4]   2> 764634 INFO  (TEST-ShardSplitTest.testSplitStaticIndexReplication-seed#[9948F3F46B1CCD3E]) [    ] o.a.s.c.AbstractZkTestCase put /home/jenkins/workspace/Lucene-Solr-6.x-Linux/solr/core/src/test-files/solr/collection1/conf/solrconfig.snippet.randomindexconfig.xml to /configs/conf1/solrconfig.snippet.randomindexconfig.xml
   [junit4]   2> 764636 INFO  (TEST-ShardSplitTest.testSplitStaticIndexReplication-seed#[9948F3F46B1CCD3E]) [    ] o.a.s.c.AbstractZkTestCase put /home/jenkins/workspace/Lucene-Solr-6.x-Linux/solr/core/src/test-files/solr/collection1/conf/stopwords.txt to /configs/conf1/stopwords.txt
   [junit4]   2> 764639 INFO  (TEST-ShardSplitTest.testSplitStaticIndexReplication-seed#[9948F3F46B1CCD3E]) [    ] o.a.s.c.AbstractZkTestCase put /home/jenkins/workspace/Lucene-Solr-6.x-Linux/solr/core/src/test-files/solr/collection1/conf/protwords.txt to /configs/conf1/protwords.txt
   [junit4]   2> 764642 INFO  (TEST-ShardSplitTest.testSplitStaticIndexReplication-seed#[9948F3F46B1CCD3E]) [    ] o.a.s.c.AbstractZkTestCase put /home/jenkins/workspace/Lucene-Solr-6.x-Linux/solr/core/src/test-files/solr/collection1/conf/currency.xml to /configs/conf1/currency.xml
   [junit4]   2> 764644 INFO  (TEST-ShardSplitTest.testSplitStaticIndexReplication-seed#[9948F3F46B1CCD3E]) [    ] o.a.s.c.AbstractZkTestCase put /home/jenkins/workspace/Lucene-Solr-6.x-Linux/solr/core/src/test-files/solr/collection1/conf/enumsConfig.xml to /configs/conf1/enumsConfig.xml
   [junit4]   2> 764646 INFO  (TEST-ShardSplitTest.testSplitStaticIndexReplication-seed#[9948F3F46B1CCD3E]) [    ] o.a.s.c.AbstractZkTestCase put /home/jenkins/workspace/Lucene-Solr-6.x-Linux/solr/core/src/test-files/solr/collection1/conf/open-exchange-rates.json to /configs/conf1/open-exchange-rates.json
   [junit4]   2> 764649 INFO  (TEST-ShardSplitTest.testSplitStaticIndexReplication-seed#[9948F3F46B1CCD3E]) [    ] o.a.s.c.AbstractZkTestCase put /home/jenkins/workspace/Lucene-Solr-6.x-Linux/solr/core/src/test-files/solr/collection1/conf/mapping-ISOLatin1Accent.txt to /configs/conf1/mapping-ISOLatin1Accent.txt
   [junit4]   2> 764651 INFO  (TEST-ShardSplitTest.testSplitStaticIndexReplication-seed#[9948F3F46B1CCD3E]) [    ] o.a.s.c.AbstractZkTestCase put /home/jenkins/workspace/Lucene-Solr-6.x-Linux/solr/core/src/test-files/solr/collection1/conf/old_synonyms.txt to /configs/conf1/old_synonyms.txt
   [junit4]   2> 764654 INFO  (TEST-ShardSplitTest.testSplitStaticIndexReplication-seed#[9948F3F46B1CCD3E]) [    ] o.a.s.c.AbstractZkTestCase put /home/jenkins/workspace/Lucene-Solr-6.x-Linux/solr/core/src/test-files/solr/collection1/conf/synonyms.txt to /configs/conf1/synonyms.txt
   [junit4]   2> 765457 INFO  (TEST-ShardSplitTest.testSplitStaticIndexReplication-seed#[9948F3F46B1CCD3E]) [    ] o.a.s.SolrTestCaseJ4 Writing core.properties file to /home/jenkins/workspace/Lucene-Solr-6.x-Linux/solr/build/solr-core/test/J0/temp/solr.cloud.ShardSplitTest_9948F3F46B1CCD3E-001/control-001/cores/collection1
   [junit4]   2> 765459 INFO  (TEST-ShardSplitTest.testSplitStaticIndexReplication-seed#[9948F3F46B1CCD3E]) [    ] o.e.j.s.Server jetty-9.3.14.v20161028
   [junit4]   2> 765460 INFO  (TEST-ShardSplitTest.testSplitStaticIndexReplication-seed#[9948F3F46B1CCD3E]) [    ] o.e.j.s.h.ContextHandler Started o.e.j.s.ServletContextHandler@c638f0{/_/c,null,AVAILABLE}
   [junit4]   2> 765462 INFO  (TEST-ShardSplitTest.testSplitStaticIndexReplication-seed#[9948F3F46B1CCD3E]) [    ] o.e.j.s.AbstractConnector Started ServerConnector@ebee0c{HTTP/1.1,[http/1.1]}{127.0.0.1:40911}
   [junit4]   2> 765462 INFO  (TEST-ShardSplitTest.testSplitStaticIndexReplication-seed#[9948F3F46B1CCD3E]) [    ] o.e.j.s.Server Started @768540ms
   [junit4]   2> 765462 INFO  (TEST-ShardSplitTest.testSplitStaticIndexReplication-seed#[9948F3F46B1CCD3E]) [    ] o.a.s.c.s.e.JettySolrRunner Jetty properties: {hostContext=/_/c, solr.data.dir=/home/jenkins/workspace/Lucene-Solr-6.x-Linux/solr/build/solr-core/test/J0/temp/solr.cloud.ShardSplitTest_9948F3F46B1CCD3E-001/tempDir-001/control/data, hostPort=40911, coreRootDirectory=/home/jenkins/workspace/Lucene-Solr-6.x-Linux/solr/build/solr-core/test/J0/../../../../../../../../../home/jenkins/workspace/Lucene-Solr-6.x-Linux/solr/build/solr-core/test/J0/temp/solr.cloud.ShardSplitTest_9948F3F46B1CCD3E-001/control-001/cores}
   [junit4]   2> 765462 ERROR (TEST-ShardSplitTest.testSplitStaticIndexReplication-seed#[9948F3F46B1CCD3E]) [    ] o.a.s.s.StartupLoggingUtils Missing Java Option solr.log.dir. Logging may be missing or incomplete.
   [junit4]   2> 765462 INFO  (TEST-ShardSplitTest.testSplitStaticIndexReplication-seed#[9948F3F46B1CCD3E]) [    ] o.a.s.s.SolrDispatchFilter  ___      _       Welcome to Apache Solr? version 6.4.0
   [junit4]   2> 765462 INFO  (TEST-ShardSplitTest.testSplitStaticIndexReplication-seed#[9948F3F46B1CCD3E]) [    ] o.a.s.s.SolrDispatchFilter / __| ___| |_ _   Starting in cloud mode on port null
   [junit4]   2> 765462 INFO  (TEST-ShardSplitTest.testSplitStaticIndexReplication-seed#[9948F3F46B1CCD3E]) [    ] o.a.s.s.SolrDispatchFilter \__ \/ _ \ | '_|  Install dir: null
   [junit4]   2> 765462 INFO  (TEST-ShardSplitTest.testSplitStaticIndexReplication-seed#[9948F3F46B1CCD3E]) [    ] o.a.s.s.SolrDispatchFilter |___/\___/_|_|    Start time: 2016-11-30T23:36:00.431857Z
   [junit4]   2> 765465 INFO  (TEST-ShardSplitTest.testSplitStaticIndexReplication-seed#[9948F3F46B1CCD3E]) [    ] o.a.s.s.SolrDispatchFilter Loading solr.xml from SolrHome (not found in ZooKeeper)
   [junit4]   2> 765465 INFO  (TEST-ShardSplitTest.testSplitStaticIndexReplication-seed#[9948F3F46B1CCD3E]) [    ] o.a.s.c.SolrXmlConfig Loading container configuration from /home/jenkins/workspace/Lucene-Solr-6.x-Linux/solr/build/solr-core/test/J0/temp/solr.cloud.ShardSplitTest_9948F3F46B1CCD3E-001/control-001/solr.xml
   [junit4]   2> 765473 INFO  (TEST-ShardSplitTest.testSplitStaticIndexReplication-seed#[9948F3F46B1CCD3E]) [    ] o.a.s.u.UpdateShardHandler Creating UpdateShardHandler HTTP client with params: socketTimeout=340000&connTimeout=45000&retry=true
   [junit4]   2> 765475 INFO  (TEST-ShardSplitTest.testSplitStaticIndexReplication-seed#[9948F3F46B1CCD3E]) [    ] o.a.s.c.ZkContainer Zookeeper client=127.0.0.1:37606/solr
   [junit4]   2> 765488 INFO  (TEST-ShardSplitTest.testSplitStaticIndexReplication-seed#[9948F3F46B1CCD3E]) [    ] o.a.s.c.OverseerElectionContext I am going to be the leader 127.0.0.1:40911__%2Fc
   [junit4]   2> 765488 INFO  (TEST-ShardSplitTest.testSplitStaticIndexReplication-seed#[9948F3F46B1CCD3E]) [    ] o.a.s.c.Overseer Overseer (id=97029256609333252-127.0.0.1:40911__%2Fc-n_0000000000) starting
   [junit4]   2> 765491 INFO  (TEST-ShardSplitTest.testSplitStaticIndexReplication-seed#[9948F3F46B1CCD3E]) [    ] o.a.s.c.ZkController Register node as live in ZooKeeper:/live_nodes/127.0.0.1:40911__%2Fc
   [junit4]   2> 765492 INFO  (zkCallback-649-thread-1) [    ] o.a.s.c.c.ZkStateReader Updated live nodes from ZooKeeper... (0) -> (1)
   [junit4]   2> 765715 INFO  (TEST-ShardSplitTest.testSplitStaticIndexReplication-seed#[9948F3F46B1CCD3E]) [    ] o.a.s.c.CorePropertiesLocator Found 1 core definitions underneath /home/jenkins/workspace/Lucene-Solr-6.x-Linux/solr/build/solr-core/test/J0/../../../../../../../../../home/jenkins/workspace/Lucene-Solr-6.x-Linux/solr/build/solr-core/test/J0/temp/solr.cloud.ShardSplitTest_9948F3F46B1CCD3E-001/control-001/cores
   [junit4]   2> 765716 INFO  (TEST-ShardSplitTest.testSplitStaticIndexReplication-seed#[9948F3F46B1CCD3E]) [    ] o.a.s.c.CorePropertiesLocator Cores are: [collection1]
   [junit4]   2> 765717 INFO  (OverseerStateUpdate-97029256609333252-127.0.0.1:40911__%2Fc-n_0000000000) [    ] o.a.s.c.o.ReplicaMutator Assigning new node to shard shard=shard1
   [junit4]   2> 766726 WARN  (coreLoadExecutor-2413-thread-1) [    ] o.a.s.c.Config Beginning with Solr 5.5, <mergePolicy> is deprecated, use <mergePolicyFactory> instead.
   [junit4]   2> 766726 INFO  (coreLoadExecutor-2413-thread-1) [    ] o.a.s.c.SolrConfig Using Lucene MatchVersion: 6.4.0
   [junit4]   2> 766738 INFO  (coreLoadExecutor-2413-thread-1) [    ] o.a.s.s.IndexSchema [collection1] Schema name=test
   [junit4]   2> 766790 WARN  (coreLoadExecutor-2413-thread-1) [    ] o.a.s.s.IndexSchema [collection1] default search field in schema is text. WARNING: Deprecated, please use 'df' on request instead.
   [junit4]   2> 766794 INFO  (coreLoadExecutor-2413-thread-1) [    ] o.a.s.s.IndexSchema Loaded schema test/1.6 with uniqueid field id
   [junit4]   2> 766801 INFO  (coreLoadExecutor-2413-thread-1) [    ] o.a.s.c.CoreContainer Creating SolrCore 'collection1' using configuration from collection control_collection
   [junit4]   2> 766801 INFO  (coreLoadExecutor-2413-thread-1) [    ] o.a.s.c.SolrCore [[collection1] ] Opening new SolrCore at [/home/jenkins/workspace/Lucene-Solr-6.x-Linux/solr/build/solr-core/test/J0/temp/solr.cloud.ShardSplitTest_9948F3F46B1CCD3E-001/control-001/cores/collection1], dataDir=[/home/jenkins/workspace/Lucene-Solr-6.x-Linux/solr/build/solr-core/test/J0/../../../../../../../../../home/jenkins/workspace/Lucene-Solr-6.x-Linux/solr/build/solr-core/test/J0/temp/solr.cloud.ShardSplitTest_9948F3F46B1CCD3E-001/control-001/cores/collection1/data/]
   [junit4]   2> 766802 INFO  (coreLoadExecutor-2413-thread-1) [    ] o.a.s.c.JmxMonitoredMap JMX monitoring is enabled. Adding Solr mbeans to JMX Server: com.sun.jmx.mbeanserver.JmxMBeanServer@181a399
   [junit4]   2> 766807 INFO  (coreLoadExecutor-2413-thread-1) [    ] o.a.s.u.RandomMergePolicy RandomMergePolicy wrapping class org.apache.lucene.index.TieredMergePolicy: [TieredMergePolicy: maxMergeAtOnce=20, maxMergeAtOnceExplicit=13, maxMergedSegmentMB=38.0576171875, floorSegmentMB=2.03125, forceMergeDeletesPctAllowed=4.892452297463343, segmentsPerTier=17.0, maxCFSSegmentSizeMB=1.10546875, noCFSRatio=0.19240325715882092
   [junit4]   2> 781815 WARN  (coreLoadExecutor-2413-thread-1) [    ] o.a.s.c.RequestHandlers INVALID paramSet a in requestHandler {type = requestHandler,name = /dump,class = DumpRequestHandler,args = {defaults={a=A,b=B}}}
   [junit4]   2> 781820 INFO  (coreLoadExecutor-2413-thread-1) [    ] o.a.s.u.UpdateHandler Using UpdateLog implementation: org.apache.solr.update.UpdateLog
   [junit4]   2> 781820 INFO  (coreLoadExecutor-2413-thread-1) [    ] o.a.s.u.UpdateLog Initializing UpdateLog: dataDir= defaultSyncLevel=FLUSH numRecordsToKeep=100 maxNumLogsToKeep=10 numVersionBuckets=65536
   [junit4]   2> 781824 INFO  (coreLoadExecutor-2413-thread-1) [    ] o.a.s.u.CommitTracker Hard AutoCommit: disabled
   [junit4]   2> 781825 INFO  (coreLoadExecutor-2413-thread-1) [    ] o.a.s.u.CommitTracker Soft AutoCommit: disabled
   [junit4]   2> 781826 INFO  (coreLoadExecutor-2413-thread-1) [    ] o.a.s.u.RandomMergePolicy RandomMergePolicy wrapping class org.apache.lucene.index.TieredMergePolicy: [TieredMergePolicy: maxMergeAtOnce=25, maxMergeAtOnceExplicit=23, maxMergedSegmentMB=59.5517578125, floorSegmentMB=1.6826171875, forceMergeDeletesPctAllowed=26.64468603247428, segmentsPerTier=17.0, maxCFSSegmentSizeMB=8.796093022207999E12, noCFSRatio=0.0
   [junit4]   2> 781840 INFO  (coreLoadExecutor-2413-thread-1) [    ] o.a.s.s.SolrIndexSearcher Opening [Searcher@a59901[collection1] main]
   [junit4]   2> 781841 INFO  (coreLoadExecutor-2413-thread-1) [    ] o.a.s.r.ManagedResourceStorage Configured ZooKeeperStorageIO with znodeBase: /configs/conf1
   [junit4]   2> 781841 INFO  (coreLoadExecutor-2413-thread-1) [    ] o.a.s.r.ManagedResourceStorage Loaded null at path _rest_managed.json using ZooKeeperStorageIO:path=/configs/conf1
   [junit4]   2> 781841 INFO  (coreLoadExecutor-2413-thread-1) [    ] o.a.s.h.ReplicationHandler Commits will be reserved for  10000
   [junit4]   2> 781842 INFO  (searcherExecutor-2414-thread-1) [    ] o.a.s.c.SolrCore [collection1] Registered new searcher Searcher@a59901[collection1] main{ExitableDirectoryReader(UninvertingDirectoryReader())}
   [junit4]   2> 781842 INFO  (coreLoadExecutor-2413-thread-1) [    ] o.a.s.u.UpdateLog Could not find max version in index or recent updates, using new clock 1552468123908571136
   [junit4]   2> 781846 INFO  (coreZkRegister-2406-thread-1) [    ] o.a.s.c.ShardLeaderElectionContext Enough replicas found to continue.
   [junit4]   2> 781846 INFO  (coreZkRegister-2406-thread-1) [    ] o.a.s.c.ShardLeaderElectionContext I may be the new leader - try and sync
   [junit4]   2> 781846 INFO  (coreZkRegister-2406-thread-1) [    ] o.a.s.c.SyncStrategy Sync replicas to http://127.0.0.1:40911/_/c/collection1/
   [junit4]   2> 781846 INFO  (coreZkRegister-2406-thread-1) [    ] o.a.s.c.SyncStrategy Sync Success - now sync replicas to me
   [junit4]   2> 781846 INFO  (coreZkRegister-2406-thread-1) [    ] o.a.s.c.SyncStrategy http://127.0.0.1:40911/_/c/collection1/ has no replicas
   [junit4]   2> 781849 INFO  (coreZkRegister-2406-thread-1) [    ] o.a.s.c.ShardLeaderElectionContext I am the new leader: http://127.0.0.1:40911/_/c/collection1/ shard1
   [junit4]   2> 781999 INFO  (coreZkRegister-2406-thread-1) [    ] o.a.s.c.ZkController I am the leader, no recovery necessary
   [junit4]   2> 782224 INFO  (TEST-ShardSplitTest.testSplitStaticIndexReplication-seed#[9948F3F46B1CCD3E]) [    ] o.a.s.c.c.ZkStateReader Updated live nodes from ZooKeeper... (0) -> (1)
   [junit4]   2> 782225 INFO  (TEST-ShardSplitTest.testSplitStaticIndexReplication-seed#[9948F3F46B1CCD3E]) [    ] o.a.s.c.s.i.ZkClientClusterStateProvider Cluster at 127.0.0.1:37606/solr ready
   [junit4]   2> 782225 INFO  (TEST-ShardSplitTest.testSplitStaticIndexReplication-seed#[9948F3F46B1CCD3E]) [    ] o.a.s.c.ChaosMonkey monkey: init - expire sessions:false cause connection loss:false
   [junit4]   2> 783199 INFO  (TEST-ShardSplitTest.testSplitStaticIndexReplication-seed#[9948F3F46B1CCD3E]) [    ] o.a.s.SolrTestCaseJ4 Writing core.properties file to /home/jenkins/workspace/Lucene-Solr-6.x-Linux/solr/build/solr-core/test/J0/temp/solr.cloud.ShardSplitTest_9948F3F46B1CCD3E-001/shard-1-001/cores/collection1
   [junit4]   2> 783201 INFO  (TEST-ShardSplitTest.testSplitStaticIndexReplication-seed#[9948F3F46B1CCD3E]) [    ] o.a.s.c.AbstractFullDistribZkTestBase create jetty 1 in directory /home/jenkins/workspace/Lucene-Solr-6.x-Linux/solr/build/solr-core/test/J0/temp/solr.cloud.ShardSplitTest_9948F3F46B1CCD3E-001/shard-1-001
   [junit4]   2> 783201 INFO  (TEST-ShardSplitTest.testSplitStaticIndexReplication-seed#[9948F3F46B1CCD3E]) [    ] o.e.j.s.Server jetty-9.3.14.v20161028
   [junit4]   2> 783202 INFO  (TEST-ShardSplitTest.testSplitStaticIndexReplication-seed#[9948F3F46B1CCD3E]) [    ] o.e.j.s.h.ContextHandler Started o.e.j.s.ServletContextHandler@1846a15{/_/c,null,AVAILABLE}
   [junit4]   2> 783202 INFO  (TEST-ShardSplitTest.testSplitStaticIndexReplication-seed#[9948F3F46B1CCD3E]) [    ] o.e.j.s.AbstractConnector Started ServerConnector@1d036c0{HTTP/1.1,[http/1.1]}{127.0.0.1:38048}
   [junit4]   2> 783202 INFO  (TEST-ShardSplitTest.testSplitStaticIndexReplication-seed#[9948F3F46B1CCD3E]) [    ] o.e.j.s.Server Started @786280ms
   [junit4]   2> 783203 INFO  (TEST-ShardSplitTest.testSplitStaticIndexReplication-seed#[9948F3F46B1CCD3E]) [    ] o.a.s.c.s.e.JettySolrRunner Jetty properties: {hostContext=/_/c, solrconfig=solrconfig.xml, solr.data.dir=/home/jenkins/workspace/Lucene-Solr-6.x-Linux/solr/build/solr-core/test/J0/temp/solr.cloud.ShardSplitTest_9948F3F46B1CCD3E-001/tempDir-001/jetty1, hostPort=38048, coreRootDirectory=/home/jenkins/workspace/Lucene-Solr-6.x-Linux/solr/build/solr-core/test/J0/temp/solr.cloud.ShardSplitTest_9948F3F46B1CCD3E-001/shard-1-001/cores}
   [junit4]   2> 783203 ERROR (TEST-ShardSplitTest.testSplitStaticIndexReplication-seed#[9948F3F46B1CCD3E]) [    ] o.a.s.s.StartupLoggingUtils Missing Java Option solr.log.dir. Logging may be missing or incomplete.
   [junit4]   2> 783203 INFO  (TEST-ShardSplitTest.testSplitStaticIndexReplication-seed#[9948F3F46B1CCD3E]) [    ] o.a.s.s.SolrDispatchFilter  ___      _       Welcome to Apache Solr? version 6.4.0
   [junit4]   2> 783203 INFO  (TEST-ShardSplitTest.testSplitStaticIndexReplication-seed#[9948F3F46B1CCD3E]) [    ] o.a.s.s.SolrDispatchFilter / __| ___| |_ _   Starting in cloud mode on port null
   [junit4]   2> 783203 INFO  (TEST-ShardSplitTest.testSplitStaticIndexReplication-seed#[9948F3F46B1CCD3E]) [    ] o.a.s.s.SolrDispatchFilter \__ \/ _ \ | '_|  Install dir: null
   [junit4]   2> 783203 INFO  (TEST-ShardSplitTest.testSplitStaticIndexReplication-seed#[9948F3F46B1CCD3E]) [    ] o.a.s.s.SolrDispatchFilter |___/\___/_|_|    Start time: 2016-11-30T23:36:18.172680Z
   [junit4]   2> 783209 INFO  (TEST-ShardSplitTest.testSplitStaticIndexReplication-seed#[9948F3F46B1CCD3E]) [    ] o.a.s.s.SolrDispatchFilter Loading solr.xml from SolrHome (not found in ZooKeeper)
   [junit4]   2> 783209 INFO  (TEST-ShardSplitTest.testSplitStaticIndexReplication-seed#[9948F3F46B1CCD3E]) [    ] o.a.s.c.SolrXmlConfig Loading container configuration from /home/jenkins/workspace/Lucene-Solr-6.x-Linux/solr/build/solr-core/test/J0/temp/solr.cloud.ShardSplitTest_9948F3F46B1CCD3E-001/shard-1-001/solr.xml
   [junit4]   2> 783215 INFO  (TEST-ShardSplitTest.testSplitStaticIndexReplication-seed#[9948F3F46B1CCD3E]) [    ] o.a.s.u.UpdateShardHandler Creating UpdateShardHandler HTTP client with params: socketTimeout=340000&connTimeout=45000&retry=true
   [junit4]   2> 783218 INFO  (TEST-ShardSplitTest.testSplitStaticIndexReplication-seed#[9948F3F46B1CCD3E]) [    ] o.a.s.c.ZkContainer Zookeeper client=127.0.0.1:37606/solr
   [junit4]   2> 783226 INFO  (TEST-ShardSplitTest.testSplitStaticIndexReplication-seed#[9948F3F46B1CCD3E]) [    ] o.a.s.c.c.ZkStateReader Updated live nodes from ZooKeeper... (0) -> (1)
   [junit4]   2> 783229 INFO  (TEST-ShardSplitTest.testSplitStaticIndexReplication-seed#[9948F3F46B1CCD3E]) [    ] o.a.s.c.ZkController Register node as live in ZooKeeper:/live_nodes/127.0.0.1:38048__%2Fc
   [junit4]   2> 783230 INFO  (zkCallback-653-thread-1) [    ] o.a.s.c.c.ZkStateReader Updated live nodes from ZooKeeper... (1) -> (2)
   [junit4]   2> 783231 INFO  (zkCallback-649-thread-2) [    ] o.a.s.c.c.ZkStateReader Updated live nodes from ZooKeeper... (1) -> (2)
   [junit4]   2> 783231 INFO  (zkCallback-658-thread-1) [    ] o.a.s.c.c.ZkStateReader Updated live nodes from ZooKeeper... (1) -> (2)
   [junit4]   2> 783420 INFO  (TEST-ShardSplitTest.testSplitStaticIndexReplication-seed#[9948F3F46B1CCD3E]) [    ] o.a.s.c.CorePropertiesLocator Found 1 core definitions underneath /home/jenkins/workspace/Lucene-Solr-6.x-Linux/solr/build/solr-core/test/J0/temp/solr.cloud.ShardSplitTest_9948F3F46B1CCD3E-001/shard-1-001/cores
   [junit4]   2> 783420 INFO  (TEST-ShardSplitTest.testSplitStaticIndexReplication-seed#[9948F3F46B1CCD3E]) [    ] o.a.s.c.CorePropertiesLocator Cores are: [collection1]
   [junit4]   2> 783422 INFO  (OverseerStateUpdate-97029256609333252-127.0.0.1:40911__%2Fc-n_0000000000) [    ] o.a.s.c.o.ReplicaMutator Assigning new node to shard shard=shard2
   [junit4]   2> 784429 WARN  (coreLoadExecutor-2424-thread-1) [    ] o.a.s.c.Config Beginning with Solr 5.5, <mergePolicy> is deprecated, use <mergePolicyFactory> instead.
   [junit4]   2> 784438 INFO  (coreLoadExecutor-2424-thread-1) [    ] o.a.s.c.SolrConfig Using Lucene MatchVersion: 6.4.0
   [junit4]   2> 784461 INFO  (coreLoadExecutor-2424-thread-1) [    ] o.a.s.s.IndexSchema [collection1] Schema name=test
   [junit4]   2> 784582 WARN  (coreLoadExecutor-2424-thread-1) [    ] o.a.s.s.IndexSchema [collection1] default search field in schema is text. WARNING: Deprecated, please use 'df' on request instead.
   [junit4]   2> 784585 INFO  (coreLoadExecutor-2424-thread-1) [    ] o.a.s.s.IndexSchema Loaded schema test/1.6 with uniqueid field id
   [junit4]   2> 784602 INFO  (coreLoadExecutor-2424-thread-1) [    ] o.a.s.c.CoreContainer Creating SolrCore 'collection1' using configuration from collection collection1
   [junit4]   2> 784602 INFO  (coreLoadExecutor-2424-thread-1) [    ] o.a.s.c.SolrCore [[collection1] ] Opening new SolrCore at [/home/jenkins/workspace/Lucene-Solr-6.x-Linux/solr/build/solr-core/test/J0/temp/solr.cloud.ShardSplitTest_9948F3F46B1CCD3E-001/shard-1-001/cores/collection1], dataDir=[/home/jenkins/workspace/Lucene-Solr-6.x-Linux/solr/build/solr-core/test/J0/temp/solr.cloud.ShardSplitTest_9948F3F46B1CCD3E-001/shard-1-001/cores/collection1/data/]
   [junit4]   2> 784602 INFO  (coreLoadExecutor-2424-thread-1) [    ] o.a.s.c.JmxMonitoredMap JMX monitoring is enabled. Adding Solr mbeans to JMX Server: com.sun.jmx.mbeanserver.JmxMBeanServer@181a399
   [junit4]   2> 784613 INFO  (coreLoadExecutor-2424-thread-1) [    ] o.a.s.u.RandomMergePolicy RandomMergePolicy wrapping class org.apache.lucene.index.TieredMergePolicy: [TieredMergePolicy: maxMergeAtOnce=20, maxMergeAtOnceExplicit=13, maxMergedSegmentMB=38.0576171875, floorSegmentMB=2.03125, forceMergeDeletesPctAllowed=4.892452297463343, segmentsPerTier=17.0, maxCFSSegmentSizeMB=1.10546875, noCFSRatio=0.19240325715882092
   [junit4]   2> 784717 WARN  (coreLoadExecutor-2424-thread-1) [    ] o.a.s.c.RequestHandlers INVALID paramSet a in requestHandler {type = requestHandler,name = /dump,class = DumpRequestHandler,args = {defaults={a=A,b=B}}}
   [junit4]   2> 784736 INFO  (coreLoadExecutor-2424-thread-1) [    ] o.a.s.u.UpdateHandler Using UpdateLog implementation: org.apache.solr.update.UpdateLog
   [junit4]   2> 784736 INFO  (coreLoadExecutor-2424-thread-1) [    ] o.a.s.u.UpdateLog Initializing UpdateLog: dataDir= defaultSyncLevel=FLUSH numRecordsToKeep=100 maxNumLogsToKeep=10 numVersionBuckets=65536
   [junit4]   2> 784738 INFO  (coreLoadExecutor-2424-thread-1) [    ] o.a.s.u.CommitTracker Hard AutoCommit: disabled
   [junit4]   2> 784738 INFO  (coreLoadExecutor-2424-thread-1) [    ] o.a.s.u.CommitTracker Soft AutoCommit: disabled
   [junit4]   2> 784741 INFO  (coreLoadExecutor-2424-thread-1) [    ] o.a.s.u.RandomMergePolicy RandomMergePolicy wrapping class org.apache.lucene.index.TieredMergePolicy: [TieredMergePolicy: maxMergeAtOnce=25, maxMergeAtOnceExplicit=23, maxMergedSegmentMB=59.5517578125, floorSegmentMB=1.6826171875, forceMergeDeletesPctAllowed=26.64468603247428, segmentsPerTier=17.0, maxCFSSegmentSizeMB=8.796093022207999E12, noCFSRatio=0.0
   [junit4]   2> 784743 INFO  (coreLoadExecutor-2424-thread-1) [    ] o.a.s.s.SolrIndexSearcher Opening [Searcher@5f7990[collection1] main]
   [junit4]   2> 784745 INFO  (coreLoadExecutor-2424-thread-1) [    ] o.a.s.r.ManagedResourceStorage Configured ZooKeeperStorageIO with znodeBase: /configs/conf1
   [junit4]   2> 784745 INFO  (coreLoadExecutor-2424-thread-1) [    ] o.a.s.r.ManagedResourceStorage Loaded null at path _rest_managed.json using ZooKeeperStorageIO:path=/configs/conf1
   [junit4]   2> 784745 INFO  (coreLoadExecutor-2424-thread-1) [    ] o.a.s.h.ReplicationHandler Commits will be reserved for  10000
   [junit4]   2> 784755 INFO  (searcherExecutor-2425-thread-1) [    ] o.a.s.c.SolrCore [collection1] Registered new searcher Searcher@5f7990[collection1] main{ExitableDirectoryReader(UninvertingDirectoryReader())}
   [junit4]   2> 784756 INFO  (coreLoadExecutor-2424-thread-1) [    ] o.a.s.u.UpdateLog Could not find max version in index or recent updates, using new clock 1552468126964121600
   [junit4]   2> 784762 INFO  (coreZkRegister-2419-thread-1) [    ] o.a.s.c.ShardLeaderElectionContext Enough replicas found to continue.
   [junit4]   2> 784762 INFO  (coreZkRegister-2419-thread-1) [    ] o.a.s.c.ShardLeaderElectionContext I may be the new leader - try and sync
   [junit4]   2> 784762 INFO  (coreZkRegister-2419-thread-1) [    ] o.a.s.c.SyncStrategy Sync replicas to http://127.0.0.1:38048/_/c/collection1/
   [junit4]   2> 784762 INFO  (coreZkRegister-2419-thread-1) [    ] o.a.s.c.SyncStrategy Sync Success - now sync replicas to me
   [junit4]   2> 784762 INFO  (coreZkRegister-2419-thread-1) [    ] o.a.s.c.SyncStrategy http://127.0.0.1:38048/_/c/collection1/ has no replicas
   [junit4]   2> 784765 INFO  (coreZkRegister-2419-thread-1) [    ] o.a.s.c.ShardLeaderElectionContext I am the new leader: http://127.0.0.1:38048/_/c/collection1/ shard2
   [junit4]   2> 784917 INFO  (coreZkRegister-2419-thread-1) [    ] o.a.s.c.ZkController I am the leader, no recovery necessary
   [junit4]   2> 786407 INFO  (TEST-ShardSplitTest.testSplitStaticIndexReplication-seed#[9948F3F46B1CCD3E]) [    ] o.a.s.SolrTestCaseJ4 Writing core.properties file to /home/jenkins/workspace/Lucene-Solr-6.x-Linux/solr/build/solr-core/test/J0/temp/solr.cloud.ShardSplitTest_9948F3F46B1CCD3E-001/shard-2-001/cores/collection1
   [junit4]   2> 786409 INFO  (TEST-ShardSplitTest.testSplitStaticIndexReplication-seed#[9948F3F46B1CCD3E]) [    ] o.a.s.c.AbstractFullDistribZkTestBase create jetty 2 in directory /home/jenkins/workspace/Lucene-Solr-6.x-Linux/solr/build/solr-core/test/J0/temp/solr.cloud.ShardSplitTest_9948F3F46B1CCD3E-001/shard-2-001
   [junit4]   2> 786409 INFO  (TEST-ShardSplitTest.testSplitStaticIndexReplication-seed#[9948F3F46B1CCD3E]) [    ] o.e.j.s.Server jetty-9.3.14.v20161028
   [junit4]   2> 786410 INFO  (TEST-ShardSplitTest.testSplitStaticIndexReplication-seed#[9948F3F46B1CCD3E]) [    ] o.e.j.s.h.ContextHandler Started o.e.j.s.ServletContextHandler@1f398d8{/_/c,null,AVAILABLE}
   [junit4]   2> 786411 INFO  (TEST-ShardSplitTest.testSplitStaticIndexReplication-seed#[9948F3F46B1CCD3E]) [    ] o.e.j.s.AbstractConnector Started ServerConnector@f2172{HTTP/1.1,[http/1.1]}{127.0.0.1:34934}
   [junit4]   2> 786411 INFO  (TEST-ShardSplitTest.testSplitStaticIndexReplication-seed#[9948F3F46B1CCD3E]) [    ] o.e.j.s.Server Started @789488ms
   [junit4]   2> 786411 INFO  (TEST-ShardSplitTest.testSplitStaticIndexReplication-seed#[9948F3F46B1CCD3E]) [    ] o.a.s.c.s.e.JettySolrRunner Jetty properties: {hostContext=/_/c, solrconfig=solrconfig.xml, solr.data.dir=/home/jenkins/workspace/Lucene-Solr-6.x-Linux/solr/build/solr-core/test/J0/temp/solr.cloud.ShardSplitTest_9948F3F46B1CCD3E-001/tempDir-001/jetty2, hostPort=34934, coreRootDirectory=/home/jenkins/workspace/Lucene-Solr-6.x-Linux/solr/build/solr-core/test/J0/temp/solr.cloud.ShardSplitTest_9948F3F46B1CCD3E-001/shard-2-001/cores}
   [junit4]   2> 786411 ERROR (TEST-ShardSplitTest.testSplitStaticIndexReplication-seed#[9948F3F46B1CCD3E]) [    ] o.a.s.s.StartupLoggingUtils Missing Java Option solr.log.dir. Logging may be missing or incomplete.
   [junit4]   2> 786411 INFO  (TEST-ShardSplitTest.testSplitStaticIndexReplication-seed#[9948F3F46B1CCD3E]) [    ] o.a.s.s.SolrDispatchFilter  ___      _       Welcome to Apache Solr? version 6.4.0
   [junit4]   2> 786412 INFO  (TEST-ShardSplitTest.testSplitStaticIndexReplication-seed#[9948F3F46B1CCD3E]) [    ] o.a.s.s.SolrDispatchFilter / __| ___| |_ _   Starting in cloud mode on port null
   [junit4]   2> 786412 INFO  (TEST-ShardSplitTest.testSplitStaticIndexReplication-seed#[9948F3F46B1CCD3E]) [    ] o.a.s.s.SolrDispatchFilter \__ \/ _ \ | '_|  Install dir: null
   [junit4]   2> 786412 INFO  (TEST-ShardSplitTest.testSplitStaticIndexReplication-seed#[9948F3F46B1CCD3E]) [    ] o.a.s.s.SolrDispatchFilter |___/\___/_|_|    Start time: 2016-11-30T23:36:21.381200Z
   [junit4]   2> 786415 INFO  (TEST-ShardSplitTest.testSplitStaticIndexReplication-seed#[9948F3F46B1CCD3E]) [    ] o.a.s.s.SolrDispatchFilter Loading solr.xml from SolrHome (not found in ZooKeeper)
   [junit4]   2> 786415 INFO  (TEST-ShardSplitTest.testSplitStaticIndexReplication-seed#[9948F3F46B1CCD3E]) [    ] o.a.s.c.SolrXmlConfig Loading container configuration from /home/jenkins/workspace/Lucene-Solr-6.x-Linux/solr/build/solr-core/test/J0/temp/solr.cloud.ShardSplitTest_9948F3F46B1CCD3E-001/shard-2-001/solr.xml
   [junit4]   2> 786438 INFO  (TEST-ShardSplitTest.testSplitStaticIndexReplication-seed#[9948F3F46B1CCD3E]) [    ] o.a.s.u.UpdateShardHandler Creating UpdateShardHandler HTTP client with params: socketTimeout=340000&connTimeout=45000&retry=true
   [junit4]   2> 786442 INFO  (TEST-ShardSplitTest.testSplitStaticIndexReplication-seed#[9948F3F46B1CCD3E]) [    ] o.a.s.c.ZkContainer Zookeeper client=127.0.0.1:37606/solr
   [junit4]   2> 786462 INFO  (TEST-ShardSplitTest.testSplitStaticIndexReplication-seed#[9948F3F46B1CCD3E]) [    ] o.a.s.c.c.ZkStateReader Updated live nodes from ZooKeeper... (0) -> (2)
   [junit4]   2> 786465 INFO  (TEST-ShardSplitTest.testSplitStaticIndexReplication-seed#[9948F3F46B1CCD3E]) [    ] o.a.s.c.ZkController Register node as live in ZooKeeper:/live_nodes/127.0.0.1:34934__%2Fc
   [junit4]   2> 786467 INFO  (zkCallback-649-thread-2) [    ] o.a.s.c.c.ZkStateReader Updated live nodes from ZooKeeper... (2) -> (3)
   [junit4]   2> 786467 INFO  (zkCallback-658-thread-1) [    ] o.a.s.c.c.ZkStateReader Updated live nodes from ZooKeeper... (2) -> (3)
   [junit4]   2> 786467 INFO  (zkCallback-653-thread-1) [    ] o.a.s.c.c.ZkStateReader Updated live nodes from ZooKeeper... (2) -> (3)
   [junit4]   2> 786480 INFO  (zkCallback-664-thread-1) [    ] o.a.s.c.c.ZkStateReader Updated live nodes from ZooKeeper... (2) -> (3)
   [junit4]   2> 786615 INFO  (TEST-ShardSplitTest.testSplitStaticIndexReplication-seed#[9948F3F46B1CCD3E]) [    ] o.a.s.c.CorePropertiesLocator Found 1 core definitions underneath /home/jenkins/workspace/Lucene-Solr-6.x-Linux/solr/build/solr-core/test/J0/temp/solr.cloud.ShardSplitTest_9948F3F46B1CCD3E-001/shard-2-001/cores
   [junit4]   2> 786615 INFO  (TEST-ShardSplitTest.testSplitStaticIndexReplication-seed#[9948F3F46B1CCD3E]) [    ] o.a.s.c.CorePropertiesLocator Cores are: [collection1]
   [junit4]   2> 786617 INFO  (OverseerStateUpdate-97029256609333252-127.0.0.1:40911__%2Fc-n_0000000000) [    ] o.a.s.c.o.ReplicaMutator Assigning new node to shard shard=shard1
   [junit4]   2> 787630 WARN  (coreLoadExecutor-2435-thread-1) [    ] o.a.s.c.Config Beginning with Solr 5.5, <mergePolicy> is deprecated, use <mergePolicyFactory> instead.
   [junit4]   2> 787631 INFO  (coreLoadExecutor-2435-thread-1) [    ] o.a.s.c.SolrConfig Using Lucene MatchVersion: 6.4.0
   [junit4]   2> 787651 INFO  (coreLoadExecutor-2435-thread-1) [    ] o.a.s.s.IndexSchema [collection1] Schema name=test
   [junit4]   2> 787721 WARN  (coreLoadExecutor-2435-thread-1) [    ] o.a.s.s.IndexSchema [collection1] default search field in schema is text. WARNING: Deprecated, please use 'df' on request instead.
   [junit4]   2> 787722 INFO  (coreLoadExecutor-2435-thread-1) [    ] o.a.s.s.IndexSchema Loaded schema test/1.6 with uniqueid field id
   [junit4]   2> 787730 INFO  (coreLoadExecutor-2435-thread-1) [    ] o.a.s.c.CoreContainer Creating SolrCore 'collection1' using configuration from collection collection1
   [junit4]   2> 787731 INFO  (coreLoadExecutor-2435-thread-1) [    ] o.a.s.c.SolrCore [[collection1] ] Opening new SolrCore at [/home/jenkins/workspace/Lucene-Solr-6.x-Linux/solr/build/solr-core/test/J0/temp/solr.cloud.ShardSplitTest_9948F3F46B1CCD3E-001/shard-2-001/cores/collection1], dataDir=[/home/jenkins/workspace/Lucene-Solr-6.x-Linux/solr/build/solr-core/test/J0/temp/solr.cloud.ShardSplitTest_9948F3F46B1CCD3E-001/shard-2-001/cores/collection1/data/]
   [junit4]   2> 787731 INFO  (coreLoadExecutor-2435-thread-1) [    ] o.a.s.c.JmxMonitoredMap JMX monitoring is enabled. Adding Solr mbeans to JMX Server: com.sun.jmx.mbeanserver.JmxMBeanServer@181a399
   [junit4]   2> 787745 INFO  (coreLoadExecutor-2435-thread-1) [    ] o.a.s.u.RandomMergePolicy RandomMergePolicy wrapping class org.apache.lucene.index.TieredMergePolicy: [TieredMergePolicy: maxMergeAtOnce=20, maxMergeAtOnceExplicit=13, maxMergedSegmentMB=38.0576171875, floorSegmentMB=2.03125, forceMergeDeletesPctAllowed=4.892452297463343, segmentsPerTier=17.0, maxCFSSegmentSizeMB=1.10546875, noCFSRatio=0.19240325715882092
   [junit4]   2> 787785 WARN  (coreLoadExecutor-2435-thread-1) [    ] o.a.s.c.RequestHandlers INVALID paramSet a in requestHandler {type = requestHandler,name = /dump,class = DumpRequestHandler,args = {defaults={a=A,b=B}}}
   [junit4]   2> 787796 INFO  (coreLoadExecutor-2435-thread-1) [    ] o.a.s.u.UpdateHandler Using UpdateLog implementation: org.apache.solr.update.UpdateLog
   [junit4]   2> 787796 INFO  (coreLoadExecutor-2435-thread-1) [    ] o.a.s.u.UpdateLog Initializing UpdateLog: dataDir= defaultSyncLevel=FLUSH numRecordsToKeep=100 maxNumLogsToKeep=10 numVersionBuckets=65536
   [junit4]   2> 787798 INFO  (coreLoadExecutor-2435-thread-1) [    ] o.a.s.u.CommitTracker Hard AutoCommit: disabled
   [junit4]   2> 787798 INFO  (coreLoadExecutor-2435-thread-1) [    ] o.a.s.u.CommitTracker Soft AutoCommit: disabled
   [junit4]   2> 787801 INFO  (coreLoadExecutor-2435-thread-1) [    ] o.a.s.u.RandomMergePolicy RandomMergePolicy wrapping class org.apache.lucene.index.TieredMergePolicy: [TieredMergePolicy: maxMergeAtOnce=25, maxMergeAtOnceExplicit=23, maxMergedSegmentMB=59.5517578125, floorSegmentMB=1.6826171875, forceMergeDeletesPctAllowed=26.64468603247428, segmentsPerTier=17.0, maxCFSSegmentSizeMB=8.796093022207999E12, noCFSRatio=0.0
   [junit4]   2> 787804 INFO  (coreLoadExecutor-2435-thread-1) [    ] o.a.s.s.SolrIndexSearcher Opening [Searcher@1e6b1bf[collection1] main]
   [junit4]   2> 787805 INFO  (coreLoadExecutor-2435-thread-1) [    ] o.a.s.r.ManagedResourceStorage Configured ZooKeeperStorageIO with znodeBase: /configs/conf1
   [junit4]   2> 787805 INFO  (coreLoadExecutor-2435-thread-1) [    ] o.a.s.r.ManagedResourceStorage Loaded null at path _rest_managed.json using ZooKeeperStorageIO:path=/configs/conf1
   [junit4]   2> 787805 INFO  (coreLoadExecutor-2435-thread-1) [    ] o.a.s.h.ReplicationHandler Commits will be reserved for  10000
   [junit4]   2> 787806 INFO  (searcherExecutor-2436-thread-1) [    ] o.a.s.c.SolrCore [collection1] Registered new searcher Searcher@1e6b1bf[collection1] main{ExitableDirectoryReader(UninvertingDirectoryReader())}
   [junit4]   2> 787806 INFO  (coreLoadExecutor-2435-thread-1) [    ] o.a.s.u.UpdateLog Could not find max version in index or recent updates, using new clock 1552468130162278400
   [junit4]   2> 787811 INFO  (coreZkRegister-2430-thread-1) [    ] o.a.s.c.ShardLeaderElectionContext Enough replicas found to continue.
   [junit4]   2> 787811 INFO  (coreZkRegister-2430-thread-1) [    ] o.a.s.c.ShardLeaderElectionContext I may be the new leader - try and sync
   [junit4]   2> 787811 INFO  (coreZkRegister-2430-thread-1) [    ] o.a.s.c.SyncStrategy Sync replicas to http://127.0.0.1:34934/_/c/collection1/
   [junit4]   2> 787811 INFO  (coreZkRegister-2430-thread-1) [    ] o.a.s.c.SyncStrategy Sync Success - now sync replicas to me
   [junit4]   2> 787811 INFO  (coreZkRegister-2430-thread-1) [    ] o.a.s.c.SyncStrategy http://127.0.0.1:34934/_/c/collection1/ has no replicas
   [junit4]   2> 787814 INFO  (coreZkRegister-2430-thread-1) [    ] o.a.s.c.ShardLeaderElectionContext I am the new leader: http://127.0.0.1:34934/_/c/collection1/ shard1
   [junit4]   2> 787964 INFO  (coreZkRegister-2430-thread-1) [    ] o.a.s.c.ZkController I am the leader, no recovery necessary
   [junit4]   2> 789330 INFO  (TEST-ShardSplitTest.testSplitStaticIndexReplication-seed#[9948F3F46B1CCD3E]) [    ] o.a.s.SolrTestCaseJ4 Writing core.properties file to /home/jenkins/workspace/Lucene-Solr-6.x-Linux/solr/build/solr-core/test/J0/temp/solr.cloud.ShardSplitTest_9948F3F46B1CCD3E-001/shard-3-001/cores/collection1
   [junit4]   2> 789331 INFO  (TEST-ShardSplitTest.testSplitStaticIndexReplication-seed#[9948F3F46B1CCD3E]) [    ] o.a.s.c.AbstractFullDistribZkTestBase create jetty 3 in directory /home/jenkins/workspace/Lucene-Solr-6.x-Linux/solr/build/solr-core/test/J0/temp/solr.cloud.ShardSplitTest_9948F3F46B1CCD3E-001/shard-3-001
   [junit4]   2> 789332 INFO  (TEST-ShardSplitTest.testSplitStaticIndexReplication-seed#[9948F3F46B1CCD3E]) [    ] o.e.j.s.Server jetty-9.3.14.v20161028
   [junit4]   2> 789338 INFO  (TEST-ShardSplitTest.testSplitStaticIndexReplication-seed#[9948F3F46B1CCD3E]) [    ] o.e.j.s.h.ContextHandler Started o.e.j.s.ServletContextHandler@891610{/_/c,null,AVAILABLE}
   [junit4]   2> 789339 INFO  (TEST-ShardSplitTest.testSplitStaticIndexReplication-seed#[9948F3F46B1CCD3E]) [    ] o.e.j.s.AbstractConnector Started ServerConnector@1e217df{HTTP/1.1,[http/1.1]}{127.0.0.1:41054}
   [junit4]   2> 789339 INFO  (TEST-ShardSplitTest.testSplitStaticIndexReplication-seed#[9948F3F46B1CCD3E]) [    ] o.e.j.s.Server Started @792417ms
   [junit4]   2> 789339 INFO  (TEST-ShardSplitTest.testSplitStaticIndexReplication-seed#[9948F3F46B1CCD3E]) [    ] o.a.s.c.s.e.JettySolrRunner Jetty properties: {hostContext=/_/c, solrconfig=solrconfig.xml, solr.data.dir=/home/jenkins/workspace/Lucene-Solr-6.x-Linux/solr/build/solr-core/test/J0/temp/solr.cloud.ShardSplitTest_9948F3F46B1CCD3E-001/tempDir-001/jetty3, hostPort=41054, coreRootDirectory=/home/jenkins/workspace/Lucene-Solr-6.x-Linux/solr/build/solr-core/test/J0/temp/solr.cloud.ShardSplitTest_9948F3F46B1CCD3E-001/shard-3-001/cores}
   [junit4]   2> 789339 ERROR (TEST-ShardSplitTest.testSplitStaticIndexReplication-seed#[9948F3F46B1CCD3E]) [    ] o.a.s.s.StartupLoggingUtils Missing Java Option solr.log.dir. Logging may be missing or incomplete.
   [junit4]   2> 789340 INFO  (TEST-ShardSplitTest.testSplitStaticIndexReplication-seed#[9948F3F46B1CCD3E]) [    ] o.a.s.s.SolrDispatchFilter  ___      _       Welcome to Apache Solr? version 6.4.0
   [junit4]   2> 789340 INFO  (TEST-ShardSplitTest.testSplitStaticIndexReplication-seed#[9948F3F46B1CCD3E]) [    ] o.a.s.s.SolrDispatchFilter / __| ___| |_ _   Starting in cloud mode on port null
   [junit4]   2> 789340 INFO  (TEST-ShardSplitTest.testSplitStaticIndexReplication-seed#[9948F3F46B1CCD3E]) [    ] o.a.s.s.SolrDispatchFilter \__ \/ _ \ | '_|  Install dir: null
   [junit4]   2> 789340 INFO  (TEST-ShardSplitTest.testSplitStaticIndexReplication-seed#[9948F3F46B1CCD3E]) [    ] o.a.s.s.SolrDispatchFilter |___/\___/_|_|    Start time: 2016-11-30T23:36:24.309305Z
   [junit4]   2> 789342 INFO  (TEST-ShardSplitTest.testSplitStaticIndexReplication-seed#[9948F3F46B1CCD3E]) [    ] o.a.s.s.SolrDispatchFilter Loading solr.xml from SolrHome (not found in ZooKeeper)
   [junit4]   2> 789342 INFO  (TEST-ShardSplitTest.testSplitStaticIndexReplication-seed#[9948F3F46B1CCD3E]) [    ] o.a.s.c.SolrXmlConfig Loading container configuration from /home/jenkins/workspace/Lucene-Solr-6.x-Linux/solr/build/solr-core/test/J0/temp/solr.cloud.ShardSplitTest_9948F3F46B1CCD3E-001/shard-3-001/solr.xml
   [junit4]   2> 789349 INFO  (TEST-ShardSplitTest.testSplitStaticIndexReplication-seed#[9948F3F46B1CCD3E]) [    ] o.a.s.u.UpdateShardHandler Creating UpdateShardHandler HTTP client with params: socketTimeout=340000&connTimeout=45000&retry=true
   [junit4]   2> 789350 INFO  (TEST-ShardSplitTest.testSplitStaticIndexReplication-seed#[9948F3F46B1CCD3E]) [    ] o.a.s.c.ZkContainer Zookeeper client=127.0.0.1:37606/solr
   [junit4]   2> 789355 INFO  (TEST-ShardSplitTest.testSplitStaticIndexReplication-seed#[9948F3F46B1CCD3E]) [    ] o.a.s.c.c.ZkStateReader Updated live nodes from ZooKeeper... (0) -> (3)
   [junit4]   2> 789357 INFO  (TEST-ShardSplitTest.testSplitStaticIndexReplication-seed#[9948F3F46B1CCD3E]) [    ] o.a.s.c.ZkController Register node as live in ZooKeeper:/live_nodes/127.0.0.1:41054__%2Fc
   [junit4]   2> 789358 INFO  (zkCallback-649-thread-2) [    ] o.a.s.c.c.ZkStateReader Updated live nodes from ZooKeeper... (3) -> (4)
   [junit4]   2> 789358 INFO  (zkCallback-658-thread-1) [    ] o.a.s.c.c.ZkStateReader Updated live nodes from ZooKeeper... (3) -> (4)
   [junit4]   2> 789358 INFO  (zkCallback-664-thread-1) [    ] o.a.s.c.c.ZkStateReader Updated live nodes from ZooKeeper... (3) -> (4)
   [junit4]   2> 789358 INFO  (zkCallback-653-thread-1) [    ] o.a.s.c.c.ZkStateReader Updated live nodes from ZooKeeper... (3) -> (4)
   [junit4]   2> 789358 INFO  (zkCallback-670-thread-1) [    ] o.a.s.c.c.ZkStateReader Updated live nodes from ZooKeeper... (3) -> (4)
   [junit4]   2> 789430 INFO  (TEST-ShardSplitTest.testSplitStaticIndexReplication-seed#[9948F3F46B1CCD3E]) [    ] o.a.s.c.CorePropertiesLocator Found 1 core definitions underneath /home/jenkins/workspace/Lucene-Solr-6.x-Linux/solr/build/solr-core/test/J0/temp/solr.cloud.ShardSplitTest_9948F3F46B1CCD3E-001/shard-3-001/cores
   [junit4]   2> 789430 INFO  (TEST-ShardSplitTest.testSplitStaticIndexReplication-seed#[9948F3F46B1CCD3E]) [    ] o.a.s.c.CorePropertiesLocator Cores are: [collection1]
   [junit4]   2> 789432 INFO  (OverseerStateUpdate-97029256609333252-127.0.0.1:40911__%2Fc-n_0000000000) [    ] o.a.s.c.o.ReplicaMutator Assigning new node to shard shard=shard2
   [junit4]   2> 790441 WARN  (coreLoadExecutor-2446-thread-1) [    ] o.a.s.c.Config Beginning with Solr 5.5, <mergePolicy> is deprecated, use <mergePolicyFactory> instead.
   [junit4]   2> 790442 INFO  (coreLoadExecutor-2446-thread-1) [    ] o.a.s.c.SolrConfig Using Lucene MatchVersion: 6.4.0
   [junit4]   2> 790453 INFO  (coreLoadExecutor-2446-thread-1) [    ] o.a.s.s.IndexSchema [collection1] Schema name=test
   [junit4]   2> 790512 WARN  (coreLoadExecutor-2446-thread-1) [    ] o.a.s.s.IndexSchema [collection1] default search field in schema is text. WARNING: Deprecated, please use 'df' on request instead.
   [junit4]   2> 790520 INFO  (coreLoadExecutor-2446-thread-1) [    ] o.a.s.s.IndexSchema Loaded schema test/1.6 with uniqueid field id
   [junit4]   2> 790527 INFO  (coreLoadExecutor-2446-thread-1) [    ] o.a.s.c.CoreContainer Creating SolrCore 'collection1' using configuration from collection collection1
   [junit4]   2> 790527 INFO  (coreLoadExecutor-2446-thread-1) [    ] o.a.s.c.SolrCore [[collection1] ] Opening new SolrCore at [/home/jenkins/workspace/Lucene-Solr-6.x-Linux/solr/build/solr-core/test/J0/temp/solr.cloud.ShardSplitTest_9948F3F46B1CCD3E-001/shard-3-001/cores/collection1], dataDir=[/home/jenkins/workspace/Lucene-Solr-6.x-Linux/solr/build/solr-core/test/J0/temp/solr.cloud.ShardSplitTest_9948F3F46B1CCD3E-001/shard-3-001/cores/collection1/data/]
   [junit4]   2> 790527 INFO  (coreLoadExecutor-2446-thread-1) [    ] o.a.s.c.JmxMonitoredMap JMX monitoring is enabled. Adding Solr mbeans to JMX Server: com.sun.jmx.mbeanserver.JmxMBeanServer@181a399
   [junit4]   2> 790533 INFO  (coreLoadExecutor-2446-thread-1) [    ] o.a.s.u.RandomMergePolicy RandomMergePolicy wrapping class org.apache.lucene.index.TieredMergePolicy: [TieredMergePolicy: maxMergeAtOnce=20, maxMergeAtOnceExplicit=13, maxMergedSegmentMB=38.0576171875, floorSegmentMB=2.03125, forceMergeDeletesPctAllowed=4.892452297463343, segmentsPerTier=17.0, maxCFSSegmentSizeMB=1.10546875, noCFSRatio=0.19240325715882092
   [junit4]   2> 790587 WARN  (coreLoadExecutor-2446-thread-1) [    ] o.a.s.c.RequestHandlers INVALID paramSet a in requestHandler {type = requestHandler,name = /dump,class = DumpRequestHandler,args = {defaults={a=A,b=B}}}
   [junit4]   2> 790593 INFO  (coreLoadExecutor-2446-thread-1) [    ] o.a.s.u.UpdateHandler Using UpdateLog implementation: org.apache.solr.update.UpdateLog
   [junit4]   2> 790593 INFO  (coreLoadExecutor-2446-thread-1) [    ] o.a.s.u.UpdateLog Initializing UpdateLog: dataDir= defaultSyncLevel=FLUSH numRecordsToKeep=100 maxNumLogsToKeep=10 numVersionBuckets=65536
   [junit4]   2> 790597 INFO  (coreLoadExecutor-2446-thread-1) [    ] o.a.s.u.CommitTracker Hard AutoCommit: disabled
   [junit4]   2> 790597 INFO  (coreLoadExecutor-2446-thread-1) [    ] o.a.s.u.CommitTracker Soft AutoCommit: disabled
   [junit4]   2> 790598 INFO  (coreLoadExecutor-2446-thread-1) [    ] o.a.s.u.RandomMergePolicy RandomMergePolicy wrapping class org.apache.lucene.index.TieredMergePolicy: [TieredMergePolicy: maxMergeAtOnce=25, maxMergeAtOnceExplicit=23, maxMergedSegmentMB=59.5517578125, floorSegmentMB=1.6826171875, forceMergeDeletesPctAllowed=26.64468603247428, segmentsPerTier=17.0, maxCFSSegmentSizeMB=8.796093022207999E12, noCFSRatio=0.0
   [junit4]   2> 790600 INFO  (coreLoadExecutor-2446-thread-1) [    ] o.a.s.s.SolrIndexSearcher Opening [Searcher@a438f7[collection1] main]
   [junit4]   2> 790600 INFO  (coreLoadExecutor-2446-thread-1) [    ] o.a.s.r.ManagedResourceStorage Configured ZooKeeperStorageIO with znodeBase: /configs/conf1
   [junit4]   2> 790601 INFO  (coreLoadExecutor-2446-thread-1) [    ] o.a.s.r.ManagedResourceStorage Loaded null at path _rest_managed.json using ZooKeeperStorageIO:path=/configs/conf1
   [junit4]   2> 790601 INFO  (coreLoadExecutor-2446-thread-1) [    ] o.a.s.h.ReplicationHandler Commits will be reserved for  10000
   [junit4]   2> 790601 INFO  (searcherExecutor-2447-thread-1) [    ] o.a.s.c.SolrCore [collection1] Registered new searcher Searcher@a438f7[collection1] main{ExitableDirectoryReader(UninvertingDirectoryReader())}
   [junit4]   2> 790601 INFO  (coreLoadExecutor-2446-thread-1) [    ] o.a.s.u.UpdateLog Could not find max version in index or recent updates, using new clock 1552468133093048320
   [junit4]   2> 790604 INFO  (coreZkRegister-2441-thread-1) [    ] o.a.s.c.ZkController Core needs to recover:collection1
   [junit4]   2> 790604 INFO  (updateExecutor-667-thread-1) [    ] o.a.s.u.DefaultSolrCoreState Running recovery
   [junit4]   2> 790605 INFO  (recoveryExecutor-668-thread-1) [    ] o.a.s.c.RecoveryStrategy Starting recovery process. recoveringAfterStartup=true
   [junit4]   2> 790605 INFO  (recoveryExecutor-668-thread-1) [    ] o.a.s.c.RecoveryStrategy ###### startupVersions=[[]]
   [junit4]   2> 790605 INFO  (recoveryExecutor-668-thread-1) [    ] o.a.s.c.RecoveryStrategy Begin buffering updates. core=[collection1]
   [junit4]   2> 790605 INFO  (recoveryExecutor-668-thread-1) [    ] o.a.s.u.UpdateLog Starting to buffer updates. FSUpdateLog{state=ACTIVE, tlog=null}
   [junit4]   2> 790605 INFO  (recoveryExecutor-668-thread-1) [    ] o.a.s.c.RecoveryStrategy Publishing state of core [collection1] as recovering, leader is [http://127.0.0.1:38048/_/c/collection1/] and I am [http://127.0.0.1:41054/_/c/collection1/]
   [junit4]   2> 790607 INFO  (recoveryExecutor-668-thread-1) [    ] o.a.s.c.RecoveryStrategy Sending prep recovery command to [http://127.0.0.1:38048/_/c]; [WaitForState: action=PREPRECOVERY&core=collection1&nodeName=127.0.0.1:41054__%252Fc&coreNodeName=core_node3&state=recovering&checkLive=true&onlyIfLeader=true&onlyIfLeaderActive=true]
   [junit4]   2> 790610 INFO  (qtp19153141-4833) [    ] o.a.s.h.a.PrepRecoveryOp Going to wait for coreNodeName: core_node3, state: recovering, checkLive: true, onlyIfLeader: true, onlyIfLeaderActive: true
   [junit4]   2> 790611 INFO  (qtp19153141-4833) [    ] o.a.s.h.a.PrepRecoveryOp Will wait a max of 183 seconds to see collection1 (shard2 of collection1) have state: recovering
   [junit4]   2> 790611 INFO  (qtp19153141-4833) [    ] o.a.s.h.a.PrepRecoveryOp In WaitForState(recovering): collection=collection1, shard=shard2, thisCore=collection1, leaderDoesNotNeedRecovery=false, isLeader? true, live=true, checkLive=true, currentState=down, localState=active, nodeName=127.0.0.1:41054__%2Fc, coreNodeName=core_node3, onlyIfActiveCheckResult=false, nodeProps: core_node3:{"core":"collection1","base_url":"http://127.0.0.1:41054/_/c","node_name":"127.0.0.1:41054__%2Fc","state":"down"}
   [junit4]   2> 791611 INFO  (qtp19153141-4833) [    ] o.a.s.h.a.PrepRecoveryOp In WaitForState(recovering): collection=collection1, shard=shard2, thisCore=collection1, leaderDoesNotNeedRecovery=false, isLeader? true, live=true, checkLive=true, currentState=recovering, localState=active, nodeName=127.0.0.1:41054__%2Fc, coreNodeName=core_node3, onlyIfActiveCheckResult=false, nodeProps: core_node3:{"core":"collection1","base_url":"http://127.0.0.1:41054/_/c","node_name":"127.0.0.1:41054__%2Fc","state":"recovering"}
   [junit4]   2> 791611 INFO  (qtp19153141-4833) [    ] o.a.s.h.a.PrepRecoveryOp Waited coreNodeName: core_node3, state: recovering, checkLive: true, onlyIfLeader: true for: 1 seconds.
   [junit4]   2> 791611 INFO  (qtp19153141-4833) [    ] o.a.s.s.HttpSolrCall [admin] webapp=null path=/admin/cores params={nodeName=127.0.0.1:41054__%252Fc&onlyIfLeaderActive=true&core=collection1&coreNodeName=core_node3&action=PREPRECOVERY&checkLive=true&state=recovering&onlyIfLeader=true&wt=javabin&version=2} status=0 QTime=1000
   [junit4]   2> 791925 INFO  (TEST-ShardSplitTest.testSplitStaticIndexReplication-seed#[9948F3F46B1CCD3E]) [    ] o.a.s.SolrTestCaseJ4 Writing core.properties file to /home/jenkins/workspace/Lucene-Solr-6.x-Linux/solr/build/solr-core/test/J0/temp/solr.cloud.ShardSplitTest_9948F3F46B1CCD3E-001/shard-4-001/cores/collection1
   [junit4]   2> 791926 INFO  (TEST-ShardSplitTest.testSplitStaticIndexReplication-seed#[9948F3F46B1CCD3E]) [    ] o.a.s.c.AbstractFullDistribZkTestBase create jetty 4 in directory /home/jenkins/workspace/Lucene-Solr-6.x-Linux/solr/build/solr-core/test/J0/temp/solr.cloud.ShardSplitTest_9948F3F46B1CCD3E-001/shard-4-001
   [junit4]   2> 791926 INFO  (TEST-ShardSplitTest.testSplitStaticIndexReplication-seed#[9948F3F46B1CCD3E]) [    ] o.e.j.s.Server jetty-9.3.14.v20161028
   [junit4]   2> 791927 INFO  (TEST-ShardSplitTest.testSplitStaticIndexReplication-seed#[9948F3F46B1CCD3E]) [    ] o.e.j.s.h.ContextHandler Started o.e.j.s.ServletContextHandler@c03fd1{/_/c,null,AVAILABLE}
   [junit4]   2> 791928 INFO  (TEST-ShardSplitTest.testSplitStaticIndexReplication-seed#[9948F3F46B1CCD3E]) [    ] o.e.j.s.AbstractConnector Started ServerConnector@1c79db9{HTTP/1.1,[http/1.1]}{127.0.0.1:33624}
   [junit4]   2> 791928 INFO  (TEST-ShardSplitTest.testSplitStaticIndexReplication-seed#[9948F3F46B1CCD3E]) [    ] o.e.j.s.Server Started @795006ms
   [junit4]   2> 791928 INFO  (TEST-ShardSplitTest.testSplitStaticIndexReplication-seed#[9948F3F46B1CCD3E]) [    ] o.a.s.c.s.e.JettySolrRunner Jetty properties: {hostContext=/_/c, solrconfig=solrconfig.xml, solr.data.dir=/home/jenkins/workspace/Lucene-Solr-6.x-Linux/solr/build/solr-core/test/J0/temp/solr.cloud.ShardSplitTest_9948F3F46B1CCD3E-001/tempDir-001/jetty4, hostPort=33624, coreRootDirectory=/home/jenkins/workspace/Lucene-Solr-6.x-Linux/solr/build/solr-core/test/J0/../../../../../../../../../home/jenkins/workspace/Lucene-Solr-6.x-Linux/solr/build/solr-core/test/J0/temp/solr.cloud.ShardSplitTest_9948F3F46B1CCD3E-001/shard-4-001/cores}
   [junit4]   2> 791928 ERROR (TEST-ShardSplitTest.testSplitStaticIndexReplication-seed#[9948F3F46B1CCD3E]) [    ] o.a.s.s.StartupLoggingUtils Missing Java Option solr.log.dir. Logging may be missing or incomplete.
   [junit4]   2> 791929 INFO  (TEST-ShardSplitTest.testSplitStaticIndexReplication-seed#[9948F3F46B1CCD3E]) [    ] o.a.s.s.SolrDispatchFilter  ___      _       Welcome to Apache Solr? version 6.4.0
   [junit4]   2> 791929 INFO  (TEST-ShardSplitTest.testSplitStaticIndexReplication-seed#[9948F3F46B1CCD3E]) [    ] o.a.s.s.SolrDispatchFilter / __| ___| |_ _   Starting in cloud mode on port null
   [junit4]   2> 791929 INFO  (TEST-ShardSplitTest.testSplitStaticIndexReplication-seed#[9948F3F46B1CCD3E]) [    ] o.a.s.s.SolrDispatchFilter \__ \/ _ \ | '_|  Install dir: null
   [junit4]   2> 791929 INFO  (TEST-ShardSplitTest.testSplitStaticIndexReplication-seed#[9948F3F46B1CCD3E]) [    ] o.a.s.s.SolrDispatchFilter |___/\___/_|_|    Start time: 2016-11-30T23:36:26.898335Z
   [junit4]   2> 791931 INFO  (TEST-ShardSplitTest.testSplitStaticIndexReplication-seed#[9948F3F46B1CCD3E]) [    ] o.a.s.s.SolrDispatchFilter Loading solr.xml from SolrHome (not found in ZooKeeper)
   [junit4]   2> 791931 INFO  (TEST-ShardSplitTest.testSplitStaticIndexReplication-seed#[9948F3F46B1CCD3E]) [    ] o.a.s.c.SolrXmlConfig Loading container configuration from /home/jenkins/workspace/Lucene-Solr-6.x-Linux/solr/build/solr-core/test/J0/temp/solr.cloud.ShardSplitTest_9948F3F46B1CCD3E-001/shard-4-001/solr.xml
   [junit4]   2> 791937 INFO  (TEST-ShardSplitTest.testSplitStaticIndexReplication-seed#[9948F3F46B1CCD3E]) [    ] o.a.s.u.UpdateShardHandler Creating UpdateShardHandler HTTP client with params: socketTimeout=340000&connTimeout=45000&retry=true
   [junit4]   2> 791938 INFO  (TEST-ShardSplitTest.testSplitStaticIndexReplication-seed#[9948F3F46B1CCD3E]) [    ] o.a.s.c.ZkContainer Zookeeper client=127.0.0.1:37606/solr
   [junit4]   2> 791951 INFO  (TEST-ShardSplitTest.testSplitStaticIndexReplication-seed#[9948F3F46B1CCD3E]) [    ] o.a.s.c.c.ZkStateReader Updated live nodes from ZooKeeper... (0) -> (4)
   [junit4]   2> 791954 INFO  (TEST-ShardSplitTest.testSplitStaticIndexReplication-seed#[9948F3F46B1CCD3E]) [    ] o.a.s.c.ZkController Register node as live in ZooKeeper:/live_nodes/127.0.0.1:33624__%2Fc
   [junit4]   2> 791955 INFO  (zkCallback-670-thread-1) [    ] o.a.s.c.c.ZkStateReader Updated live nodes from ZooKeeper... (4) -> (5)
   [junit4]   2> 791955 INFO  (zkCallback-649-thread-1) [    ] o.a.s.c.c.ZkStateReader Updated live nodes from ZooKeeper... (4) -> (5)
   [junit4]   2> 791955 INFO  (zkCallback-658-thread-1) [    ] o.a.s.c.c.ZkStateReader Updated live nodes from ZooKeeper... (4) -> (5)
   [junit4]   2> 791955 INFO  (zkCallback-664-thread-1) [    ] o.a.s.c.c.ZkStateReader Updated live nodes from ZooKeeper... (4) -> (5)
   [junit4]   2> 791955 INFO  (zkCallback-677-thread-1) [    ] o.a.s.c.c.ZkStateReader Updated live nodes from ZooKeeper... (4) -> (5)
   [junit4]   2> 791955 INFO  (zkCallback-653-thread-1) [    ] o.a.s.c.c.ZkStateReader Updated live nodes from ZooKeeper... (4) -> (5)
   [junit4]   2> 792008 INFO  (TEST-ShardSplitTest.testSplitStaticIndexReplication-seed#[9948F3F46B1CCD3E]) [    ] o.a.s.c.CorePropertiesLocator Found 1 core definitions underneath /home/jenkins/workspace/Lucene-Solr-6.x-Linux/solr/build/solr-core/test/J0/../../../../../../../../../home/jenkins/workspace/Lucene-Solr-6.x-Linux/solr/build/solr-core/test/J0/temp/solr.cloud.ShardSplitTest_9948F3F46B1CCD3E-001/shard-4-001/cores
   [junit4]   2> 792008 INFO  (TEST-ShardSplitTest.testSplitStaticIndexReplication-seed#[9948F3F46B1CCD3E]) [    ] o.a.s.c.CorePropertiesLocator Cores are: [collection1]
   [junit4]   2> 792011 INFO  (OverseerStateUpdate-97029256609333252-127.0.0.1:40911__%2Fc-n_0000000000) [    ] o.a.s.c.o.ReplicaMutator Assigning new node to shard shard=shard1
   [junit4]   2> 793017 WARN  (coreLoadExecutor-2457-thread-1) [    ] o.a.s.c.Config Beginning with Solr 5.5, <mergePolicy> is deprecated, use <mergePolicyFactory> instead.
   [junit4]   2> 793018 INFO  (coreLoadExecutor-2457-thread-1) [    ] o.a.s.c.SolrConfig Using Lucene MatchVersion: 6.4.0
   [junit4]   2> 793040 INFO  (coreLoadExecutor-2457-thread-1) [    ] o.a.s.s.IndexSchema [collection1] Schema name=test
   [junit4]   2> 793169 WARN  (coreLoadExecutor-2457-thread-1) [    ] o.a.s.s.IndexSchema [collection1] default search field in schema is text. WARNING: Deprecated, please use 'df' on request instead.
   [junit4]   2> 793170 INFO  (coreLoadExecutor-2457-thread-1) [    ] o.a.s.s.IndexSchema Loaded schema test/1.6 with uniqueid field id
   [junit4]   2> 793181 INFO  (coreLoadExecutor-2457-thread-1) [    ] o.a.s.c.CoreContainer Creating SolrCore 'collection1' using configuration from collection collection1
   [junit4]   2> 793182 INFO  (coreLoadExecutor-2457-thread-1) [    ] o.a.s.c.SolrCore [[collection1] ] Opening new SolrCore at [/home/jenkins/workspace/Lucene-Solr-6.x-Linux/solr/build/solr-core/test/J0/temp/solr.cloud.ShardSplitTest_9948F3F46B1CCD3E-001/shard-4-001/cores/collection1], dataDir=[/home/jenkins/workspace/Lucene-Solr-6.x-Linux/solr/build/solr-core/test/J0/../../../../../../../../../home/jenkins/workspace/Lucene-Solr-6.x-Linux/solr/build/solr-core/test/J0/temp/solr.cloud.ShardSplitTest_9948F3F46B1CCD3E-001/shard-4-001/cores/collection1/data/]
   [junit4]   2> 793182 INFO  (coreLoadExecutor-2457-thread-1) [    ] o.a.s.c.JmxMonitoredMap JMX monitoring is enabled. Adding Solr mbeans to JMX Server: com.sun.jmx.mbeanserver.JmxMBeanServer@181a399
   [junit4]   2> 793193 INFO  (coreLoadExecutor-2457-thread-1) [    ] o.a.s.u.RandomMergePolicy RandomMergePolicy wrapping class org.apache.lucene.index.TieredMergePolicy: [TieredMergePolicy: maxMergeAtOnce=20, maxMergeAtOnceExplicit=13, maxMergedSegmentMB=38.0576171875, floorSegmentMB=2.03125, forceMergeDeletesPctAllowed=4.892452297463343, segmentsPerTier=17.0, maxCFSSegmentSizeMB=1.10546875, noCFSRatio=0.19240325715882092
   [junit4]   2> 793261 WARN  (coreLoadExecutor-2457-thread-1) [    ] o.a.s.c.RequestHandlers INVALID paramSet a in requestHandler {type = requestHandler,name = /dump,class = DumpRequestHandler,args = {defaults={a=A,b=B}}}
   [junit4]   2> 793273 INFO  (coreLoadExecutor-2457-thread-1) [    ] o.a.s.u.UpdateHandler Using UpdateLog implementation: org.apache.solr.update.UpdateLog
   [junit4]   2> 793273 INFO  (coreLoadExecutor-2457-thread-1) [    ] o.a.s.u.UpdateLog Initializing UpdateLog: dataDir= defaultSyncLevel=FLUSH numRecordsToKeep=100 maxNumLogsToKeep=10 numVersionBuckets=65536
   [junit4]   2> 793276 INFO  (coreLoadExecutor-2457-thread-1) [    ] o.a.s.u.CommitTracker Hard AutoCommit: disabled
   [junit4]   2> 793276 INFO  (coreLoadExecutor-2457-thread-1) [    ] o.a.s.u.CommitTracker Soft AutoCommit: disabled
   [junit4]   2> 793277 INFO  (coreLoadExecutor-2457-thread-1) [    ] o.a.s.u.RandomMergePolicy RandomMergePolicy wrapping class org.apache.lucene.index.TieredMergePolicy: [TieredMergePolicy: maxMergeAtOnce=25, maxMergeAtOnceExplicit=23, maxMergedSegmentMB=59.5517578125, floorSegmentMB=1.6826171875, forceMergeDeletesPctAllowed=26.64468603247428, segmentsPerTier=17.0, maxCFSSegmentSizeMB=8.796093022207999E12, noCFSRatio=0.0
   [junit4]   2> 793280 INFO  (coreLoadExecutor-2457-thread-1) [    ] o.a.s.s.SolrIndexSearcher Opening [Searcher@18540e9[collection1] main]
   [junit4]   2> 793281 INFO  (coreLoadExecutor-2457-thread-1) [    ] o.a.s.r.ManagedResourceStorage Configured ZooKeeperStorageIO with znodeBase: /configs/conf1
   [junit4]   2> 793281 INFO  (coreLoadExecutor-2457-thread-1) [    ] o.a.s.r.ManagedResourceStorage Loaded null at path _rest_managed.json using ZooKeeperStorageIO:path=/configs/conf1
   [junit4]   2> 793281 INFO  (coreLoadExecutor-2457-thread-1) [    ] o.a.s.h.ReplicationHandler Commits will be reserved for  10000
   [junit4]   2> 793282 INFO  (searcherExecutor-2458-thread-1) [    ] o.a.s.c.SolrCore [collection1] Registered new searcher Searcher@18540e9[collection1] main{ExitableDirectoryReader(UninvertingDirectoryReader())}
   [junit4]   2> 793282 INFO  (coreLoadExecutor-2457-thread-1) [    ] o.a.s.u.UpdateLog Could not find max version in index or recent updates, using new clock 1552468135904280576
   [junit4]   2> 793286 INFO  (coreZkRegister-2452-thread-1) [    ] o.a.s.c.ZkController Core needs to recover:collection1
   [junit4]   2> 793286 INFO  (updateExecutor-674-thread-1) [    ] o.a.s.u.DefaultSolrCoreState Running recovery
   [junit4]   2> 793286 INFO  (recoveryExecutor-675-thread-1) [    ] o.a.s.c.RecoveryStrategy Starting recovery process. recoveringAfterStartup=true
   [junit4]   2> 793287 INFO  (recoveryExecutor-675-thread-1) [    ] o.a.s.c.RecoveryStrategy ###### startupVersions=[[]]
   [junit4]   2> 793287 INFO  (recoveryExecutor-675-thread-1) [    ] o.a.s.c.RecoveryStrategy Begin buffering updates. core=[collection1]
   [junit4]   2> 793287 INFO  (recoveryExecutor-675-thread-1) [    ] o.a.s.u.UpdateLog Starting to buffer updates. FSUpdateLog{state=ACTIVE, tlog=null}
   [junit4]   2> 793287 INFO  (recoveryExecutor-675-thread-1) [    ] o.a.s.c.RecoveryStrategy Publishing state of core [collection1] as recovering, leader is [http://127.0.0.1:34934/_/c/collection1/] and I am [http://127.0.0.1:33624/_/c/collection1/]
   [junit4]   2> 793290 INFO  (recoveryExecutor-675-thread-1) [    ] o.a.s.c.RecoveryStrategy Sending prep recovery command to [http://127.0.0.1:34934/_/c]; [WaitForState: action=PREPRECOVERY&core=collection1&nodeName=127.0.0.1:33624__%252Fc&coreNodeName=core_node4&state=recovering&checkLive=true&onlyIfLeader=true&onlyIfLeaderActive=true]
   [junit4]   2> 793291 INFO  (qtp7548227-4858) [    ] o.a.s.h.a.PrepRecoveryOp Going to wait for coreNodeName: core_node4, state: recovering, checkLive: true, onlyIfLeader: true, onlyIfLeaderActive: true
   [junit4]   2> 793291 INFO  (qtp7548227-4858) [    ] o.a.s.h.a.PrepRecoveryOp Will wait a max of 183 seconds to see collection1 (shard1 of collection1) have state: recovering
   [junit4]   2> 793292 INFO  (qtp7548227-4858) [    ] o.a.s.h.a.PrepRecoveryOp In WaitForState(recovering): collection=collection1, shard=shard1, thisCore=collection1, leaderDoesNotNeedRecovery=false, isLeader? true, live=true, checkLive=true, currentState=down, localState=active, nodeName=127.0.0.1:33624__%2Fc, coreNodeName=core_node4, onlyIfActiveCheckResult=false, nodeProps: core_node4:{"core":"collection1","base_url":"http://127.0.0.1:33624/_/c","node_name":"127.0.0.1:33624__%2Fc","state":"down"}
   [junit4]   2> 793513 INFO  (TEST-ShardSplitTest.testSplitStaticIndexReplication-seed#[9948F3F46B1CCD3E]) [    ] o.a.s.SolrTestCaseJ4 ###Starting testSplitStaticIndexReplication
   [junit4]   2> 793513 INFO  (TEST-ShardSplitTest.testSplitStaticIndexReplication-seed#[9948F3F46B1CCD3E]) [    ] o.a.s.c.AbstractFullDistribZkTestBase Wait for recoveries to finish - wait 15 for each attempt
   [junit4]   2> 793513 INFO  (TEST-ShardSplitTest.testSplitStaticIndexReplication-seed#[9948F3F46B1CCD3E]) [    ] o.a.s.c.AbstractDistribZkTestBase Wait for recoveries to finish - collection: collection1 failOnTimeout:true timeout (sec):15
   [junit4]   2> 794292 INFO  (qtp7548227-4858) [    ] o.a.s.h.a.PrepRecoveryOp In WaitForState(recovering): collection=collection1, shard=shard1, thisCore=collection1, leaderDoesNotNeedRecovery=false, isLeader? true, live=true, checkLive=true, currentState=recovering, localState=active, nodeName=127.0.0.1:33624__%2Fc, coreNodeName=core_node4, onlyIfActiveCheckResult=false, nodeProps: core_node4:{"core":"collection1","base_url":"http://127.0.0.1:33624/_/c","node_name":"127.0.0.1:33624__%2Fc","state":"recovering"}
   [junit4]   2> 794292 INFO  (qtp7548227-4858) [    ] o.a.s.h.a.PrepRecoveryOp Waited coreNodeName: core_node4, state: recovering, checkLive: true, onlyIfLeader: true for: 1 seconds.
   [junit4]   2> 794292 INFO  (qtp7548227-4858) [    ] o.a.s.s.HttpSolrCall [admin] webapp=null path=/admin/cores params={nodeName=127.0.0.1:33624__%252Fc&onlyIfLeaderActive=true&core=collection1&coreNodeName=core_node4&action=PREPRECOVERY&checkLive=true&state=recovering&onlyIfLeader=true&wt=javabin&version=2} status=0 QTime=1001
   [junit4]   2> 798611 INFO  (recoveryExecutor-668-thread-1) [    ] o.a.s.c.RecoveryStrategy Attempting to PeerSync from [http://127.0.0.1:38048/_/c/collection1/] - recoveringAfterStartup=[true]
   [junit4]   2> 798611 INFO  (recoveryExecutor-668-thread-1) [    ] o.a.s.u.PeerSync PeerSync: core=collection1 url=http://127.0.0.1:41054/_/c START replicas=[http://127.0.0.1:38048/_/c/collection1/] nUpdates=100
   [junit4]   2> 798620 INFO  (qtp19153141-4833) [    ] o.a.s.u.IndexFingerprint IndexFingerprint millis:1.0 result:{maxVersionSpecified=9223372036854775807, maxVersionEncountered=0, maxInHash=0, versionsHash=0, numVersions=0, numDocs=0, maxDoc=0}
   [junit4]   2> 798620 INFO  (qtp19153141-4833) [    ] o.a.s.c.S.Request [collection1]  webapp=/_/c path=/get params={distrib=false&qt=/get&getFingerprint=9223372036854775807&wt=javabin&version=2} status=0 QTime=1
   [junit4]   2> 798621 INFO  (recoveryExecutor-668-thread-1) [    ] o.a.s.u.IndexFingerprint IndexFingerprint millis:0.0 result:{maxVersionSpecified=9223372036854775807, maxVersionEncountered=0, maxInHash=0, versionsHash=0, numVersions=0, numDocs=0, maxDoc=0}
   [junit4]   2> 798621 INFO  (recoveryExecutor-668-thread-1) [    ] o.a.s.u.PeerSync We are already in sync. No need to do a PeerSync 
   [junit4]   2> 798621 INFO  (recoveryExecutor-668-thread-1) [    ] o.a.s.u.DirectUpdateHandler2 start commit{,optimize=false,openSearcher=true,waitSearcher=true,expungeDeletes=false,softCommit=false,prepareCommit=false}
   [junit4]   2> 798621 INFO  (recoveryExecutor-668-thread-1) [    ] o.a.s.u.DirectUpdateHandler2 No uncommitted changes. Skipping IW.commit.
   [junit4]   2> 798622 INFO  (recoveryExecutor-668-thread-1) [    ] o.a.s.u.DirectUpdateHandler2 end_commit_flush
   [junit4]   2> 798622 INFO  (recoveryExecutor-668-thread-1) [    ] o.a.s.c.RecoveryStrategy PeerSync stage of recovery was successful.
   [junit4]   2> 798622 INFO  (recoveryExecutor-668-thread-1) [    ] o.a.s.c.RecoveryStrategy Replaying updates buffered during PeerSync.
   [junit4]   2> 798622 INFO  (recoveryExecutor-668-thread-1) [    ] o.a.s.c.RecoveryStrategy No replay needed.
   [junit4]   2> 798622 INFO  (recoveryExecutor-668-thread-1) [    ] o.a.s.c.RecoveryStrategy Registering as Active after recovery.
   [junit4]   2> 801292 INFO  (recoveryExecutor-675-thread-1) [    ] o.a.s.c.RecoveryStrategy Attempting to PeerSync from [http://127.0.0.1:34934/_/c/collection1/] - recoveringAfterStartup=[true]
   [junit4]   2> 801293 INFO  (recoveryExecutor-675-thread-1) [    ] o.a.s.u.PeerSync PeerSync: core=collection1 url=http://127.0.0.1:33624/_/c START replicas=[http://127.0.0.1:34934/_/c/collection1/] nUpdates=100
   [junit4]   2> 801296 INFO  (qtp7548227-4854) [    ] o.a.s.u.IndexFingerprint IndexFingerprint millis:2.0 result:{maxVersionSpecified=9223372036854775807, maxVersionEncountered=0, maxInHash=0, versionsHash=0, numVersions=0, numDocs=0, maxDoc=0}
   [junit4]   2> 801297 INFO  (qtp7548227-4854) [    ] o.a.s.c.S.Request [collection1]  webapp=/_/c path=/get params={distrib=false&qt=/get&getFingerprint=9223372036854775807&wt=javabin&version=2} status=0 QTime=2
   [junit4]   2> 801298 INFO  (recoveryExecutor-675-thread-1) [    ] o.a.s.u.IndexFingerprint IndexFingerprint millis:1.0 result:{maxVersionSpecified=9223372036854775807, maxVersionEncountered=0, maxInHash=0, versionsHash=0, numVersions=0, numDocs=0, maxDoc=0}
   [junit4]   2> 801298 INFO  (recoveryExecutor-675-thread-1) [    ] o.a.s.u.PeerSync We are already in sync. No need to do a PeerSync 
   [junit4]   2> 801298 INFO  (recoveryExecutor-675-thread-1) [    ] o.a.s.u.DirectUpdateHandler2 start commit{,optimize=false,openSearcher=true,waitSearcher=true,expungeDeletes=false,softCommit=false,prepareCommit=false}
   [junit4]   2> 801298 INFO  (recoveryExecutor-675-thread-1) [    ] o.a.s.u.DirectUpdateHandler2 No uncommitted changes. Skipping IW.commit.
   [junit4]   2> 801299 INFO  (recoveryExecutor-675-thread-1) [    ] o.a.s.u.DirectUpdateHandler2 end_commit_flush
   [junit4]   2> 801299 INFO  (recoveryExecutor-675-thread-1) [    ] o.a.s.c.RecoveryStrategy PeerSync stage of recovery was successful.
   [junit4]   2> 801299 INFO  (recoveryExecutor-675-thread-1) [    ] o.a.s.c.RecoveryStrategy Replaying updates buffered during PeerSync.
   [junit4]   2> 801299 INFO  (recoveryExecutor-675-thread-1) [    ] o.a.s.c.RecoveryStrategy No replay needed.
   [junit4]   2> 801299 INFO  (recoveryExecutor-675-thread-1) [    ] o.a.s.c.RecoveryStrategy Registering as Active after recovery.
   [junit4]   2> 801514 INFO  (TEST-ShardSplitTest.testSplitStaticIndexReplication-seed#[9948F3F46B1CCD3E]) [    ] o.a.s.c.AbstractDistribZkTestBase Recoveries finished - collection: collection1
   [junit4]   2> 801515 INFO  (qtp31199889-4793) [    ] o.a.s.u.DirectUpdateHandler2 start commit{,optimize=false,openSearcher=true,waitSearcher=true,expungeDeletes=false,softCommit=false,prepareCommit=false}
   [junit4]   2> 801515 INFO  (qtp31199889-4793) [    ] o.a.s.u.DirectUpdateHandler2 No uncommitted changes. Skipping IW.commit.
   [junit4]   2> 801517 INFO  (qtp31199889-4793) [    ] o.a.s.u.DirectUpdateHandler2 end_commit_flush
   [junit4]   2> 801517 INFO  (qtp31199889-4793) [    ] o.a.s.u.p.LogUpdateProcessorFactory [collection1]  webapp=/_/c path=/update params={waitSearcher=true&commit=true&softCommit=false&wt=javabin&version=2}{commit=} 0 2
   [junit4]   2> 801521 INFO  (qtp19153141-4825) [    ] o.a.s.u.DirectUpdateHandler2 start commit{,optimize=false,openSearcher=true,waitSearcher=true,expungeDeletes=false,softCommit=false,prepareCommit=false}
   [junit4]   2> 801521 INFO  (qtp19153141-4825) [    ] o.a.s.u.DirectUpdateHandler2 No uncommitted changes. Skipping IW.commit.
   [junit4]   2> 801521 INFO  (qtp7548227-4856) [    ] o.a.s.u.DirectUpdateHandler2 start commit{,optimize=false,openSearcher=true,waitSearcher=true,expungeDeletes=false,softCommit=false,prepareCommit=false}
   [junit4]   2> 801524 INFO  (qtp2026950-4886) [    ] o.a.s.u.DirectUpdateHandler2 start commit{,optimize=false,openSearcher=true,waitSearcher=true,expungeDeletes=false,softCommit=false,prepareCommit=false}
   [junit4]   2> 801525 INFO  (qtp19153141-4825) [    ] o.a.s.u.DirectUpdateHandler2 end_commit_flush
   [junit4]   2> 801525 INFO  (qtp7548227-4856) [    ] o.a.s.u.DirectUpdateHandler2 No uncommitted changes. Skipping IW.commit.
   [junit4]   2> 801526 INFO  (qtp19153141-4825) [    ] o.a.s.u.p.LogUpdateProcessorFactory [collection1]  webapp=/_/c path=/update params={update.distrib=FROMLEADER&waitSearcher=true&openSearcher=true&commit=true&softCommit=false&distrib.from=http://127.0.0.1:38048/_/c/collection1/&commit_end_point=true&wt=javabin&version=2&expungeDeletes=false}{commit=} 0 5
   [junit4]   2> 801526 INFO  (qtp29693281-4922) [    ] o.a.s.u.DirectUpdateHandler2 start commit{,optimize=false,openSearcher=true,waitSearcher=true,expungeDeletes=false,softCommit=false,prepareCommit=false}
   [junit4]   2> 801527 INFO  (qtp2026950-4886) [    ] o.a.s.u.DirectUpdateHandler2 No uncommitted changes. Skipping IW.commit.
   [junit4]   2> 801527 INFO  (qtp29693281-4922) [    ] o.a.s.u.DirectUpdateHandler2 No uncommitted changes. Skipping IW.commit.
   [junit4]   2> 801529 INFO  (qtp7548227-4856) [    ] o.a.s.u.DirectUpdateHandler2 end_commit_flush
   [junit4]   2> 801529 INFO  (qtp7548227-4856) [    ] o.a.s.u.p.LogUpdateProcessorFactory [collection1]  webapp=/_/c path=/update params={update.distrib=FROMLEADER&waitSearcher=true&openSearcher=true&commit=true&softCommit=false&distrib.from=http://127.0.0.1:38048/_/c/collection1/&commit_end_point=true&wt=javabin&version=2&expungeDeletes=false}{commit=} 0 8
   [junit4]   2> 801529 INFO  (qtp2026950-4886) [    ] o.a.s.u.DirectUpdateHandler2 end_commit_flush
   [junit4]   2> 801529 INFO  (qtp2026950-4886) [    ] o.a.s.u.p.LogUpdateProcessorFactory [collection1]  webapp=/_/c path=/update params={update.distrib=FROMLEADER&waitSearcher=true&openSearcher=true&commit=true&softCommit=false&distrib.from=http://127.0.0.1:38048/_/c/collection1/&commit_end_point=true&wt=javabin&version=2&expungeDeletes=false}{commit=} 0 5
   [junit4]   2> 801530 INFO  (qtp29693281-4922) [    ] o.a.s.u.DirectUpdateHandler2 end_commit_flush
   [junit4]   2> 801530 INFO  (qtp29693281-4922) [    ] o.a.s.u.p.LogUpdateProcessorFactory [collection1]  webapp=/_/c path=/update params={update.distrib=FROMLEADER&waitSearcher=true&openSearcher=true&commit=true&softCommit=false&distrib.from=http://127.0.0.1:38048/_/c/collection1/&commit_end_point=true&wt=javabin&version=2&expungeDeletes=false}{commit=} 0 4
   [junit4]   2> 801530 INFO  (qtp19153141-4824) [    ] o.a.s.u.p.LogUpdateProcessorFactory [collection1]  webapp=/_/c path=/update params={waitSearcher=true&commit=true&softCommit=false&wt=javabin&version=2}{commit=} 0 12
   [junit4]   2> 801532 INFO  (qtp19153141-4833) [    ] o.a.s.c.S.Request [collection1]  webapp=/_/c path=/select params={q=*:*&distrib=false&tests=checkShardConsistency&rows=0&wt=javabin&version=2} hits=0 status=0 QTime=0
   [junit4]   2> 801533 INFO  (qtp2026950-4887) [    ] o.a.s.c.S.Request [collection1]  webapp=/_/c path=/select params={q=*:*&distrib=false&tests=checkShardConsistency&rows=0&wt=javabin&version=2} hits=0 status=0 QTime=0
   [junit4]   2> 801534 INFO  (qtp7548227-4857) [    ] o.a.s.c.S.Request [collection1]  webapp=/_/c path=/select params={q=*:*&distrib=false&tests=checkShardConsistency&rows=0&wt=javabin&version=2} hits=0 status=0 QTime=0
   [junit4]   2> 801535 INFO  (qtp29693281-4916) [    ] o.a.s.c.S.Request [collection1]  webapp=/_/c path=/select params={q=*:*&distrib=false&tests=checkShardConsistency&rows=0&wt=javabin&version=2} hits=0 status=0 QTime=0
   [junit4]   2> 803536 INFO  (qtp29693281-4915) [    ] o.a.s.h.a.CollectionsHandler Invoked Collection Action :create with params replicationFactor=1&collection.configName=conf1&maxShardsPerNode=5&name=testSplitStaticIndexReplication&action=CREATE&numShards=1&createNodeSet=127.0.0.1:34934__%252Fc&wt=javabin&version=2 and sendToOCPQueue=true
   [junit4]   2> 803537 INFO  (OverseerThreadFactory-2411-thread-1) [    ] o.a.s.c.CreateCollectionCmd Create collection testSplitStaticIndexReplication
   [junit4]   2> 803641 INFO  (qtp7548227-4859) [    ] o.a.s.h.a.CoreAdminOperation core create command qt=/admin/cores&collection.configName=conf1&newCollection=true&name=testSplitStaticIndexReplication_shard1_replica1&action=CREATE&numShards=1&collection=testSplitStaticIndexReplication&shard=shard1&wt=javabin&version=2
   [junit4]   2> 803744 INFO  (zkCallback-664-thread-1) [    ] o.a.s.c.c.ZkStateReader A cluster state change: [WatchedEvent state:SyncConnected type:NodeDataChanged path:/collections/testSplitStaticIndexReplication/state.json] for collection [testSplitStaticIndexReplication] has occurred - updating... (live nodes size: [5])
   [junit4]   2> 804658 WARN  (qtp7548227-4859) [    ] o.a.s.c.Config Beginning with Solr 5.5, <mergePolicy> is deprecated, use <mergePolicyFactory> instead.
   [junit4]   2> 804659 INFO  (qtp7548227-4859) [    ] o.a.s.c.SolrConfig Using Lucene MatchVersion: 6.4.0
   [junit4]   2> 804671 INFO  (qtp7548227-4859) [    ] o.a.s.s.IndexSchema [testSplitStaticIndexReplication_shard1_replica1] Schema name=test
   [junit4]   2> 804727 WARN  (qtp7548227-4859) [    ] o.a.s.s.IndexSchema [testSplitStaticIndexReplication_shard1_replica1] default search field in schema is text. WARNING: Deprecated, please use 'df' on request instead.
   [junit4]   2> 804728 INFO  (qtp7548227-4859) [    ] o.a.s.s.IndexSchema Loaded schema test/1.6 with uniqueid field id
   [junit4]   2> 804736 INFO  (qtp7548227-4859) [    ] o.a.s.c.CoreContainer Creating SolrCore 'testSplitStaticIndexReplication_shard1_replica1' using configuration from collection testSplitStaticIndexReplication
   [junit4]   2> 804736 INFO  (qtp7548227-4859) [    ] o.a.s.c.SolrCore [[testSplitStaticIndexReplication_shard1_replica1] ] Opening new SolrCore at [/home/jenkins/workspace/Lucene-Solr-6.x-Linux/solr/build/solr-core/test/J0/temp/solr.cloud.ShardSplitTest_9948F3F46B1CCD3E-001/shard-2-001/cores/testSplitStaticIndexReplication_shard1_replica1], dataDir=[/home/jenkins/workspace/Lucene-Solr-6.x-Linux/solr/build/solr-core/test/J0/temp/solr.cloud.ShardSplitTest_9948F3F46B1CCD3E-001/shard-2-001/cores/testSplitStaticIndexReplication_shard1_replica1/data/]
   [junit4]   2> 804736 INFO  (qtp7548227-4859) [    ] o.a.s.c.JmxMonitoredMap JMX monitoring is enabled. Adding Solr mbeans to JMX Server: com.sun.jmx.mbeanserver.JmxMBeanServer@181a399
   [junit4]   2> 804752 INFO  (qtp7548227-4859) [    ] o.a.s.u.RandomMergePolicy RandomMergePolicy wrapping class org.apache.lucene.index.TieredMergePolicy: [TieredMergePolicy: maxMergeAtOnce=20, maxMergeAtOnceExplicit=13, maxMergedSegmentMB=38.0576171875, floorSegmentMB=2.03125, forceMergeDeletesPctAllowed=4.892452297463343, segmentsPerTier=17.0, maxCFSSegmentSizeMB=1.10546875, noCFSRatio=0.19240325715882092
   [junit4]   2> 804798 WARN  (qtp7548227-4859) [    ] o.a.s.c.RequestHandlers INVALID paramSet a in requestHandler {type = requestHandler,name = /dump,class = DumpRequestHandler,args = {defaults={a=A,b=B}}}
   [junit4]   2> 804803 INFO  (qtp7548227-4859) [    ] o.a.s.u.UpdateHandler Using UpdateLog implementation: org.apache.solr.update.UpdateLog
   [junit4]   2> 804803 INFO  (qtp7548227-4859) [    ] o.a.s.u.UpdateLog Initializing UpdateLog: dataDir= defaultSyncLevel=FLUSH numRecordsToKeep=100 maxNumLogsToKeep=10 numVersionBuckets=65536
   [junit4]   2> 804805 INFO  (qtp7548227-4859) [    ] o.a.s.u.CommitTracker Hard AutoCommit: disabled
   [junit4]   2> 804805 INFO  (qtp7548227-4859) [    ] o.a.s.u.CommitTracker Soft AutoCommit: disabled
   [junit4]   2> 804806 INFO  (qtp7548227-4859) [    ] o.a.s.u.RandomMergePolicy RandomMergePolicy wrapping class org.apache.lucene.index.TieredMergePolicy: [TieredMergePolicy: maxMergeAtOnce=25, maxMergeAtOnceExplicit=23, maxMergedSegmentMB=59.5517578125, floorSegmentMB=1.6826171875, forceMergeDeletesPctAllowed=26.64468603247428, segmentsPerTier=17.0, maxCFSSegmentSizeMB=8.796093022207999E12, noCFSRatio=0.0
   [junit4]   2> 804809 INFO  (qtp7548227-4859) [    ] o.a.s.s.SolrIndexSearcher Opening [Searcher@a30be9[testSplitStaticIndexReplication_shard1_replica1] main]
   [junit4]   2> 804809 INFO  (qtp7548227-4859) [    ] o.a.s.r.ManagedResourceStorage Configured ZooKeeperStorageIO with znodeBase: /configs/conf1
   [junit4]   2> 804810 INFO  (qtp7548227-4859) [    ] o.a.s.r.ManagedResourceStorage Loaded null at path _rest_managed.json using ZooKeeperStorageIO:path=/configs/conf1
   [junit4]   2> 804810 INFO  (qtp7548227-4859) [    ] o.a.s.h.ReplicationHandler Commits will be reserved for  10000
   [junit4]   2> 804811 INFO  (searcherExecutor-2463-thread-1) [    ] o.a.s.c.SolrCore [testSplitStaticIndexReplication_shard1_replica1] Registered new searcher Searcher@a30be9[testSplitStaticIndexReplication_shard1_replica1] main{ExitableDirectoryReader(UninvertingDirectoryReader())}
   [junit4]   2> 804811 INFO  (qtp7548227-4859) [    ] o.a.s.u.UpdateLog Could not find max version in index or recent updates, using new clock 1552468147993313280
   [junit4]   2> 804815 INFO  (qtp7548227-4859) [    ] o.a.s.c.ShardLeaderElectionContext Enough replicas found to continue.
   [junit4]   2> 804815 INFO  (qtp7548227-4859) [    ] o.a.s.c.ShardLeaderElectionContext I may be the new leader - try and sync
   [junit4]   2> 804815 INFO  (qtp7548227-4859) [    ] o.a.s.c.SyncStrategy Sync replicas to http://127.0.0.1:34934/_/c/testSplitStaticIndexReplication_shard1_replica1/
   [junit4]   2> 804815 INFO  (qtp7548227-4859) [    ] o.a.s.c.SyncStrategy Sync Success - now sync replicas to me
   [junit4]   2> 804815 INFO  (qtp7548227-4859) [    ] o.a.s.c.SyncStrategy http://127.0.0.1:34934/_/c/testSplitStaticIndexReplication_shard1_replica1/ has no replicas
   [junit4]   2> 804818 INFO  (qtp7548227-4859) [    ] o.a.s.c.ShardLeaderElectionContext I am the new leader: http://127.0.0.1:34934/_/c/testSplitStaticIndexReplication_shard1_replica1/ shard1
   [junit4]   2> 804922 INFO  (zkCallback-664-thread-1) [    ] o.a.s.c.c.ZkStateReader A cluster state change: [WatchedEvent state:SyncConnected type:NodeDataChanged path:/collections/testSplitStaticIndexReplication/state.json] for collection [testSplitStaticIndexReplication] has occurred - updating... (live nodes size: [5])
   [junit4]   2> 804971 INFO  (qtp7548227-4859) [    ] o.a.s.c.ZkController I am the leader, no recovery necessary
   [junit4]   2> 804974 INFO  (qtp7548227-4859) [    ] o.a.s.s.HttpSolrCall [admin] webapp=null path=/admin/cores params={qt=/admin/cores&collection.configName=conf1&newCollection=true&name=testSplitStaticIndexReplication_shard1_replica1&action=CREATE&numShards=1&collection=testSplitStaticIndexReplication&shard=shard1&wt=javabin&version=2} status=0 QTime=1333
   [junit4]   2> 804977 INFO  (qtp29693281-4915) [    ] o.a.s.h.a.CollectionsHandler Wait for new collection to be active for at most 30 seconds. Check all shard replicas
   [junit4]   2> 805074 INFO  (zkCallback-664-thread-1) [    ] o.a.s.c.c.ZkStateReader A cluster state change: [WatchedEvent state:SyncConnected type:NodeDataChanged path:/collections/testSplitStaticIndexReplication/state.json] for collection [testSplitStaticIndexReplication] has occurred - updating... (live nodes size: [5])
   [junit4]   2> 805539 INFO  (OverseerCollectionConfigSetProcessor-97029256609333252-127.0.0.1:40911__%2Fc-n_0000000000) [    ] o.a.s.c.OverseerTaskQueue Response ZK path: /overseer/collection-queue-work/qnr-0000000000 doesn't exist.  Requestor may have disconnected from ZooKeeper
   [junit4]   2> 805977 INFO  (qtp29693281-4915) [    ] o.a.s.s.HttpSolrCall [admin] webapp=null path=/admin/collections params={replicationFactor=1&collection.configName=conf1&maxShardsPerNode=5&name=testSplitStaticIndexReplication&action=CREATE&numShards=1&createNodeSet=127.0.0.1:34934__%252Fc&wt=javabin&version=2} status=0 QTime=2441
   [junit4]   2> 807196 INFO  (qtp31199889-4792) [    ] o.a.s.u.p.LogUpdateProcessorFactory [collection1]  webapp=/_/c path=/update params={wt=javabin&version=2&CONTROL=TRUE}{add=[i1-0 (1552468149220147200)]} 0 1214
   [junit4]   2> 807198 INFO  (StoppableIndexingThread) [    ] o.a.s.c.c.ZkStateReader Updated live nodes from ZooKeeper... (0) -> (5)
   [junit4]   2> 807199 INFO  (StoppableIndexingThread) [    ] o.a.s.c.s.i.ZkClientClusterStateProvider Cluster at 127.0.0.1:37606/solr ready
   [junit4]   2> 807205 INFO  (qtp7548227-4860) [    ] o.a.s.u.p.LogUpdateProcessorFactory [testSplitStaticIndexReplication_shard1_replica1]  webapp=/_/c path=/update params={wt=javabin&version=2}{add=[i1-0 (1552468150499409920)]} 0 4
   [junit4]   2> added docs:1 with 0 fails deletes:0
   [junit4]   2> 807212 INFO  (qtp7548227-4859) [    ] o.a.s.u.DirectUpdateHandler2 start commit{,optimize=false,openSearcher=true,waitSearcher=true,expungeDeletes=false,softCommit=false,prepareCommit=false}
   [junit4]   2> 807212 INFO  (qtp7548227-4859) [    ] o.a.s.u.SolrIndexWriter Calling setCommitData with IW:org.apache.solr.update.SolrIndexWriter@72c942
   [junit4]   2> 807989 INFO  (qtp7548227-4859) [    ] o.a.s.s.SolrIndexSearcher Opening [Searcher@158a322[testSplitStaticIndexReplication_shard1_replica1] main]
   [junit4]   2> 807989 INFO  (qtp7548227-4859) [    ] o.a.s.u.DirectUpdateHandler2 end_commit_flush
   [junit4]   2> 807989 INFO  (searcherExecutor-2463-thread-1) [    ] o.a.s.c.SolrCore [testSplitStaticIndexReplication_shard1_replica1] Registered new searcher Searcher@158a322[testSplitStaticIndexReplication_shard1_replica1] main{ExitableDirectoryReader(UninvertingDirectoryReader(Uninverting(_0(6.4.0):c1)))}
   [junit4]   2> 807990 INFO  (qtp7548227-4859) [    ] o.a.s.u.p.LogUpdateProcessorFactory [testSplitStaticIndexReplication_shard1_replica1]  webapp=/_/c path=/update params={_stateVer_=testSplitStaticIndexReplication:3&waitSearcher=true&commit=true&softCommit=false&wt=javabin&version=2}{commit=} 0 778
   [junit4]   2> 807992 INFO  (qtp31199889-4786) [    ] o.a.s.u.DirectUpdateHandler2 start commit{,optimize=false,openSearcher=true,waitSearcher=true,expungeDeletes=false,softCommit=false,prepareCommit=false}
   [junit4]   2> 807992 INFO  (qtp31199889-4786) [    ] o.a.s.u.SolrIndexWriter Calling setCommitData with IW:org.apache.solr.update.SolrIndexWriter@1e6b692
   [junit4]   2> 808137 INFO  (qtp31199889-4786) [    ] o.a.s.s.SolrIndexSearcher Opening [Searcher@18cb034[collection1] main]
   [junit4]   2> 808138 INFO  (qtp31199889-4786) [    ] o.a.s.u.DirectUpdateHandler2 end_commit_flush
   [junit4]   2> 808138 INFO  (searcherExecutor-2414-thread-1) [    ] o.a.s.c.SolrCore [collection1] Registered new searcher Searcher@18cb034[collection1] main{ExitableDirectoryReader(UninvertingDirectoryRead

[...truncated too long message...]

er.handler.ContextHandler.doScope(ContextHandler.java:1112)
   [junit4]   2> 	at org.eclipse.jetty.server.handler.ScopedHandler.handle(ScopedHandler.java:141)
   [junit4]   2> 	at org.eclipse.jetty.server.handler.gzip.GzipHandler.handle(GzipHandler.java:462)
   [junit4]   2> 	at org.eclipse.jetty.server.handler.HandlerWrapper.handle(HandlerWrapper.java:134)
   [junit4]   2> 	at org.eclipse.jetty.server.Server.handle(Server.java:534)
   [junit4]   2> 	at org.eclipse.jetty.server.HttpChannel.handle(HttpChannel.java:320)
   [junit4]   2> 	at org.eclipse.jetty.server.HttpConnection.onFillable(HttpConnection.java:251)
   [junit4]   2> 	at org.eclipse.jetty.io.AbstractConnection$ReadCallback.succeeded(AbstractConnection.java:273)
   [junit4]   2> 	at org.eclipse.jetty.io.FillInterest.fillable(FillInterest.java:95)
   [junit4]   2> 	at org.eclipse.jetty.io.SelectChannelEndPoint$2.run(SelectChannelEndPoint.java:93)
   [junit4]   2> 	at org.eclipse.jetty.util.thread.strategy.ExecuteProduceConsume.executeProduceConsume(ExecuteProduceConsume.java:303)
   [junit4]   2> 	at org.eclipse.jetty.util.thread.strategy.ExecuteProduceConsume.produceConsume(ExecuteProduceConsume.java:148)
   [junit4]   2> 	at org.eclipse.jetty.util.thread.strategy.ExecuteProduceConsume.run(ExecuteProduceConsume.java:136)
   [junit4]   2> 	at org.eclipse.jetty.util.thread.QueuedThreadPool.runJob(QueuedThreadPool.java:671)
   [junit4]   2> 	at org.eclipse.jetty.util.thread.QueuedThreadPool$2.run(QueuedThreadPool.java:589)
   [junit4]   2> 	at java.lang.Thread.run(java.base@9-ea/Thread.java:843)
   [junit4]   2> 
   [junit4]   2> 1156952 INFO  (qtp25455977-6301) [    ] o.a.s.s.HttpSolrCall [admin] webapp=null path=/admin/cores params={nodeName=127.0.0.1:43980__%252Fc&core=shardSplitWithRule_shard1_1_replica1&coreNodeName=core_node5&action=PREPRECOVERY&checkLive=true&state=recovering&onlyIfLeader=true&wt=javabin&version=2} status=400 QTime=5003
   [junit4]   2> 1157180 ERROR (qtp25455977-6304) [    ] o.a.s.h.RequestHandlerBase org.apache.solr.common.SolrException: Solr is shutting down
   [junit4]   2> 	at org.apache.solr.handler.admin.PrepRecoveryOp.execute(PrepRecoveryOp.java:183)
   [junit4]   2> 	at org.apache.solr.handler.admin.CoreAdminOperation.execute(CoreAdminOperation.java:377)
   [junit4]   2> 	at org.apache.solr.handler.admin.CoreAdminHandler$CallInfo.call(CoreAdminHandler.java:365)
   [junit4]   2> 	at org.apache.solr.handler.admin.CoreAdminHandler.handleRequestBody(CoreAdminHandler.java:156)
   [junit4]   2> 	at org.apache.solr.handler.RequestHandlerBase.handleRequest(RequestHandlerBase.java:152)
   [junit4]   2> 	at org.apache.solr.servlet.HttpSolrCall.handleAdminRequest(HttpSolrCall.java:664)
   [junit4]   2> 	at org.apache.solr.servlet.HttpSolrCall.call(HttpSolrCall.java:445)
   [junit4]   2> 	at org.apache.solr.servlet.SolrDispatchFilter.doFilter(SolrDispatchFilter.java:303)
   [junit4]   2> 	at org.apache.solr.servlet.SolrDispatchFilter.doFilter(SolrDispatchFilter.java:254)
   [junit4]   2> 	at org.eclipse.jetty.servlet.ServletHandler$CachedChain.doFilter(ServletHandler.java:1699)
   [junit4]   2> 	at org.apache.solr.client.solrj.embedded.JettySolrRunner$DebugFilter.doFilter(JettySolrRunner.java:110)
   [junit4]   2> 	at org.eclipse.jetty.servlet.ServletHandler$CachedChain.doFilter(ServletHandler.java:1699)
   [junit4]   2> 	at org.eclipse.jetty.servlet.ServletHandler.doHandle(ServletHandler.java:582)
   [junit4]   2> 	at org.eclipse.jetty.server.session.SessionHandler.doHandle(SessionHandler.java:224)
   [junit4]   2> 	at org.eclipse.jetty.server.handler.ContextHandler.doHandle(ContextHandler.java:1180)
   [junit4]   2> 	at org.eclipse.jetty.servlet.ServletHandler.doScope(ServletHandler.java:512)
   [junit4]   2> 	at org.eclipse.jetty.server.session.SessionHandler.doScope(SessionHandler.java:185)
   [junit4]   2> 	at org.eclipse.jetty.server.handler.ContextHandler.doScope(ContextHandler.java:1112)
   [junit4]   2> 	at org.eclipse.jetty.server.handler.ScopedHandler.handle(ScopedHandler.java:141)
   [junit4]   2> 	at org.eclipse.jetty.server.handler.gzip.GzipHandler.handle(GzipHandler.java:462)
   [junit4]   2> 	at org.eclipse.jetty.server.handler.HandlerWrapper.handle(HandlerWrapper.java:134)
   [junit4]   2> 	at org.eclipse.jetty.server.Server.handle(Server.java:534)
   [junit4]   2> 	at org.eclipse.jetty.server.HttpChannel.handle(HttpChannel.java:320)
   [junit4]   2> 	at org.eclipse.jetty.server.HttpConnection.onFillable(HttpConnection.java:251)
   [junit4]   2> 	at org.eclipse.jetty.io.AbstractConnection$ReadCallback.succeeded(AbstractConnection.java:273)
   [junit4]   2> 	at org.eclipse.jetty.io.FillInterest.fillable(FillInterest.java:95)
   [junit4]   2> 	at org.eclipse.jetty.io.SelectChannelEndPoint$2.run(SelectChannelEndPoint.java:93)
   [junit4]   2> 	at org.eclipse.jetty.util.thread.strategy.ExecuteProduceConsume.executeProduceConsume(ExecuteProduceConsume.java:303)
   [junit4]   2> 	at org.eclipse.jetty.util.thread.strategy.ExecuteProduceConsume.produceConsume(ExecuteProduceConsume.java:148)
   [junit4]   2> 	at org.eclipse.jetty.util.thread.strategy.ExecuteProduceConsume.run(ExecuteProduceConsume.java:136)
   [junit4]   2> 	at org.eclipse.jetty.util.thread.QueuedThreadPool.runJob(QueuedThreadPool.java:671)
   [junit4]   2> 	at org.eclipse.jetty.util.thread.QueuedThreadPool$2.run(QueuedThreadPool.java:589)
   [junit4]   2> 	at java.lang.Thread.run(java.base@9-ea/Thread.java:843)
   [junit4]   2> 
   [junit4]   2> 1157180 INFO  (qtp25455977-6304) [    ] o.a.s.s.HttpSolrCall [admin] webapp=null path=/admin/cores params={nodeName=127.0.0.1:42047__%252Fc&core=shardSplitWithRule_shard1_0_replica1&coreNodeName=core_node6&action=PREPRECOVERY&checkLive=true&state=recovering&onlyIfLeader=true&wt=javabin&version=2} status=400 QTime=5002
   [junit4]   2> 1157181 INFO  (TEST-ShardSplitTest.testSplitShardWithRule-seed#[9948F3F46B1CCD3E]) [    ] o.a.s.c.ChaosMonkey monkey: stop shard! 43980
   [junit4]   2> 1157181 INFO  (TEST-ShardSplitTest.testSplitShardWithRule-seed#[9948F3F46B1CCD3E]) [    ] o.a.s.c.ZkTestServer connecting to 127.0.0.1:44775 44775
   [junit4]   2> 1157215 INFO  (Thread-1908) [    ] o.a.s.c.ZkTestServer connecting to 127.0.0.1:44775 44775
   [junit4]   2> 1157216 WARN  (Thread-1908) [    ] o.a.s.c.ZkTestServer Watch limit violations: 
   [junit4]   2> Maximum concurrent create/delete watches above limit:
   [junit4]   2> 
   [junit4]   2> 	6	/solr/aliases.json
   [junit4]   2> 	6	/solr/clusterprops.json
   [junit4]   2> 	5	/solr/security.json
   [junit4]   2> 	5	/solr/configs/conf1
   [junit4]   2> 	4	/solr/collections/collection1/state.json
   [junit4]   2> 
   [junit4]   2> Maximum concurrent data watches above limit:
   [junit4]   2> 
   [junit4]   2> 	72	/solr/collections/shardSplitWithRule/state.json
   [junit4]   2> 	6	/solr/clusterprops.json
   [junit4]   2> 	6	/solr/clusterstate.json
   [junit4]   2> 
   [junit4]   2> Maximum concurrent children watches above limit:
   [junit4]   2> 
   [junit4]   2> 	44	/solr/overseer/queue
   [junit4]   2> 	25	/solr/overseer/collection-queue-work
   [junit4]   2> 	6	/solr/live_nodes
   [junit4]   2> 	6	/solr/collections
   [junit4]   2> 	5	/solr/overseer/queue-work
   [junit4]   2> 
   [junit4]   2> 1157218 INFO  (SUITE-ShardSplitTest-seed#[9948F3F46B1CCD3E]-worker) [    ] o.a.s.SolrTestCaseJ4 ###deleteCore
   [junit4]   2> NOTE: leaving temporary files on disk at: /home/jenkins/workspace/Lucene-Solr-6.x-Linux/solr/build/solr-core/test/J0/temp/solr.cloud.ShardSplitTest_9948F3F46B1CCD3E-001
   [junit4]   2> Nov 30, 2016 11:42:32 PM com.carrotsearch.randomizedtesting.ThreadLeakControl checkThreadLeaks
   [junit4]   2> WARNING: Will linger awaiting termination of 2 leaked thread(s).
   [junit4]   2> NOTE: test params are: codec=Asserting(Lucene62): {rnd_b=PostingsFormat(name=Asserting), shard_s=PostingsFormat(name=LuceneVarGapFixedInterval), _version_=PostingsFormat(name=LuceneVarGapDocFreqInterval), n_ti=PostingsFormat(name=LuceneVarGapFixedInterval), a_t=PostingsFormat(name=LuceneVarGapFixedInterval), a_i=PostingsFormat(name=Asserting), id=PostingsFormat(name=Asserting)}, docValues:{}, maxPointsInLeafNode=602, maxMBSortInHeap=5.346512214345578, sim=RandomSimilarity(queryNorm=true,coord=no): {}, locale=pt-CH, timezone=Africa/Nairobi
   [junit4]   2> NOTE: Linux 4.4.0-47-generic i386/Oracle Corporation 9-ea (32-bit)/cpus=12,threads=1,free=57156120,total=366944256
   [junit4]   2> NOTE: All tests run in this JVM: [BlockCacheTest, TestStressCloudBlindAtomicUpdates, TestQuerySenderNoQuery, ZkStateWriterTest, TestBackupRepositoryFactory, InfoHandlerTest, TestRandomFaceting, TestCloudSchemaless, CacheHeaderTest, SignatureUpdateProcessorFactoryTest, TestXmlQParser, TestCloudRecovery, TestConfigSetProperties, DistributedSpellCheckComponentTest, CreateCollectionCleanupTest, ActionThrottleTest, XsltUpdateRequestHandlerTest, TestDocSet, TestReloadDeadlock, PeerSyncTest, TestDynamicFieldCollectionResource, TestUseDocValuesAsStored, RankQueryTest, TestOmitPositions, TestCSVLoader, AnalysisErrorHandlingTest, TestHighlightDedupGrouping, AlternateDirectoryTest, CachingDirectoryFactoryTest, TestAtomicUpdateErrorCases, TestManagedResourceStorage, ConjunctionSolrSpellCheckerTest, TestFieldCacheWithThreads, RegexBoostProcessorTest, AtomicUpdatesTest, ExternalFileFieldSortTest, TestDFISimilarityFactory, SolrCoreTest, CheckHdfsIndexTest, TestConfigSetsAPI, DistributedQueryComponentCustomSortTest, LeaderFailureAfterFreshStartTest, TestCrossCoreJoin, HdfsChaosMonkeyNothingIsSafeTest, MigrateRouteKeyTest, TestSha256AuthenticationProvider, HdfsDirectoryTest, TestLocalFSCloudBackupRestore, TestReplicationHandler, TestSmileRequest, TestBadConfig, AnalyticsQueryTest, TestLRUStatsCache, BasicDistributedZkTest, TestPerFieldSimilarityWithDefaultOverride, TestHdfsUpdateLog, ShardSplitTest]
   [junit4] Completed [298/658 (1!)] on J0 in 393.73s, 5 tests, 1 failure <<< FAILURES!

[...truncated 51211 lines...]


Mime
View raw message