lucene-dev mailing list archives

Site index · List index
Message view « Date » · « Thread »
Top « Date » · « Thread »
From Policeman Jenkins Server <jenk...@thetaphi.de>
Subject [JENKINS-EA] Lucene-Solr-master-Linux (64bit/jdk-9-ea+147) - Build # 18653 - Still Unstable!
Date Fri, 30 Dec 2016 07:35:45 GMT
Build: https://jenkins.thetaphi.de/job/Lucene-Solr-master-Linux/18653/
Java: 64bit/jdk-9-ea+147 -XX:+UseCompressedOops -XX:+UseParallelGC

3 tests failed.
FAILED:  org.apache.solr.cloud.CollectionsAPISolrJTest.testCreateAndDeleteAlias

Error Message:
Error from server at https://127.0.0.1:44067/solr: create the collection time out:180s

Stack Trace:
org.apache.solr.client.solrj.impl.HttpSolrClient$RemoteSolrException: Error from server at https://127.0.0.1:44067/solr: create the collection time out:180s
	at __randomizedtesting.SeedInfo.seed([C78FE6B86EB3B01C:96CA142CE0C4187]:0)
	at org.apache.solr.client.solrj.impl.HttpSolrClient.executeMethod(HttpSolrClient.java:627)
	at org.apache.solr.client.solrj.impl.HttpSolrClient.request(HttpSolrClient.java:279)
	at org.apache.solr.client.solrj.impl.HttpSolrClient.request(HttpSolrClient.java:268)
	at org.apache.solr.client.solrj.impl.LBHttpSolrClient.doRequest(LBHttpSolrClient.java:439)
	at org.apache.solr.client.solrj.impl.LBHttpSolrClient.request(LBHttpSolrClient.java:391)
	at org.apache.solr.client.solrj.impl.CloudSolrClient.sendRequest(CloudSolrClient.java:1344)
	at org.apache.solr.client.solrj.impl.CloudSolrClient.requestWithRetryOnStaleState(CloudSolrClient.java:1095)
	at org.apache.solr.client.solrj.impl.CloudSolrClient.request(CloudSolrClient.java:1037)
	at org.apache.solr.client.solrj.SolrRequest.process(SolrRequest.java:149)
	at org.apache.solr.client.solrj.SolrRequest.process(SolrRequest.java:166)
	at org.apache.solr.cloud.CollectionsAPISolrJTest.testCreateAndDeleteAlias(CollectionsAPISolrJTest.java:128)
	at java.base/jdk.internal.reflect.NativeMethodAccessorImpl.invoke0(Native Method)
	at java.base/jdk.internal.reflect.NativeMethodAccessorImpl.invoke(NativeMethodAccessorImpl.java:62)
	at java.base/jdk.internal.reflect.DelegatingMethodAccessorImpl.invoke(DelegatingMethodAccessorImpl.java:43)
	at java.base/java.lang.reflect.Method.invoke(Method.java:538)
	at com.carrotsearch.randomizedtesting.RandomizedRunner.invoke(RandomizedRunner.java:1713)
	at com.carrotsearch.randomizedtesting.RandomizedRunner$8.evaluate(RandomizedRunner.java:907)
	at com.carrotsearch.randomizedtesting.RandomizedRunner$9.evaluate(RandomizedRunner.java:943)
	at com.carrotsearch.randomizedtesting.RandomizedRunner$10.evaluate(RandomizedRunner.java:957)
	at com.carrotsearch.randomizedtesting.rules.SystemPropertiesRestoreRule$1.evaluate(SystemPropertiesRestoreRule.java:57)
	at org.apache.lucene.util.TestRuleSetupTeardownChained$1.evaluate(TestRuleSetupTeardownChained.java:49)
	at org.apache.lucene.util.AbstractBeforeAfterRule$1.evaluate(AbstractBeforeAfterRule.java:45)
	at org.apache.lucene.util.TestRuleThreadAndTestName$1.evaluate(TestRuleThreadAndTestName.java:48)
	at org.apache.lucene.util.TestRuleIgnoreAfterMaxFailures$1.evaluate(TestRuleIgnoreAfterMaxFailures.java:64)
	at org.apache.lucene.util.TestRuleMarkFailure$1.evaluate(TestRuleMarkFailure.java:47)
	at com.carrotsearch.randomizedtesting.rules.StatementAdapter.evaluate(StatementAdapter.java:36)
	at com.carrotsearch.randomizedtesting.ThreadLeakControl$StatementRunner.run(ThreadLeakControl.java:367)
	at com.carrotsearch.randomizedtesting.ThreadLeakControl.forkTimeoutingTask(ThreadLeakControl.java:811)
	at com.carrotsearch.randomizedtesting.ThreadLeakControl$3.evaluate(ThreadLeakControl.java:462)
	at com.carrotsearch.randomizedtesting.RandomizedRunner.runSingleTest(RandomizedRunner.java:916)
	at com.carrotsearch.randomizedtesting.RandomizedRunner$5.evaluate(RandomizedRunner.java:802)
	at com.carrotsearch.randomizedtesting.RandomizedRunner$6.evaluate(RandomizedRunner.java:852)
	at com.carrotsearch.randomizedtesting.RandomizedRunner$7.evaluate(RandomizedRunner.java:863)
	at com.carrotsearch.randomizedtesting.rules.StatementAdapter.evaluate(StatementAdapter.java:36)
	at com.carrotsearch.randomizedtesting.rules.SystemPropertiesRestoreRule$1.evaluate(SystemPropertiesRestoreRule.java:57)
	at org.apache.lucene.util.AbstractBeforeAfterRule$1.evaluate(AbstractBeforeAfterRule.java:45)
	at com.carrotsearch.randomizedtesting.rules.StatementAdapter.evaluate(StatementAdapter.java:36)
	at org.apache.lucene.util.TestRuleStoreClassName$1.evaluate(TestRuleStoreClassName.java:41)
	at com.carrotsearch.randomizedtesting.rules.NoShadowingOrOverridesOnMethodsRule$1.evaluate(NoShadowingOrOverridesOnMethodsRule.java:40)
	at com.carrotsearch.randomizedtesting.rules.NoShadowingOrOverridesOnMethodsRule$1.evaluate(NoShadowingOrOverridesOnMethodsRule.java:40)
	at com.carrotsearch.randomizedtesting.rules.StatementAdapter.evaluate(StatementAdapter.java:36)
	at com.carrotsearch.randomizedtesting.rules.StatementAdapter.evaluate(StatementAdapter.java:36)
	at org.apache.lucene.util.TestRuleAssertionsRequired$1.evaluate(TestRuleAssertionsRequired.java:53)
	at org.apache.lucene.util.TestRuleMarkFailure$1.evaluate(TestRuleMarkFailure.java:47)
	at org.apache.lucene.util.TestRuleIgnoreAfterMaxFailures$1.evaluate(TestRuleIgnoreAfterMaxFailures.java:64)
	at org.apache.lucene.util.TestRuleIgnoreTestSuites$1.evaluate(TestRuleIgnoreTestSuites.java:54)
	at com.carrotsearch.randomizedtesting.rules.StatementAdapter.evaluate(StatementAdapter.java:36)
	at com.carrotsearch.randomizedtesting.ThreadLeakControl$StatementRunner.run(ThreadLeakControl.java:367)
	at java.base/java.lang.Thread.run(Thread.java:844)


FAILED:  org.apache.solr.cloud.CollectionsAPISolrJTest.testSplitShard

Error Message:
Error from server at https://127.0.0.1:44067/solr: create the collection time out:180s

Stack Trace:
org.apache.solr.client.solrj.impl.HttpSolrClient$RemoteSolrException: Error from server at https://127.0.0.1:44067/solr: create the collection time out:180s
	at __randomizedtesting.SeedInfo.seed([C78FE6B86EB3B01C:1C854BD470468CA3]:0)
	at org.apache.solr.client.solrj.impl.HttpSolrClient.executeMethod(HttpSolrClient.java:627)
	at org.apache.solr.client.solrj.impl.HttpSolrClient.request(HttpSolrClient.java:279)
	at org.apache.solr.client.solrj.impl.HttpSolrClient.request(HttpSolrClient.java:268)
	at org.apache.solr.client.solrj.impl.LBHttpSolrClient.doRequest(LBHttpSolrClient.java:439)
	at org.apache.solr.client.solrj.impl.LBHttpSolrClient.request(LBHttpSolrClient.java:391)
	at org.apache.solr.client.solrj.impl.CloudSolrClient.sendRequest(CloudSolrClient.java:1344)
	at org.apache.solr.client.solrj.impl.CloudSolrClient.requestWithRetryOnStaleState(CloudSolrClient.java:1095)
	at org.apache.solr.client.solrj.impl.CloudSolrClient.request(CloudSolrClient.java:1037)
	at org.apache.solr.client.solrj.SolrRequest.process(SolrRequest.java:149)
	at org.apache.solr.client.solrj.SolrRequest.process(SolrRequest.java:166)
	at org.apache.solr.cloud.CollectionsAPISolrJTest.testSplitShard(CollectionsAPISolrJTest.java:143)
	at java.base/jdk.internal.reflect.NativeMethodAccessorImpl.invoke0(Native Method)
	at java.base/jdk.internal.reflect.NativeMethodAccessorImpl.invoke(NativeMethodAccessorImpl.java:62)
	at java.base/jdk.internal.reflect.DelegatingMethodAccessorImpl.invoke(DelegatingMethodAccessorImpl.java:43)
	at java.base/java.lang.reflect.Method.invoke(Method.java:538)
	at com.carrotsearch.randomizedtesting.RandomizedRunner.invoke(RandomizedRunner.java:1713)
	at com.carrotsearch.randomizedtesting.RandomizedRunner$8.evaluate(RandomizedRunner.java:907)
	at com.carrotsearch.randomizedtesting.RandomizedRunner$9.evaluate(RandomizedRunner.java:943)
	at com.carrotsearch.randomizedtesting.RandomizedRunner$10.evaluate(RandomizedRunner.java:957)
	at com.carrotsearch.randomizedtesting.rules.SystemPropertiesRestoreRule$1.evaluate(SystemPropertiesRestoreRule.java:57)
	at org.apache.lucene.util.TestRuleSetupTeardownChained$1.evaluate(TestRuleSetupTeardownChained.java:49)
	at org.apache.lucene.util.AbstractBeforeAfterRule$1.evaluate(AbstractBeforeAfterRule.java:45)
	at org.apache.lucene.util.TestRuleThreadAndTestName$1.evaluate(TestRuleThreadAndTestName.java:48)
	at org.apache.lucene.util.TestRuleIgnoreAfterMaxFailures$1.evaluate(TestRuleIgnoreAfterMaxFailures.java:64)
	at org.apache.lucene.util.TestRuleMarkFailure$1.evaluate(TestRuleMarkFailure.java:47)
	at com.carrotsearch.randomizedtesting.rules.StatementAdapter.evaluate(StatementAdapter.java:36)
	at com.carrotsearch.randomizedtesting.ThreadLeakControl$StatementRunner.run(ThreadLeakControl.java:367)
	at com.carrotsearch.randomizedtesting.ThreadLeakControl.forkTimeoutingTask(ThreadLeakControl.java:811)
	at com.carrotsearch.randomizedtesting.ThreadLeakControl$3.evaluate(ThreadLeakControl.java:462)
	at com.carrotsearch.randomizedtesting.RandomizedRunner.runSingleTest(RandomizedRunner.java:916)
	at com.carrotsearch.randomizedtesting.RandomizedRunner$5.evaluate(RandomizedRunner.java:802)
	at com.carrotsearch.randomizedtesting.RandomizedRunner$6.evaluate(RandomizedRunner.java:852)
	at com.carrotsearch.randomizedtesting.RandomizedRunner$7.evaluate(RandomizedRunner.java:863)
	at com.carrotsearch.randomizedtesting.rules.StatementAdapter.evaluate(StatementAdapter.java:36)
	at com.carrotsearch.randomizedtesting.rules.SystemPropertiesRestoreRule$1.evaluate(SystemPropertiesRestoreRule.java:57)
	at org.apache.lucene.util.AbstractBeforeAfterRule$1.evaluate(AbstractBeforeAfterRule.java:45)
	at com.carrotsearch.randomizedtesting.rules.StatementAdapter.evaluate(StatementAdapter.java:36)
	at org.apache.lucene.util.TestRuleStoreClassName$1.evaluate(TestRuleStoreClassName.java:41)
	at com.carrotsearch.randomizedtesting.rules.NoShadowingOrOverridesOnMethodsRule$1.evaluate(NoShadowingOrOverridesOnMethodsRule.java:40)
	at com.carrotsearch.randomizedtesting.rules.NoShadowingOrOverridesOnMethodsRule$1.evaluate(NoShadowingOrOverridesOnMethodsRule.java:40)
	at com.carrotsearch.randomizedtesting.rules.StatementAdapter.evaluate(StatementAdapter.java:36)
	at com.carrotsearch.randomizedtesting.rules.StatementAdapter.evaluate(StatementAdapter.java:36)
	at org.apache.lucene.util.TestRuleAssertionsRequired$1.evaluate(TestRuleAssertionsRequired.java:53)
	at org.apache.lucene.util.TestRuleMarkFailure$1.evaluate(TestRuleMarkFailure.java:47)
	at org.apache.lucene.util.TestRuleIgnoreAfterMaxFailures$1.evaluate(TestRuleIgnoreAfterMaxFailures.java:64)
	at org.apache.lucene.util.TestRuleIgnoreTestSuites$1.evaluate(TestRuleIgnoreTestSuites.java:54)
	at com.carrotsearch.randomizedtesting.rules.StatementAdapter.evaluate(StatementAdapter.java:36)
	at com.carrotsearch.randomizedtesting.ThreadLeakControl$StatementRunner.run(ThreadLeakControl.java:367)
	at java.base/java.lang.Thread.run(Thread.java:844)


FAILED:  org.apache.solr.cloud.CollectionsAPISolrJTest.testBalanceShardUnique

Error Message:
Error from server at https://127.0.0.1:44067/solr: create the collection time out:180s

Stack Trace:
org.apache.solr.client.solrj.impl.HttpSolrClient$RemoteSolrException: Error from server at https://127.0.0.1:44067/solr: create the collection time out:180s
	at __randomizedtesting.SeedInfo.seed([C78FE6B86EB3B01C:8F3750F5D41318DF]:0)
	at org.apache.solr.client.solrj.impl.HttpSolrClient.executeMethod(HttpSolrClient.java:627)
	at org.apache.solr.client.solrj.impl.HttpSolrClient.request(HttpSolrClient.java:279)
	at org.apache.solr.client.solrj.impl.HttpSolrClient.request(HttpSolrClient.java:268)
	at org.apache.solr.client.solrj.impl.LBHttpSolrClient.doRequest(LBHttpSolrClient.java:439)
	at org.apache.solr.client.solrj.impl.LBHttpSolrClient.request(LBHttpSolrClient.java:391)
	at org.apache.solr.client.solrj.impl.CloudSolrClient.sendRequest(CloudSolrClient.java:1344)
	at org.apache.solr.client.solrj.impl.CloudSolrClient.requestWithRetryOnStaleState(CloudSolrClient.java:1095)
	at org.apache.solr.client.solrj.impl.CloudSolrClient.request(CloudSolrClient.java:1037)
	at org.apache.solr.client.solrj.SolrRequest.process(SolrRequest.java:149)
	at org.apache.solr.client.solrj.SolrRequest.process(SolrRequest.java:166)
	at org.apache.solr.cloud.CollectionsAPISolrJTest.testBalanceShardUnique(CollectionsAPISolrJTest.java:335)
	at java.base/jdk.internal.reflect.NativeMethodAccessorImpl.invoke0(Native Method)
	at java.base/jdk.internal.reflect.NativeMethodAccessorImpl.invoke(NativeMethodAccessorImpl.java:62)
	at java.base/jdk.internal.reflect.DelegatingMethodAccessorImpl.invoke(DelegatingMethodAccessorImpl.java:43)
	at java.base/java.lang.reflect.Method.invoke(Method.java:538)
	at com.carrotsearch.randomizedtesting.RandomizedRunner.invoke(RandomizedRunner.java:1713)
	at com.carrotsearch.randomizedtesting.RandomizedRunner$8.evaluate(RandomizedRunner.java:907)
	at com.carrotsearch.randomizedtesting.RandomizedRunner$9.evaluate(RandomizedRunner.java:943)
	at com.carrotsearch.randomizedtesting.RandomizedRunner$10.evaluate(RandomizedRunner.java:957)
	at com.carrotsearch.randomizedtesting.rules.SystemPropertiesRestoreRule$1.evaluate(SystemPropertiesRestoreRule.java:57)
	at org.apache.lucene.util.TestRuleSetupTeardownChained$1.evaluate(TestRuleSetupTeardownChained.java:49)
	at org.apache.lucene.util.AbstractBeforeAfterRule$1.evaluate(AbstractBeforeAfterRule.java:45)
	at org.apache.lucene.util.TestRuleThreadAndTestName$1.evaluate(TestRuleThreadAndTestName.java:48)
	at org.apache.lucene.util.TestRuleIgnoreAfterMaxFailures$1.evaluate(TestRuleIgnoreAfterMaxFailures.java:64)
	at org.apache.lucene.util.TestRuleMarkFailure$1.evaluate(TestRuleMarkFailure.java:47)
	at com.carrotsearch.randomizedtesting.rules.StatementAdapter.evaluate(StatementAdapter.java:36)
	at com.carrotsearch.randomizedtesting.ThreadLeakControl$StatementRunner.run(ThreadLeakControl.java:367)
	at com.carrotsearch.randomizedtesting.ThreadLeakControl.forkTimeoutingTask(ThreadLeakControl.java:811)
	at com.carrotsearch.randomizedtesting.ThreadLeakControl$3.evaluate(ThreadLeakControl.java:462)
	at com.carrotsearch.randomizedtesting.RandomizedRunner.runSingleTest(RandomizedRunner.java:916)
	at com.carrotsearch.randomizedtesting.RandomizedRunner$5.evaluate(RandomizedRunner.java:802)
	at com.carrotsearch.randomizedtesting.RandomizedRunner$6.evaluate(RandomizedRunner.java:852)
	at com.carrotsearch.randomizedtesting.RandomizedRunner$7.evaluate(RandomizedRunner.java:863)
	at com.carrotsearch.randomizedtesting.rules.StatementAdapter.evaluate(StatementAdapter.java:36)
	at com.carrotsearch.randomizedtesting.rules.SystemPropertiesRestoreRule$1.evaluate(SystemPropertiesRestoreRule.java:57)
	at org.apache.lucene.util.AbstractBeforeAfterRule$1.evaluate(AbstractBeforeAfterRule.java:45)
	at com.carrotsearch.randomizedtesting.rules.StatementAdapter.evaluate(StatementAdapter.java:36)
	at org.apache.lucene.util.TestRuleStoreClassName$1.evaluate(TestRuleStoreClassName.java:41)
	at com.carrotsearch.randomizedtesting.rules.NoShadowingOrOverridesOnMethodsRule$1.evaluate(NoShadowingOrOverridesOnMethodsRule.java:40)
	at com.carrotsearch.randomizedtesting.rules.NoShadowingOrOverridesOnMethodsRule$1.evaluate(NoShadowingOrOverridesOnMethodsRule.java:40)
	at com.carrotsearch.randomizedtesting.rules.StatementAdapter.evaluate(StatementAdapter.java:36)
	at com.carrotsearch.randomizedtesting.rules.StatementAdapter.evaluate(StatementAdapter.java:36)
	at org.apache.lucene.util.TestRuleAssertionsRequired$1.evaluate(TestRuleAssertionsRequired.java:53)
	at org.apache.lucene.util.TestRuleMarkFailure$1.evaluate(TestRuleMarkFailure.java:47)
	at org.apache.lucene.util.TestRuleIgnoreAfterMaxFailures$1.evaluate(TestRuleIgnoreAfterMaxFailures.java:64)
	at org.apache.lucene.util.TestRuleIgnoreTestSuites$1.evaluate(TestRuleIgnoreTestSuites.java:54)
	at com.carrotsearch.randomizedtesting.rules.StatementAdapter.evaluate(StatementAdapter.java:36)
	at com.carrotsearch.randomizedtesting.ThreadLeakControl$StatementRunner.run(ThreadLeakControl.java:367)
	at java.base/java.lang.Thread.run(Thread.java:844)




Build Log:
[...truncated 11620 lines...]
   [junit4] Suite: org.apache.solr.cloud.CollectionsAPISolrJTest
   [junit4]   2> Creating dataDir: /home/jenkins/workspace/Lucene-Solr-master-Linux/solr/build/solr-core/test/J2/temp/solr.cloud.CollectionsAPISolrJTest_C78FE6B86EB3B01C-001/init-core-data-001
   [junit4]   2> 197742 INFO  (SUITE-CollectionsAPISolrJTest-seed#[C78FE6B86EB3B01C]-worker) [    ] o.a.s.SolrTestCaseJ4 Randomized ssl (true) and clientAuth (true) via: @org.apache.solr.util.RandomizeSSL(reason="", ssl=0.0/0.0, value=0.0/0.0, clientAuth=0.0/0.0)
   [junit4]   2> 197744 INFO  (SUITE-CollectionsAPISolrJTest-seed#[C78FE6B86EB3B01C]-worker) [    ] o.a.s.c.MiniSolrCloudCluster Starting cluster of 4 servers in /home/jenkins/workspace/Lucene-Solr-master-Linux/solr/build/solr-core/test/J2/temp/solr.cloud.CollectionsAPISolrJTest_C78FE6B86EB3B01C-001/tempDir-001
   [junit4]   2> 197744 INFO  (SUITE-CollectionsAPISolrJTest-seed#[C78FE6B86EB3B01C]-worker) [    ] o.a.s.c.ZkTestServer STARTING ZK TEST SERVER
   [junit4]   2> 197744 INFO  (Thread-257) [    ] o.a.s.c.ZkTestServer client port:0.0.0.0/0.0.0.0:0
   [junit4]   2> 197744 INFO  (Thread-257) [    ] o.a.s.c.ZkTestServer Starting server
   [junit4]   2> 197844 INFO  (SUITE-CollectionsAPISolrJTest-seed#[C78FE6B86EB3B01C]-worker) [    ] o.a.s.c.ZkTestServer start zk server on port:34141
   [junit4]   2> 197850 INFO  (jetty-launcher-245-thread-2) [    ] o.e.j.s.Server jetty-9.3.14.v20161028
   [junit4]   2> 197850 INFO  (jetty-launcher-245-thread-1) [    ] o.e.j.s.Server jetty-9.3.14.v20161028
   [junit4]   2> 197856 INFO  (jetty-launcher-245-thread-2) [    ] o.e.j.s.h.ContextHandler Started o.e.j.s.ServletContextHandler@617e3bf3{/solr,null,AVAILABLE}
   [junit4]   2> 197856 INFO  (jetty-launcher-245-thread-1) [    ] o.e.j.s.h.ContextHandler Started o.e.j.s.ServletContextHandler@3b1b6221{/solr,null,AVAILABLE}
   [junit4]   2> 197858 INFO  (jetty-launcher-245-thread-1) [    ] o.e.j.s.AbstractConnector Started ServerConnector@7e9bfead{SSL,[ssl, http/1.1]}{127.0.0.1:32882}
   [junit4]   2> 197858 INFO  (jetty-launcher-245-thread-2) [    ] o.e.j.s.AbstractConnector Started ServerConnector@15399ccc{SSL,[ssl, http/1.1]}{127.0.0.1:39242}
   [junit4]   2> 197858 INFO  (jetty-launcher-245-thread-1) [    ] o.e.j.s.Server Started @199540ms
   [junit4]   2> 197858 INFO  (jetty-launcher-245-thread-2) [    ] o.e.j.s.Server Started @199540ms
   [junit4]   2> 197858 INFO  (jetty-launcher-245-thread-1) [    ] o.a.s.c.s.e.JettySolrRunner Jetty properties: {hostContext=/solr, hostPort=32882}
   [junit4]   2> 197858 INFO  (jetty-launcher-245-thread-2) [    ] o.a.s.c.s.e.JettySolrRunner Jetty properties: {hostContext=/solr, hostPort=39242}
   [junit4]   2> 197858 ERROR (jetty-launcher-245-thread-1) [    ] o.a.s.s.StartupLoggingUtils Missing Java Option solr.log.dir. Logging may be missing or incomplete.
   [junit4]   2> 197858 ERROR (jetty-launcher-245-thread-2) [    ] o.a.s.s.StartupLoggingUtils Missing Java Option solr.log.dir. Logging may be missing or incomplete.
   [junit4]   2> 197858 INFO  (jetty-launcher-245-thread-1) [    ] o.a.s.s.SolrDispatchFilter  ___      _       Welcome to Apache Solr? version 7.0.0
   [junit4]   2> 197858 INFO  (jetty-launcher-245-thread-2) [    ] o.a.s.s.SolrDispatchFilter  ___      _       Welcome to Apache Solr? version 7.0.0
   [junit4]   2> 197858 INFO  (jetty-launcher-245-thread-1) [    ] o.a.s.s.SolrDispatchFilter / __| ___| |_ _   Starting in cloud mode on port null
   [junit4]   2> 197858 INFO  (jetty-launcher-245-thread-2) [    ] o.a.s.s.SolrDispatchFilter / __| ___| |_ _   Starting in cloud mode on port null
   [junit4]   2> 197858 INFO  (jetty-launcher-245-thread-1) [    ] o.a.s.s.SolrDispatchFilter \__ \/ _ \ | '_|  Install dir: null
   [junit4]   2> 197858 INFO  (jetty-launcher-245-thread-2) [    ] o.a.s.s.SolrDispatchFilter \__ \/ _ \ | '_|  Install dir: null
   [junit4]   2> 197858 INFO  (jetty-launcher-245-thread-1) [    ] o.a.s.s.SolrDispatchFilter |___/\___/_|_|    Start time: 2016-12-30T06:59:18.226806Z
   [junit4]   2> 197858 INFO  (jetty-launcher-245-thread-2) [    ] o.a.s.s.SolrDispatchFilter |___/\___/_|_|    Start time: 2016-12-30T06:59:18.226823Z
   [junit4]   2> 197859 INFO  (jetty-launcher-245-thread-3) [    ] o.e.j.s.Server jetty-9.3.14.v20161028
   [junit4]   2> 197859 INFO  (jetty-launcher-245-thread-4) [    ] o.e.j.s.Server jetty-9.3.14.v20161028
   [junit4]   2> 197860 INFO  (jetty-launcher-245-thread-4) [    ] o.e.j.s.h.ContextHandler Started o.e.j.s.ServletContextHandler@928215c{/solr,null,AVAILABLE}
   [junit4]   2> 197860 INFO  (jetty-launcher-245-thread-3) [    ] o.e.j.s.h.ContextHandler Started o.e.j.s.ServletContextHandler@785b2864{/solr,null,AVAILABLE}
   [junit4]   2> 197861 INFO  (jetty-launcher-245-thread-4) [    ] o.e.j.s.AbstractConnector Started ServerConnector@4a2745e{SSL,[ssl, http/1.1]}{127.0.0.1:33371}
   [junit4]   2> 197861 INFO  (jetty-launcher-245-thread-4) [    ] o.e.j.s.Server Started @199543ms
   [junit4]   2> 197861 INFO  (jetty-launcher-245-thread-1) [    ] o.a.s.s.SolrDispatchFilter solr.xml found in ZooKeeper. Loading...
   [junit4]   2> 197861 INFO  (jetty-launcher-245-thread-4) [    ] o.a.s.c.s.e.JettySolrRunner Jetty properties: {hostContext=/solr, hostPort=33371}
   [junit4]   2> 197861 INFO  (jetty-launcher-245-thread-2) [    ] o.a.s.s.SolrDispatchFilter solr.xml found in ZooKeeper. Loading...
   [junit4]   2> 197861 ERROR (jetty-launcher-245-thread-4) [    ] o.a.s.s.StartupLoggingUtils Missing Java Option solr.log.dir. Logging may be missing or incomplete.
   [junit4]   2> 197861 INFO  (jetty-launcher-245-thread-3) [    ] o.e.j.s.AbstractConnector Started ServerConnector@32375900{SSL,[ssl, http/1.1]}{127.0.0.1:44067}
   [junit4]   2> 197862 INFO  (jetty-launcher-245-thread-4) [    ] o.a.s.s.SolrDispatchFilter  ___      _       Welcome to Apache Solr? version 7.0.0
   [junit4]   2> 197862 INFO  (jetty-launcher-245-thread-3) [    ] o.e.j.s.Server Started @199543ms
   [junit4]   2> 197862 INFO  (jetty-launcher-245-thread-4) [    ] o.a.s.s.SolrDispatchFilter / __| ___| |_ _   Starting in cloud mode on port null
   [junit4]   2> 197862 INFO  (jetty-launcher-245-thread-3) [    ] o.a.s.c.s.e.JettySolrRunner Jetty properties: {hostContext=/solr, hostPort=44067}
   [junit4]   2> 197862 INFO  (jetty-launcher-245-thread-4) [    ] o.a.s.s.SolrDispatchFilter \__ \/ _ \ | '_|  Install dir: null
   [junit4]   2> 197862 INFO  (jetty-launcher-245-thread-4) [    ] o.a.s.s.SolrDispatchFilter |___/\___/_|_|    Start time: 2016-12-30T06:59:18.230321Z
   [junit4]   2> 197862 ERROR (jetty-launcher-245-thread-3) [    ] o.a.s.s.StartupLoggingUtils Missing Java Option solr.log.dir. Logging may be missing or incomplete.
   [junit4]   2> 197862 INFO  (jetty-launcher-245-thread-3) [    ] o.a.s.s.SolrDispatchFilter  ___      _       Welcome to Apache Solr? version 7.0.0
   [junit4]   2> 197862 INFO  (jetty-launcher-245-thread-3) [    ] o.a.s.s.SolrDispatchFilter / __| ___| |_ _   Starting in cloud mode on port null
   [junit4]   2> 197862 INFO  (jetty-launcher-245-thread-3) [    ] o.a.s.s.SolrDispatchFilter \__ \/ _ \ | '_|  Install dir: null
   [junit4]   2> 197862 INFO  (jetty-launcher-245-thread-3) [    ] o.a.s.s.SolrDispatchFilter |___/\___/_|_|    Start time: 2016-12-30T06:59:18.230587Z
   [junit4]   2> 197863 INFO  (jetty-launcher-245-thread-4) [    ] o.a.s.s.SolrDispatchFilter solr.xml found in ZooKeeper. Loading...
   [junit4]   2> 197864 INFO  (jetty-launcher-245-thread-3) [    ] o.a.s.s.SolrDispatchFilter solr.xml found in ZooKeeper. Loading...
   [junit4]   2> 197865 WARN  (NIOServerCxn.Factory:0.0.0.0/0.0.0.0:0) [    ] o.a.z.s.NIOServerCnxn caught end of stream exception
   [junit4]   2> EndOfStreamException: Unable to read additional data from client sessionid 0x1594e868de10002, likely client has closed socket
   [junit4]   2> 	at org.apache.zookeeper.server.NIOServerCnxn.doIO(NIOServerCnxn.java:228)
   [junit4]   2> 	at org.apache.zookeeper.server.NIOServerCnxnFactory.run(NIOServerCnxnFactory.java:208)
   [junit4]   2> 	at java.base/java.lang.Thread.run(Thread.java:844)
   [junit4]   2> 197866 WARN  (NIOServerCxn.Factory:0.0.0.0/0.0.0.0:0) [    ] o.a.z.s.NIOServerCnxn caught end of stream exception
   [junit4]   2> EndOfStreamException: Unable to read additional data from client sessionid 0x1594e868de10004, likely client has closed socket
   [junit4]   2> 	at org.apache.zookeeper.server.NIOServerCnxn.doIO(NIOServerCnxn.java:228)
   [junit4]   2> 	at org.apache.zookeeper.server.NIOServerCnxnFactory.run(NIOServerCnxnFactory.java:208)
   [junit4]   2> 	at java.base/java.lang.Thread.run(Thread.java:844)
   [junit4]   2> 197869 INFO  (jetty-launcher-245-thread-2) [    ] o.a.s.c.ZkContainer Zookeeper client=127.0.0.1:34141/solr
   [junit4]   2> 197871 INFO  (jetty-launcher-245-thread-4) [    ] o.a.s.c.ZkContainer Zookeeper client=127.0.0.1:34141/solr
   [junit4]   2> 197871 INFO  (jetty-launcher-245-thread-1) [    ] o.a.s.c.ZkContainer Zookeeper client=127.0.0.1:34141/solr
   [junit4]   2> 197871 INFO  (jetty-launcher-245-thread-3) [    ] o.a.s.c.ZkContainer Zookeeper client=127.0.0.1:34141/solr
   [junit4]   2> 197873 WARN  (NIOServerCxn.Factory:0.0.0.0/0.0.0.0:0) [    ] o.a.z.s.NIOServerCnxn caught end of stream exception
   [junit4]   2> EndOfStreamException: Unable to read additional data from client sessionid 0x1594e868de10009, likely client has closed socket
   [junit4]   2> 	at org.apache.zookeeper.server.NIOServerCnxn.doIO(NIOServerCnxn.java:228)
   [junit4]   2> 	at org.apache.zookeeper.server.NIOServerCnxnFactory.run(NIOServerCnxnFactory.java:208)
   [junit4]   2> 	at java.base/java.lang.Thread.run(Thread.java:844)
   [junit4]   2> 197882 INFO  (jetty-launcher-245-thread-4) [    ] o.a.s.c.OverseerElectionContext I am going to be the leader 127.0.0.1:33371_solr
   [junit4]   2> 197883 INFO  (jetty-launcher-245-thread-1) [    ] o.a.s.c.ZkController Register node as live in ZooKeeper:/live_nodes/127.0.0.1:32882_solr
   [junit4]   2> 197883 INFO  (jetty-launcher-245-thread-3) [    ] o.a.s.c.ZkController Register node as live in ZooKeeper:/live_nodes/127.0.0.1:44067_solr
   [junit4]   2> 197883 INFO  (jetty-launcher-245-thread-2) [    ] o.a.s.c.ZkController Register node as live in ZooKeeper:/live_nodes/127.0.0.1:39242_solr
   [junit4]   2> 197883 INFO  (jetty-launcher-245-thread-4) [    ] o.a.s.c.Overseer Overseer (id=97195206778093578-127.0.0.1:33371_solr-n_0000000000) starting
   [junit4]   2> 197884 INFO  (zkCallback-264-thread-1) [    ] o.a.s.c.c.ZkStateReader Updated live nodes from ZooKeeper... (0) -> (3)
   [junit4]   2> 197884 INFO  (zkCallback-260-thread-1) [    ] o.a.s.c.c.ZkStateReader Updated live nodes from ZooKeeper... (0) -> (3)
   [junit4]   2> 197885 INFO  (zkCallback-266-thread-1) [    ] o.a.s.c.c.ZkStateReader Updated live nodes from ZooKeeper... (0) -> (3)
   [junit4]   2> 197885 INFO  (zkCallback-265-thread-1) [    ] o.a.s.c.c.ZkStateReader Updated live nodes from ZooKeeper... (0) -> (3)
   [junit4]   2> 197888 INFO  (jetty-launcher-245-thread-4) [    ] o.a.s.c.ZkController Register node as live in ZooKeeper:/live_nodes/127.0.0.1:33371_solr
   [junit4]   2> 197889 INFO  (zkCallback-264-thread-1) [    ] o.a.s.c.c.ZkStateReader Updated live nodes from ZooKeeper... (3) -> (4)
   [junit4]   2> 197889 INFO  (zkCallback-260-thread-1) [    ] o.a.s.c.c.ZkStateReader Updated live nodes from ZooKeeper... (3) -> (4)
   [junit4]   2> 197889 INFO  (zkCallback-266-thread-1) [    ] o.a.s.c.c.ZkStateReader Updated live nodes from ZooKeeper... (3) -> (4)
   [junit4]   2> 197889 INFO  (zkCallback-265-thread-1) [    ] o.a.s.c.c.ZkStateReader Updated live nodes from ZooKeeper... (3) -> (4)
   [junit4]   2> 197912 INFO  (jetty-launcher-245-thread-2) [    ] o.a.s.c.CorePropertiesLocator Found 0 core definitions underneath /home/jenkins/workspace/Lucene-Solr-master-Linux/solr/build/solr-core/test/J2/temp/solr.cloud.CollectionsAPISolrJTest_C78FE6B86EB3B01C-001/tempDir-001/node2/.
   [junit4]   2> 197914 INFO  (jetty-launcher-245-thread-3) [    ] o.a.s.c.CorePropertiesLocator Found 0 core definitions underneath /home/jenkins/workspace/Lucene-Solr-master-Linux/solr/build/solr-core/test/J2/temp/solr.cloud.CollectionsAPISolrJTest_C78FE6B86EB3B01C-001/tempDir-001/node3/.
   [junit4]   2> 197922 INFO  (jetty-launcher-245-thread-1) [    ] o.a.s.c.CorePropertiesLocator Found 0 core definitions underneath /home/jenkins/workspace/Lucene-Solr-master-Linux/solr/build/solr-core/test/J2/temp/solr.cloud.CollectionsAPISolrJTest_C78FE6B86EB3B01C-001/tempDir-001/node1/.
   [junit4]   2> 197932 INFO  (jetty-launcher-245-thread-4) [    ] o.a.s.c.CorePropertiesLocator Found 0 core definitions underneath /home/jenkins/workspace/Lucene-Solr-master-Linux/solr/build/solr-core/test/J2/temp/solr.cloud.CollectionsAPISolrJTest_C78FE6B86EB3B01C-001/tempDir-001/node4/.
   [junit4]   2> 198471 INFO  (SUITE-CollectionsAPISolrJTest-seed#[C78FE6B86EB3B01C]-worker) [    ] o.a.s.c.c.ZkStateReader Updated live nodes from ZooKeeper... (0) -> (4)
   [junit4]   2> 198471 INFO  (SUITE-CollectionsAPISolrJTest-seed#[C78FE6B86EB3B01C]-worker) [    ] o.a.s.c.s.i.ZkClientClusterStateProvider Cluster at 127.0.0.1:34141/solr ready
   [junit4]   2> 198490 INFO  (TEST-CollectionsAPISolrJTest.testAddAndRemoveRole-seed#[C78FE6B86EB3B01C]) [    ] o.a.s.SolrTestCaseJ4 ###Starting testAddAndRemoveRole
   [junit4]   2> 198508 INFO  (qtp1795947352-1353) [    ] o.a.s.h.a.CollectionsHandler Invoked Collection Action :addrole with params node=127.0.0.1:39242_solr&role=overseer&action=ADDROLE&wt=javabin&version=2 and sendToOCPQueue=true
   [junit4]   2> 198510 INFO  (OverseerThreadFactory-944-thread-1) [    ] o.a.s.c.OverseerRoleCmd Overseer role added to 127.0.0.1:39242_solr
   [junit4]   2> 198511 INFO  (Thread-294) [    ] o.a.s.c.OverseerNodePrioritizer prioritizing overseer nodes at 97195206778093578-127.0.0.1:33371_solr-n_0000000000 overseer designates are [127.0.0.1:39242_solr]
   [junit4]   2> 198512 INFO  (Thread-294) [    ] o.a.s.c.OverseerNodePrioritizer sorted nodes [97195206778093578-127.0.0.1:33371_solr-n_0000000000, 97195206778093580-127.0.0.1:44067_solr-n_0000000001, 97195206778093579-127.0.0.1:32882_solr-n_0000000002, 97195206778093574-127.0.0.1:39242_solr-n_0000000003]
   [junit4]   2> 198512 INFO  (Thread-294) [    ] o.a.s.c.OverseerNodePrioritizer asking node 97195206778093574-127.0.0.1:39242_solr-n_0000000003 to come join election at head
   [junit4]   2> 198512 INFO  (qtp1795947352-1353) [    ] o.a.s.s.HttpSolrCall [admin] webapp=null path=/admin/collections params={node=127.0.0.1:39242_solr&role=overseer&action=ADDROLE&wt=javabin&version=2} status=0 QTime=3
   [junit4]   2> 198518 INFO  (qtp1795947352-1368) [    ] o.a.s.h.a.CollectionsHandler Invoked Collection Action :clusterstatus with params action=CLUSTERSTATUS&wt=javabin&version=2 and sendToOCPQueue=true
   [junit4]   2> 198519 INFO  (qtp1795947352-1368) [    ] o.a.s.s.HttpSolrCall [admin] webapp=null path=/admin/collections params={action=CLUSTERSTATUS&wt=javabin&version=2} status=0 QTime=0
   [junit4]   2> 198520 INFO  (qtp1795947352-1370) [    ] o.a.s.h.a.CollectionsHandler Invoked Collection Action :removerole with params node=127.0.0.1:39242_solr&role=overseer&action=REMOVEROLE&wt=javabin&version=2 and sendToOCPQueue=true
   [junit4]   2> 198521 INFO  (OverseerCollectionConfigSetProcessor-97195206778093578-127.0.0.1:33371_solr-n_0000000000) [    ] o.a.s.c.OverseerTaskQueue Response ZK path: /overseer/collection-queue-work/qnr-0000000000 doesn't exist.  Requestor may have disconnected from ZooKeeper
   [junit4]   2> 198521 INFO  (OverseerThreadFactory-944-thread-2) [    ] o.a.s.c.OverseerRoleCmd Overseer role removed from 127.0.0.1:39242_solr
   [junit4]   2> 198523 INFO  (qtp1795947352-1370) [    ] o.a.s.s.HttpSolrCall [admin] webapp=null path=/admin/collections params={node=127.0.0.1:39242_solr&role=overseer&action=REMOVEROLE&wt=javabin&version=2} status=0 QTime=2
   [junit4]   2> 198524 INFO  (qtp1795947352-1372) [    ] o.a.s.h.a.CollectionsHandler Invoked Collection Action :clusterstatus with params action=CLUSTERSTATUS&wt=javabin&version=2 and sendToOCPQueue=true
   [junit4]   2> 198524 INFO  (qtp1795947352-1372) [    ] o.a.s.s.HttpSolrCall [admin] webapp=null path=/admin/collections params={action=CLUSTERSTATUS&wt=javabin&version=2} status=0 QTime=0
   [junit4]   2> 198524 INFO  (TEST-CollectionsAPISolrJTest.testAddAndRemoveRole-seed#[C78FE6B86EB3B01C]) [    ] o.a.s.SolrTestCaseJ4 ###Ending testAddAndRemoveRole
   [junit4]   2> 198541 INFO  (TEST-CollectionsAPISolrJTest.testCreateAndDeleteAlias-seed#[C78FE6B86EB3B01C]) [    ] o.a.s.SolrTestCaseJ4 ###Starting testCreateAndDeleteAlias
   [junit4]   2> 198542 INFO  (qtp1795947352-1353) [    ] o.a.s.h.a.CollectionsHandler Invoked Collection Action :create with params replicationFactor=1&collection.configName=conf&name=aliasedCollection&action=CREATE&numShards=1&wt=javabin&version=2 and sendToOCPQueue=true
   [junit4]   2> 198544 INFO  (OverseerThreadFactory-944-thread-3) [    ] o.a.s.c.CreateCollectionCmd Create collection aliasedCollection
   [junit4]   2> 198544 INFO  (OverseerCollectionConfigSetProcessor-97195206778093578-127.0.0.1:33371_solr-n_0000000000) [    ] o.a.s.c.OverseerTaskQueue Response ZK path: /overseer/collection-queue-work/qnr-0000000002 doesn't exist.  Requestor may have disconnected from ZooKeeper
   [junit4]   2> 198544 INFO  (qtp1318974581-1335) [    ] o.a.s.s.HttpSolrCall [admin] webapp=null path=/admin/cores params={op=rejoinAtHead&qt=/admin/cores&action=OVERSEEROP&electionNode=97195206778093574-127.0.0.1:39242_solr-n_0000000003&wt=javabin&version=2} status=0 QTime=0
   [junit4]   2> 198545 INFO  (Thread-294) [    ] o.a.s.c.OverseerNodePrioritizer asking the old first in line 97195206778093580-127.0.0.1:44067_solr-n_0000000001 to rejoin election  
   [junit4]   2> 198551 INFO  (qtp1795947352-1372) [    ] o.a.s.s.HttpSolrCall [admin] webapp=null path=/admin/cores params={op=rejoin&qt=/admin/cores&action=OVERSEEROP&electionNode=97195206778093580-127.0.0.1:44067_solr-n_0000000001&wt=javabin&version=2} status=0 QTime=0
   [junit4]   2> 198553 INFO  (OverseerStateUpdate-97195206778093578-127.0.0.1:33371_solr-n_0000000000) [    ] o.a.s.c.Overseer Quit command received {
   [junit4]   2>   "operation":"quit",
   [junit4]   2>   "id":"97195206778093578-127.0.0.1:33371_solr-n_0000000000"} 127.0.0.1:33371_solr
   [junit4]   2> 198648 INFO  (qtp1318974581-1345) [    ] o.a.s.h.a.CoreAdminOperation core create command qt=/admin/cores&collection.configName=conf&newCollection=true&name=aliasedCollection_shard1_replica1&action=CREATE&numShards=1&collection=aliasedCollection&shard=shard1&wt=javabin&version=2
   [junit4]   2> 378544 ERROR (qtp1795947352-1353) [    ] o.a.s.h.RequestHandlerBase org.apache.solr.common.SolrException: create the collection time out:180s
   [junit4]   2> 	at org.apache.solr.handler.admin.CollectionsHandler.handleResponse(CollectionsHandler.java:292)
   [junit4]   2> 	at org.apache.solr.handler.admin.CollectionsHandler.handleRequestBody(CollectionsHandler.java:218)
   [junit4]   2> 	at org.apache.solr.handler.RequestHandlerBase.handleRequest(RequestHandlerBase.java:169)
   [junit4]   2> 	at org.apache.solr.servlet.HttpSolrCall.handleAdminRequest(HttpSolrCall.java:664)
   [junit4]   2> 	at org.apache.solr.servlet.HttpSolrCall.call(HttpSolrCall.java:445)
   [junit4]   2> 	at org.apache.solr.servlet.SolrDispatchFilter.doFilter(SolrDispatchFilter.java:345)
   [junit4]   2> 	at org.apache.solr.servlet.SolrDispatchFilter.doFilter(SolrDispatchFilter.java:296)
   [junit4]   2> 	at org.eclipse.jetty.servlet.ServletHandler$CachedChain.doFilter(ServletHandler.java:1699)
   [junit4]   2> 	at org.apache.solr.client.solrj.embedded.JettySolrRunner$DebugFilter.doFilter(JettySolrRunner.java:113)
   [junit4]   2> 	at org.eclipse.jetty.servlet.ServletHandler$CachedChain.doFilter(ServletHandler.java:1699)
   [junit4]   2> 	at org.eclipse.jetty.servlet.ServletHandler.doHandle(ServletHandler.java:582)
   [junit4]   2> 	at org.eclipse.jetty.server.session.SessionHandler.doHandle(SessionHandler.java:224)
   [junit4]   2> 	at org.eclipse.jetty.server.handler.ContextHandler.doHandle(ContextHandler.java:1180)
   [junit4]   2> 	at org.eclipse.jetty.servlet.ServletHandler.doScope(ServletHandler.java:512)
   [junit4]   2> 	at org.eclipse.jetty.server.session.SessionHandler.doScope(SessionHandler.java:185)
   [junit4]   2> 	at org.eclipse.jetty.server.handler.ContextHandler.doScope(ContextHandler.java:1112)
   [junit4]   2> 	at org.eclipse.jetty.server.handler.ScopedHandler.handle(ScopedHandler.java:141)
   [junit4]   2> 	at org.eclipse.jetty.server.handler.gzip.GzipHandler.handle(GzipHandler.java:462)
   [junit4]   2> 	at org.eclipse.jetty.server.handler.HandlerWrapper.handle(HandlerWrapper.java:134)
   [junit4]   2> 	at org.eclipse.jetty.server.Server.handle(Server.java:534)
   [junit4]   2> 	at org.eclipse.jetty.server.HttpChannel.handle(HttpChannel.java:320)
   [junit4]   2> 	at org.eclipse.jetty.server.HttpConnection.onFillable(HttpConnection.java:251)
   [junit4]   2> 	at org.eclipse.jetty.io.AbstractConnection$ReadCallback.succeeded(AbstractConnection.java:273)
   [junit4]   2> 	at org.eclipse.jetty.io.FillInterest.fillable(FillInterest.java:95)
   [junit4]   2> 	at org.eclipse.jetty.io.ssl.SslConnection.onFillable(SslConnection.java:202)
   [junit4]   2> 	at org.eclipse.jetty.io.AbstractConnection$ReadCallback.succeeded(AbstractConnection.java:273)
   [junit4]   2> 	at org.eclipse.jetty.io.FillInterest.fillable(FillInterest.java:95)
   [junit4]   2> 	at org.eclipse.jetty.io.SelectChannelEndPoint$2.run(SelectChannelEndPoint.java:93)
   [junit4]   2> 	at org.eclipse.jetty.util.thread.strategy.ExecuteProduceConsume.executeProduceConsume(ExecuteProduceConsume.java:303)
   [junit4]   2> 	at org.eclipse.jetty.util.thread.strategy.ExecuteProduceConsume.produceConsume(ExecuteProduceConsume.java:148)
   [junit4]   2> 	at org.eclipse.jetty.util.thread.strategy.ExecuteProduceConsume.run(ExecuteProduceConsume.java:136)
   [junit4]   2> 	at org.eclipse.jetty.util.thread.QueuedThreadPool.runJob(QueuedThreadPool.java:671)
   [junit4]   2> 	at org.eclipse.jetty.util.thread.QueuedThreadPool$2.run(QueuedThreadPool.java:589)
   [junit4]   2> 	at java.base/java.lang.Thread.run(Thread.java:844)
   [junit4]   2> 
   [junit4]   2> 378544 INFO  (qtp1795947352-1353) [    ] o.a.s.s.HttpSolrCall [admin] webapp=null path=/admin/collections params={replicationFactor=1&collection.configName=conf&name=aliasedCollection&action=CREATE&numShards=1&wt=javabin&version=2} status=500 QTime=180002
   [junit4]   2> 378545 ERROR (qtp1795947352-1353) [    ] o.a.s.s.HttpSolrCall null:org.apache.solr.common.SolrException: create the collection time out:180s
   [junit4]   2> 	at org.apache.solr.handler.admin.CollectionsHandler.handleResponse(CollectionsHandler.java:292)
   [junit4]   2> 	at org.apache.solr.handler.admin.CollectionsHandler.handleRequestBody(CollectionsHandler.java:218)
   [junit4]   2> 	at org.apache.solr.handler.RequestHandlerBase.handleRequest(RequestHandlerBase.java:169)
   [junit4]   2> 	at org.apache.solr.servlet.HttpSolrCall.handleAdminRequest(HttpSolrCall.java:664)
   [junit4]   2> 	at org.apache.solr.servlet.HttpSolrCall.call(HttpSolrCall.java:445)
   [junit4]   2> 	at org.apache.solr.servlet.SolrDispatchFilter.doFilter(SolrDispatchFilter.java:345)
   [junit4]   2> 	at org.apache.solr.servlet.SolrDispatchFilter.doFilter(SolrDispatchFilter.java:296)
   [junit4]   2> 	at org.eclipse.jetty.servlet.ServletHandler$CachedChain.doFilter(ServletHandler.java:1699)
   [junit4]   2> 	at org.apache.solr.client.solrj.embedded.JettySolrRunner$DebugFilter.doFilter(JettySolrRunner.java:113)
   [junit4]   2> 	at org.eclipse.jetty.servlet.ServletHandler$CachedChain.doFilter(ServletHandler.java:1699)
   [junit4]   2> 	at org.eclipse.jetty.servlet.ServletHandler.doHandle(ServletHandler.java:582)
   [junit4]   2> 	at org.eclipse.jetty.server.session.SessionHandler.doHandle(SessionHandler.java:224)
   [junit4]   2> 	at org.eclipse.jetty.server.handler.ContextHandler.doHandle(ContextHandler.java:1180)
   [junit4]   2> 	at org.eclipse.jetty.servlet.ServletHandler.doScope(ServletHandler.java:512)
   [junit4]   2> 	at org.eclipse.jetty.server.session.SessionHandler.doScope(SessionHandler.java:185)
   [junit4]   2> 	at org.eclipse.jetty.server.handler.ContextHandler.doScope(ContextHandler.java:1112)
   [junit4]   2> 	at org.eclipse.jetty.server.handler.ScopedHandler.handle(ScopedHandler.java:141)
   [junit4]   2> 	at org.eclipse.jetty.server.handler.gzip.GzipHandler.handle(GzipHandler.java:462)
   [junit4]   2> 	at org.eclipse.jetty.server.handler.HandlerWrapper.handle(HandlerWrapper.java:134)
   [junit4]   2> 	at org.eclipse.jetty.server.Server.handle(Server.java:534)
   [junit4]   2> 	at org.eclipse.jetty.server.HttpChannel.handle(HttpChannel.java:320)
   [junit4]   2> 	at org.eclipse.jetty.server.HttpConnection.onFillable(HttpConnection.java:251)
   [junit4]   2> 	at org.eclipse.jetty.io.AbstractConnection$ReadCallback.succeeded(AbstractConnection.java:273)
   [junit4]   2> 	at org.eclipse.jetty.io.FillInterest.fillable(FillInterest.java:95)
   [junit4]   2> 	at org.eclipse.jetty.io.ssl.SslConnection.onFillable(SslConnection.java:202)
   [junit4]   2> 	at org.eclipse.jetty.io.AbstractConnection$ReadCallback.succeeded(AbstractConnection.java:273)
   [junit4]   2> 	at org.eclipse.jetty.io.FillInterest.fillable(FillInterest.java:95)
   [junit4]   2> 	at org.eclipse.jetty.io.SelectChannelEndPoint$2.run(SelectChannelEndPoint.java:93)
   [junit4]   2> 	at org.eclipse.jetty.util.thread.strategy.ExecuteProduceConsume.executeProduceConsume(ExecuteProduceConsume.java:303)
   [junit4]   2> 	at org.eclipse.jetty.util.thread.strategy.ExecuteProduceConsume.produceConsume(ExecuteProduceConsume.java:148)
   [junit4]   2> 	at org.eclipse.jetty.util.thread.strategy.ExecuteProduceConsume.run(ExecuteProduceConsume.java:136)
   [junit4]   2> 	at org.eclipse.jetty.util.thread.QueuedThreadPool.runJob(QueuedThreadPool.java:671)
   [junit4]   2> 	at org.eclipse.jetty.util.thread.QueuedThreadPool$2.run(QueuedThreadPool.java:589)
   [junit4]   2> 	at java.base/java.lang.Thread.run(Thread.java:844)
   [junit4]   2> 
   [junit4]   2> 378545 INFO  (TEST-CollectionsAPISolrJTest.testCreateAndDeleteAlias-seed#[C78FE6B86EB3B01C]) [    ] o.a.s.SolrTestCaseJ4 ###Ending testCreateAndDeleteAlias
   [junit4]   2> NOTE: reproduce with: ant test  -Dtestcase=CollectionsAPISolrJTest -Dtests.method=testCreateAndDeleteAlias -Dtests.seed=C78FE6B86EB3B01C -Dtests.multiplier=3 -Dtests.slow=true -Dtests.locale=nl-BE -Dtests.timezone=America/Maceio -Dtests.asserts=true -Dtests.file.encoding=ISO-8859-1
   [junit4] ERROR    180s J2 | CollectionsAPISolrJTest.testCreateAndDeleteAlias <<<
   [junit4]    > Throwable #1: org.apache.solr.client.solrj.impl.HttpSolrClient$RemoteSolrException: Error from server at https://127.0.0.1:44067/solr: create the collection time out:180s
   [junit4]    > 	at __randomizedtesting.SeedInfo.seed([C78FE6B86EB3B01C:96CA142CE0C4187]:0)
   [junit4]    > 	at org.apache.solr.client.solrj.impl.HttpSolrClient.executeMethod(HttpSolrClient.java:627)
   [junit4]    > 	at org.apache.solr.client.solrj.impl.HttpSolrClient.request(HttpSolrClient.java:279)
   [junit4]    > 	at org.apache.solr.client.solrj.impl.HttpSolrClient.request(HttpSolrClient.java:268)
   [junit4]    > 	at org.apache.solr.client.solrj.impl.LBHttpSolrClient.doRequest(LBHttpSolrClient.java:439)
   [junit4]    > 	at org.apache.solr.client.solrj.impl.LBHttpSolrClient.request(LBHttpSolrClient.java:391)
   [junit4]    > 	at org.apache.solr.client.solrj.impl.CloudSolrClient.sendRequest(CloudSolrClient.java:1344)
   [junit4]    > 	at org.apache.solr.client.solrj.impl.CloudSolrClient.requestWithRetryOnStaleState(CloudSolrClient.java:1095)
   [junit4]    > 	at org.apache.solr.client.solrj.impl.CloudSolrClient.request(CloudSolrClient.java:1037)
   [junit4]    > 	at org.apache.solr.client.solrj.SolrRequest.process(SolrRequest.java:149)
   [junit4]    > 	at org.apache.solr.client.solrj.SolrRequest.process(SolrRequest.java:166)
   [junit4]    > 	at org.apache.solr.cloud.CollectionsAPISolrJTest.testCreateAndDeleteAlias(CollectionsAPISolrJTest.java:128)
   [junit4]    > 	at java.base/jdk.internal.reflect.NativeMethodAccessorImpl.invoke0(Native Method)
   [junit4]    > 	at java.base/jdk.internal.reflect.NativeMethodAccessorImpl.invoke(NativeMethodAccessorImpl.java:62)
   [junit4]    > 	at java.base/jdk.internal.reflect.DelegatingMethodAccessorImpl.invoke(DelegatingMethodAccessorImpl.java:43)
   [junit4]    > 	at java.base/java.lang.reflect.Method.invoke(Method.java:538)
   [junit4]    > 	at java.base/java.lang.Thread.run(Thread.java:844)
   [junit4]   2> 378555 INFO  (TEST-CollectionsAPISolrJTest.testSplitShard-seed#[C78FE6B86EB3B01C]) [    ] o.a.s.SolrTestCaseJ4 ###Starting testSplitShard
   [junit4]   2> 378556 INFO  (qtp1795947352-1368) [    ] o.a.s.h.a.CollectionsHandler Invoked Collection Action :create with params replicationFactor=1&collection.configName=conf&name=solrj_test_splitshard&action=CREATE&numShards=2&wt=javabin&version=2 and sendToOCPQueue=true
   [junit4]   2> 558557 ERROR (qtp1795947352-1368) [    ] o.a.s.h.RequestHandlerBase org.apache.solr.common.SolrException: create the collection time out:180s
   [junit4]   2> 	at org.apache.solr.handler.admin.CollectionsHandler.handleResponse(CollectionsHandler.java:292)
   [junit4]   2> 	at org.apache.solr.handler.admin.CollectionsHandler.handleRequestBody(CollectionsHandler.java:218)
   [junit4]   2> 	at org.apache.solr.handler.RequestHandlerBase.handleRequest(RequestHandlerBase.java:169)
   [junit4]   2> 	at org.apache.solr.servlet.HttpSolrCall.handleAdminRequest(HttpSolrCall.java:664)
   [junit4]   2> 	at org.apache.solr.servlet.HttpSolrCall.call(HttpSolrCall.java:445)
   [junit4]   2> 	at org.apache.solr.servlet.SolrDispatchFilter.doFilter(SolrDispatchFilter.java:345)
   [junit4]   2> 	at org.apache.solr.servlet.SolrDispatchFilter.doFilter(SolrDispatchFilter.java:296)
   [junit4]   2> 	at org.eclipse.jetty.servlet.ServletHandler$CachedChain.doFilter(ServletHandler.java:1699)
   [junit4]   2> 	at org.apache.solr.client.solrj.embedded.JettySolrRunner$DebugFilter.doFilter(JettySolrRunner.java:113)
   [junit4]   2> 	at org.eclipse.jetty.servlet.ServletHandler$CachedChain.doFilter(ServletHandler.java:1699)
   [junit4]   2> 	at org.eclipse.jetty.servlet.ServletHandler.doHandle(ServletHandler.java:582)
   [junit4]   2> 	at org.eclipse.jetty.server.session.SessionHandler.doHandle(SessionHandler.java:224)
   [junit4]   2> 	at org.eclipse.jetty.server.handler.ContextHandler.doHandle(ContextHandler.java:1180)
   [junit4]   2> 	at org.eclipse.jetty.servlet.ServletHandler.doScope(ServletHandler.java:512)
   [junit4]   2> 	at org.eclipse.jetty.server.session.SessionHandler.doScope(SessionHandler.java:185)
   [junit4]   2> 	at org.eclipse.jetty.server.handler.ContextHandler.doScope(ContextHandler.java:1112)
   [junit4]   2> 	at org.eclipse.jetty.server.handler.ScopedHandler.handle(ScopedHandler.java:141)
   [junit4]   2> 	at org.eclipse.jetty.server.handler.gzip.GzipHandler.handle(GzipHandler.java:462)
   [junit4]   2> 	at org.eclipse.jetty.server.handler.HandlerWrapper.handle(HandlerWrapper.java:134)
   [junit4]   2> 	at org.eclipse.jetty.server.Server.handle(Server.java:534)
   [junit4]   2> 	at org.eclipse.jetty.server.HttpChannel.handle(HttpChannel.java:320)
   [junit4]   2> 	at org.eclipse.jetty.server.HttpConnection.onFillable(HttpConnection.java:251)
   [junit4]   2> 	at org.eclipse.jetty.io.AbstractConnection$ReadCallback.succeeded(AbstractConnection.java:273)
   [junit4]   2> 	at org.eclipse.jetty.io.FillInterest.fillable(FillInterest.java:95)
   [junit4]   2> 	at org.eclipse.jetty.io.ssl.SslConnection.onFillable(SslConnection.java:202)
   [junit4]   2> 	at org.eclipse.jetty.io.AbstractConnection$ReadCallback.succeeded(AbstractConnection.java:273)
   [junit4]   2> 	at org.eclipse.jetty.io.FillInterest.fillable(FillInterest.java:95)
   [junit4]   2> 	at org.eclipse.jetty.io.SelectChannelEndPoint$2.run(SelectChannelEndPoint.java:93)
   [junit4]   2> 	at org.eclipse.jetty.util.thread.strategy.ExecuteProduceConsume.executeProduceConsume(ExecuteProduceConsume.java:303)
   [junit4]   2> 	at org.eclipse.jetty.util.thread.strategy.ExecuteProduceConsume.produceConsume(ExecuteProduceConsume.java:148)
   [junit4]   2> 	at org.eclipse.jetty.util.thread.strategy.ExecuteProduceConsume.run(ExecuteProduceConsume.java:136)
   [junit4]   2> 	at org.eclipse.jetty.util.thread.QueuedThreadPool.runJob(QueuedThreadPool.java:671)
   [junit4]   2> 	at org.eclipse.jetty.util.thread.QueuedThreadPool$2.run(QueuedThreadPool.java:589)
   [junit4]   2> 	at java.base/java.lang.Thread.run(Thread.java:844)
   [junit4]   2> 
   [junit4]   2> 558558 INFO  (qtp1795947352-1368) [    ] o.a.s.s.HttpSolrCall [admin] webapp=null path=/admin/collections params={replicationFactor=1&collection.configName=conf&name=solrj_test_splitshard&action=CREATE&numShards=2&wt=javabin&version=2} status=500 QTime=180001
   [junit4]   2> 558558 ERROR (qtp1795947352-1368) [    ] o.a.s.s.HttpSolrCall null:org.apache.solr.common.SolrException: create the collection time out:180s
   [junit4]   2> 	at org.apache.solr.handler.admin.CollectionsHandler.handleResponse(CollectionsHandler.java:292)
   [junit4]   2> 	at org.apache.solr.handler.admin.CollectionsHandler.handleRequestBody(CollectionsHandler.java:218)
   [junit4]   2> 	at org.apache.solr.handler.RequestHandlerBase.handleRequest(RequestHandlerBase.java:169)
   [junit4]   2> 	at org.apache.solr.servlet.HttpSolrCall.handleAdminRequest(HttpSolrCall.java:664)
   [junit4]   2> 	at org.apache.solr.servlet.HttpSolrCall.call(HttpSolrCall.java:445)
   [junit4]   2> 	at org.apache.solr.servlet.SolrDispatchFilter.doFilter(SolrDispatchFilter.java:345)
   [junit4]   2> 	at org.apache.solr.servlet.SolrDispatchFilter.doFilter(SolrDispatchFilter.java:296)
   [junit4]   2> 	at org.eclipse.jetty.servlet.ServletHandler$CachedChain.doFilter(ServletHandler.java:1699)
   [junit4]   2> 	at org.apache.solr.client.solrj.embedded.JettySolrRunner$DebugFilter.doFilter(JettySolrRunner.java:113)
   [junit4]   2> 	at org.eclipse.jetty.servlet.ServletHandler$CachedChain.doFilter(ServletHandler.java:1699)
   [junit4]   2> 	at org.eclipse.jetty.servlet.ServletHandler.doHandle(ServletHandler.java:582)
   [junit4]   2> 	at org.eclipse.jetty.server.session.SessionHandler.doHandle(SessionHandler.java:224)
   [junit4]   2> 	at org.eclipse.jetty.server.handler.ContextHandler.doHandle(ContextHandler.java:1180)
   [junit4]   2> 	at org.eclipse.jetty.servlet.ServletHandler.doScope(ServletHandler.java:512)
   [junit4]   2> 	at org.eclipse.jetty.server.session.SessionHandler.doScope(SessionHandler.java:185)
   [junit4]   2> 	at org.eclipse.jetty.server.handler.ContextHandler.doScope(ContextHandler.java:1112)
   [junit4]   2> 	at org.eclipse.jetty.server.handler.ScopedHandler.handle(ScopedHandler.java:141)
   [junit4]   2> 	at org.eclipse.jetty.server.handler.gzip.GzipHandler.handle(GzipHandler.java:462)
   [junit4]   2> 	at org.eclipse.jetty.server.handler.HandlerWrapper.handle(HandlerWrapper.java:134)
   [junit4]   2> 	at org.eclipse.jetty.server.Server.handle(Server.java:534)
   [junit4]   2> 	at org.eclipse.jetty.server.HttpChannel.handle(HttpChannel.java:320)
   [junit4]   2> 	at org.eclipse.jetty.server.HttpConnection.onFillable(HttpConnection.java:251)
   [junit4]   2> 	at org.eclipse.jetty.io.AbstractConnection$ReadCallback.succeeded(AbstractConnection.java:273)
   [junit4]   2> 	at org.eclipse.jetty.io.FillInterest.fillable(FillInterest.java:95)
   [junit4]   2> 	at org.eclipse.jetty.io.ssl.SslConnection.onFillable(SslConnection.java:202)
   [junit4]   2> 	at org.eclipse.jetty.io.AbstractConnection$ReadCallback.succeeded(AbstractConnection.java:273)
   [junit4]   2> 	at org.eclipse.jetty.io.FillInterest.fillable(FillInterest.java:95)
   [junit4]   2> 	at org.eclipse.jetty.io.SelectChannelEndPoint$2.run(SelectChannelEndPoint.java:93)
   [junit4]   2> 	at org.eclipse.jetty.util.thread.strategy.ExecuteProduceConsume.executeProduceConsume(ExecuteProduceConsume.java:303)
   [junit4]   2> 	at org.eclipse.jetty.util.thread.strategy.ExecuteProduceConsume.produceConsume(ExecuteProduceConsume.java:148)
   [junit4]   2> 	at org.eclipse.jetty.util.thread.strategy.ExecuteProduceConsume.run(ExecuteProduceConsume.java:136)
   [junit4]   2> 	at org.eclipse.jetty.util.thread.QueuedThreadPool.runJob(QueuedThreadPool.java:671)
   [junit4]   2> 	at org.eclipse.jetty.util.thread.QueuedThreadPool$2.run(QueuedThreadPool.java:589)
   [junit4]   2> 	at java.base/java.lang.Thread.run(Thread.java:844)
   [junit4]   2> 
   [junit4]   2> 558558 INFO  (TEST-CollectionsAPISolrJTest.testSplitShard-seed#[C78FE6B86EB3B01C]) [    ] o.a.s.SolrTestCaseJ4 ###Ending testSplitShard
   [junit4]   2> NOTE: reproduce with: ant test  -Dtestcase=CollectionsAPISolrJTest -Dtests.method=testSplitShard -Dtests.seed=C78FE6B86EB3B01C -Dtests.multiplier=3 -Dtests.slow=true -Dtests.locale=nl-BE -Dtests.timezone=America/Maceio -Dtests.asserts=true -Dtests.file.encoding=ISO-8859-1
   [junit4] ERROR    180s J2 | CollectionsAPISolrJTest.testSplitShard <<<
   [junit4]    > Throwable #1: org.apache.solr.client.solrj.impl.HttpSolrClient$RemoteSolrException: Error from server at https://127.0.0.1:44067/solr: create the collection time out:180s
   [junit4]    > 	at __randomizedtesting.SeedInfo.seed([C78FE6B86EB3B01C:1C854BD470468CA3]:0)
   [junit4]    > 	at org.apache.solr.client.solrj.impl.HttpSolrClient.executeMethod(HttpSolrClient.java:627)
   [junit4]    > 	at org.apache.solr.client.solrj.impl.HttpSolrClient.request(HttpSolrClient.java:279)
   [junit4]    > 	at org.apache.solr.client.solrj.impl.HttpSolrClient.request(HttpSolrClient.java:268)
   [junit4]    > 	at org.apache.solr.client.solrj.impl.LBHttpSolrClient.doRequest(LBHttpSolrClient.java:439)
   [junit4]    > 	at org.apache.solr.client.solrj.impl.LBHttpSolrClient.request(LBHttpSolrClient.java:391)
   [junit4]    > 	at org.apache.solr.client.solrj.impl.CloudSolrClient.sendRequest(CloudSolrClient.java:1344)
   [junit4]    > 	at org.apache.solr.client.solrj.impl.CloudSolrClient.requestWithRetryOnStaleState(CloudSolrClient.java:1095)
   [junit4]    > 	at org.apache.solr.client.solrj.impl.CloudSolrClient.request(CloudSolrClient.java:1037)
   [junit4]    > 	at org.apache.solr.client.solrj.SolrRequest.process(SolrRequest.java:149)
   [junit4]    > 	at org.apache.solr.client.solrj.SolrRequest.process(SolrRequest.java:166)
   [junit4]    > 	at org.apache.solr.cloud.CollectionsAPISolrJTest.testSplitShard(CollectionsAPISolrJTest.java:143)
   [junit4]    > 	at java.base/jdk.internal.reflect.NativeMethodAccessorImpl.invoke0(Native Method)
   [junit4]    > 	at java.base/jdk.internal.reflect.NativeMethodAccessorImpl.invoke(NativeMethodAccessorImpl.java:62)
   [junit4]    > 	at java.base/jdk.internal.reflect.DelegatingMethodAccessorImpl.invoke(DelegatingMethodAccessorImpl.java:43)
   [junit4]    > 	at java.base/java.lang.reflect.Method.invoke(Method.java:538)
   [junit4]    > 	at java.base/java.lang.Thread.run(Thread.java:844)
   [junit4]   2> 558567 INFO  (TEST-CollectionsAPISolrJTest.testBalanceShardUnique-seed#[C78FE6B86EB3B01C]) [    ] o.a.s.SolrTestCaseJ4 ###Starting testBalanceShardUnique
   [junit4]   2> 558568 INFO  (qtp1795947352-1358) [    ] o.a.s.h.a.CollectionsHandler Invoked Collection Action :create with params replicationFactor=2&collection.configName=conf&name=balancedProperties&action=CREATE&numShards=2&wt=javabin&version=2 and sendToOCPQueue=true
   [junit4]   2> 738569 ERROR (qtp1795947352-1358) [    ] o.a.s.h.RequestHandlerBase org.apache.solr.common.SolrException: create the collection time out:180s
   [junit4]   2> 	at org.apache.solr.handler.admin.CollectionsHandler.handleResponse(CollectionsHandler.java:292)
   [junit4]   2> 	at org.apache.solr.handler.admin.CollectionsHandler.handleRequestBody(CollectionsHandler.java:218)
   [junit4]   2> 	at org.apache.solr.handler.RequestHandlerBase.handleRequest(RequestHandlerBase.java:169)
   [junit4]   2> 	at org.apache.solr.servlet.HttpSolrCall.handleAdminRequest(HttpSolrCall.java:664)
   [junit4]   2> 	at org.apache.solr.servlet.HttpSolrCall.call(HttpSolrCall.java:445)
   [junit4]   2> 	at org.apache.solr.servlet.SolrDispatchFilter.doFilter(SolrDispatchFilter.java:345)
   [junit4]   2> 	at org.apache.solr.servlet.SolrDispatchFilter.doFilter(SolrDispatchFilter.java:296)
   [junit4]   2> 	at org.eclipse.jetty.servlet.ServletHandler$CachedChain.doFilter(ServletHandler.java:1699)
   [junit4]   2> 	at org.apache.solr.client.solrj.embedded.JettySolrRunner$DebugFilter.doFilter(JettySolrRunner.java:113)
   [junit4]   2> 	at org.eclipse.jetty.servlet.ServletHandler$CachedChain.doFilter(ServletHandler.java:1699)
   [junit4]   2> 	at org.eclipse.jetty.servlet.ServletHandler.doHandle(ServletHandler.java:582)
   [junit4]   2> 	at org.eclipse.jetty.server.session.SessionHandler.doHandle(SessionHandler.java:224)
   [junit4]   2> 	at org.eclipse.jetty.server.handler.ContextHandler.doHandle(ContextHandler.java:1180)
   [junit4]   2> 	at org.eclipse.jetty.servlet.ServletHandler.doScope(ServletHandler.java:512)
   [junit4]   2> 	at org.eclipse.jetty.server.session.SessionHandler.doScope(SessionHandler.java:185)
   [junit4]   2> 	at org.eclipse.jetty.server.handler.ContextHandler.doScope(ContextHandler.java:1112)
   [junit4]   2> 	at org.eclipse.jetty.server.handler.ScopedHandler.handle(ScopedHandler.java:141)
   [junit4]   2> 	at org.eclipse.jetty.server.handler.gzip.GzipHandler.handle(GzipHandler.java:462)
   [junit4]   2> 	at org.eclipse.jetty.server.handler.HandlerWrapper.handle(HandlerWrapper.java:134)
   [junit4]   2> 	at org.eclipse.jetty.server.Server.handle(Server.java:534)
   [junit4]   2> 	at org.eclipse.jetty.server.HttpChannel.handle(HttpChannel.java:320)
   [junit4]   2> 	at org.eclipse.jetty.server.HttpConnection.onFillable(HttpConnection.java:251)
   [junit4]   2> 	at org.eclipse.jetty.io.AbstractConnection$ReadCallback.succeeded(AbstractConnection.java:273)
   [junit4]   2> 	at org.eclipse.jetty.io.FillInterest.fillable(FillInterest.java:95)
   [junit4]   2> 	at org.eclipse.jetty.io.ssl.SslConnection.onFillable(SslConnection.java:202)
   [junit4]   2> 	at org.eclipse.jetty.io.AbstractConnection$ReadCallback.succeeded(AbstractConnection.java:273)
   [junit4]   2> 	at org.eclipse.jetty.io.FillInterest.fillable(FillInterest.java:95)
   [junit4]   2> 	at org.eclipse.jetty.io.SelectChannelEndPoint$2.run(SelectChannelEndPoint.java:93)
   [junit4]   2> 	at org.eclipse.jetty.util.thread.strategy.ExecuteProduceConsume.executeProduceConsume(ExecuteProduceConsume.java:303)
   [junit4]   2> 	at org.eclipse.jetty.util.thread.strategy.ExecuteProduceConsume.produceConsume(ExecuteProduceConsume.java:148)
   [junit4]   2> 	at org.eclipse.jetty.util.thread.strategy.ExecuteProduceConsume.run(ExecuteProduceConsume.java:136)
   [junit4]   2> 	at org.eclipse.jetty.util.thread.QueuedThreadPool.runJob(QueuedThreadPool.java:671)
   [junit4]   2> 	at org.eclipse.jetty.util.thread.QueuedThreadPool$2.run(QueuedThreadPool.java:589)
   [junit4]   2> 	at java.base/java.lang.Thread.run(Thread.java:844)
   [junit4]   2> 
   [junit4]   2> 738569 INFO  (qtp1795947352-1358) [    ] o.a.s.s.HttpSolrCall [admin] webapp=null path=/admin/collections params={replicationFactor=2&collection.configName=conf&name=balancedProperties&action=CREATE&numShards=2&wt=javabin&version=2} status=500 QTime=180001
   [junit4]   2> 738569 ERROR (qtp1795947352-1358) [    ] o.a.s.s.HttpSolrCall null:org.apache.solr.common.SolrException: create the collection time out:180s
   [junit4]   2> 	at org.apache.solr.handler.admin.CollectionsHandler.handleResponse(CollectionsHandler.java:292)
   [junit4]   2> 	at org.apache.solr.handler.admin.CollectionsHandler.handleRequestBody(CollectionsHandler.java:218)
   [junit4]   2> 	at org.apache.solr.handler.RequestHandlerBase.handleRequest(RequestHandlerBase.java:169)
   [junit4]   2> 	at org.apache.solr.servlet.HttpSolrCall.handleAdminRequest(HttpSolrCall.java:664)
   [junit4]   2> 	at org.apache.solr.servlet.HttpSolrCall.call(HttpSolrCall.java:445)
   [junit4]   2> 	at org.apache.solr.servlet.SolrDispatchFilter.doFilter(SolrDispatchFilter.java:345)
   [junit4]   2> 	at org.apache.solr.servlet.SolrDispatchFilter.doFilter(SolrDispatchFilter.java:296)
   [junit4]   2> 	at org.eclipse.jetty.servlet.ServletHandler$CachedChain.doFilter(ServletHandler.java:1699)
   [junit4]   2> 	at org.apache.solr.client.solrj.embedded.JettySolrRunner$DebugFilter.doFilter(JettySolrRunner.java:113)
   [junit4]   2> 	at org.eclipse.jetty.servlet.ServletHandler$CachedChain.doFilter(ServletHandler.java:1699)
   [junit4]   2> 	at org.eclipse.jetty.servlet.ServletHandler.doHandle(ServletHandler.java:582)
   [junit4]   2> 	at org.eclipse.jetty.server.session.SessionHandler.doHandle(SessionHandler.java:224)
   [junit4]   2> 	at org.eclipse.jetty.server.handler.ContextHandler.doHandle(ContextHandler.java:1180)
   [junit4]   2> 	at org.eclipse.jetty.servlet.ServletHandler.doScope(ServletHandler.java:512)
   [junit4]   2> 	at org.eclipse.jetty.server.session.SessionHandler.doScope(SessionHandler.java:185)
   [junit4]   2> 	at org.eclipse.jetty.server.handler.ContextHandler.doScope(ContextHandler.java:1112)
   [junit4]   2> 	at org.eclipse.jetty.server.handler.ScopedHandler.handle(ScopedHandler.java:141)
   [junit4]   2> 	at org.eclipse.jetty.server.handler.gzip.GzipHandler.handle(GzipHandler.java:462)
   [junit4]   2> 	at org.eclipse.jetty.server.handler.HandlerWrapper.handle(HandlerWrapper.java:134)
   [junit4]   2> 	at org.eclipse.jetty.server.Server.handle(Server.java:534)
   [junit4]   2> 	at org.eclipse.jetty.server.HttpChannel.handle(HttpChannel.java:320)
   [junit4]   2> 	at org.eclipse.jetty.server.HttpConnection.onFillable(HttpConnection.java:251)
   [junit4]   2> 	at org.eclipse.jetty.io.AbstractConnection$ReadCallback.succeeded(AbstractConnection.java:273)
   [junit4]   2> 	at org.eclipse.jetty.io.FillInterest.fillable(FillInterest.java:95)
   [junit4]   2> 	at org.eclipse.jetty.io.ssl.SslConnection.onFillable(SslConnection.java:202)
   [junit4]   2> 	at org.eclipse.jetty.io.AbstractConnection$ReadCallback.succeeded(AbstractConnection.java:273)
   [junit4]   2> 	at org.eclipse.jetty.io.FillInterest.fillable(FillInterest.java:95)
   [junit4]   2> 	at org.eclipse.jetty.io.SelectChannelEndPoint$2.run(SelectChannelEndPoint.java:93)
   [junit4]   2> 	at org.eclipse.jetty.util.thread.strategy.ExecuteProduceConsume.executeProduceConsume(ExecuteProduceConsume.java:303)
   [junit4]   2> 	at org.eclipse.jetty.util.thread.strategy.ExecuteProduceConsume.produceConsume(ExecuteProduceConsume.java:148)
   [junit4]   2> 	at org.eclipse.jetty.util.thread.strategy.ExecuteProduceConsume.run(ExecuteProduceConsume.java:136)
   [junit4]   2> 	at org.eclipse.jetty.util.thread.QueuedThreadPool.runJob(QueuedThreadPool.java:671)
   [junit4]   2> 	at org.eclipse.jetty.util.thread.QueuedThreadPool$2.run(QueuedThreadPool.java:589)
   [junit4]   2> 	at java.base/java.lang.Thread.run(Thread.java:844)
   [junit4]   2> 
   [junit4]   2> 738570 INFO  (TEST-CollectionsAPISolrJTest.testBalanceShardUnique-seed#[C78FE6B86EB3B01C]) [    ] o.a.s.SolrTestCaseJ4 ###Ending testBalanceShardUnique
   [junit4]   2> NOTE: reproduce with: ant test  -Dtestcase=CollectionsAPISolrJTest -Dtests.method=testBalanceShardUnique -Dtests.seed=C78FE6B86EB3B01C -Dtests.multiplier=3 -Dtests.slow=true -Dtests.locale=nl-BE -Dtests.timezone=America/Maceio -Dtests.asserts=true -Dtests.file.encoding=ISO-8859-1
   [junit4] ERROR    180s J2 | CollectionsAPISolrJTest.testBalanceShardUnique <<<
   [junit4]    > Throwable #1: org.apache.solr.client.solrj.impl.HttpSolrClient$RemoteSolrException: Error from server at https://127.0.0.1:44067/solr: create the collection time out:180s
   [junit4]    > 	at __randomizedtesting.SeedInfo.seed([C78FE6B86EB3B01C:8F3750F5D41318DF]:0)
   [junit4]    > 	at org.apache.solr.client.solrj.impl.HttpSolrClient.executeMethod(HttpSolrClient.java:627)
   [junit4]    > 	at org.apache.solr.client.solrj.impl.HttpSolrClient.request(HttpSolrClient.java:279)
   [junit4]    > 	at org.apache.solr.client.solrj.impl.HttpSolrClient.request(HttpSolrClient.java:268)
   [junit4]    > 	at org.apache.solr.client.solrj.impl.LBHttpSolrClient.doRequest(LBHttpSolrClient.java:439)
   [junit4]    > 	at org.apache.solr.client.solrj.impl.LBHttpSolrClient.request(LBHttpSolrClient.java:391)
   [junit4]    > 	at org.apache.solr.client.solrj.impl.CloudSolrClient.sendRequest(CloudSolrClient.java:1344)
   [junit4]    > 	at org.apache.solr.client.solrj.impl.CloudSolrClient.requestWithRetryOnStaleState(CloudSolrClient.java:1095)
   [junit4]    > 	at org.apache.solr.client.solrj.impl.CloudSolrClient.request(CloudSolrClient.java:1037)
   [junit4]    > 	at org.apache.solr.client.solrj.SolrRequest.process(SolrRequest.java:149)
   [junit4]    > 	at org.apache.solr.client.solrj.SolrRequest.process(SolrRequest.java:166)
   [junit4]    > 	at org.apache.solr.cloud.CollectionsAPISolrJTest.testBalanceShardUnique(CollectionsAPISolrJTest.java:335)
   [junit4]    > 	at java.base/jdk.internal.reflect.NativeMethodAccessorImpl.invoke0(Native Method)
   [junit4]    > 	at java.base/jdk.internal.reflect.NativeMethodAccessorImpl.invoke(NativeMethodAccessorImpl.java:62)
   [junit4]    > 	at java.base/jdk.internal.reflect.DelegatingMethodAccessorImpl.invoke(DelegatingMethodAccessorImpl.java:43)
   [junit4]    > 	at java.base/java.lang.reflect.Method.invoke(Method.java:538)
   [junit4]    > 	at java.base/java.lang.Thread.run(Thread.java:844)
   [junit4]   2> 738580 INFO  (TEST-CollectionsAPISolrJTest.testCreateCollectionWithPropertyParam-seed#[C78FE6B86EB3B01C]) [    ] o.a.s.SolrTestCaseJ4 ###Starting testCreateCollectionWithPropertyParam
   [junit4]   2> 738581 INFO  (qtp1795947352-1353) [    ] o.a.s.h.a.CollectionsHandler Invoked Collection Action :create with params replicationFactor=1&property.ulogDir=/home/jenkins/workspace/Lucene-Solr-master-Linux/solr/build/solr-core/test/J2/temp/solr.cloud.CollectionsAPISolrJTest_C78FE6B86EB3B01C-001/testPropertyParamsForCreate-001/ulogDir-kig&property.dataDir=/home/jenkins/workspace/Lucene-Solr-master-Linux/solr/build/solr-core/test/J2/temp/solr.cloud.CollectionsAPISolrJTest_C78FE6B86EB3B01C-001/testPropertyParamsForCreate-001/dataDir-ezu&collection.configName=conf&name=solrj_test_core_props&action=CREATE&numShards=1&wt=javabin&version=2 and sendToOCPQueue=true
   [junit4]   2> 798693 ERROR (OverseerThreadFactory-944-thread-3) [    ] o.a.s.c.OverseerCollectionMessageHandler Error from shard: https://127.0.0.1:39242/solr
   [junit4]   2> org.apache.solr.client.solrj.SolrServerException: Timeout occured while waiting response from server at: https://127.0.0.1:39242/solr
   [junit4]   2> 	at org.apache.solr.client.solrj.impl.HttpSolrClient.executeMethod(HttpSolrClient.java:638)
   [junit4]   2> 	at org.apache.solr.client.solrj.impl.HttpSolrClient.request(HttpSolrClient.java:279)
   [junit4]   2> 	at org.apache.solr.client.solrj.impl.HttpSolrClient.request(HttpSolrClient.java:268)
   [junit4]   2> 	at org.apache.solr.client.solrj.SolrClient.request(SolrClient.java:1219)
   [junit4]   2> 	at org.apache.solr.handler.component.HttpShardHandler.lambda$submit$0(HttpShardHandler.java:163)
   [junit4]   2> 	at java.base/java.util.concurrent.FutureTask.run(FutureTask.java:264)
   [junit4]   2> 	at java.base/java.util.concurrent.Executors$RunnableAdapter.call(Executors.java:514)
   [junit4]   2> 	at java.base/java.util.concurrent.FutureTask.run(FutureTask.java:264)
   [junit4]   2> 	at org.apache.solr.common.util.ExecutorUtil$MDCAwareThreadPoolExecutor.lambda$execute$0(ExecutorUtil.java:229)
   [junit4]   2> 	at java.base/java.util.concurrent.ThreadPoolExecutor.runWorker(ThreadPoolExecutor.java:1161)
   [junit4]   2> 	at java.base/java.util.concurrent.ThreadPoolExecutor$Worker.run(ThreadPoolExecutor.java:635)
   [junit4]   2> 	at java.base/java.lang.Thread.run(Thread.java:844)
   [junit4]   2> Caused by: java.net.SocketTimeoutException: Read timed out
   [junit4]   2> 	at java.base/java.net.SocketInputStream.socketRead0(Native Method)
   [junit4]   2> 	at java.base/java.net.SocketInputStream.socketRead(SocketInputStream.java:116)
   [junit4]   2> 	at java.base/java.net.SocketInputStream.read(SocketInputStream.java:170)
   [junit4]   2> 	at java.base/java.net.SocketInputStream.read(SocketInputStream.java:141)
   [junit4]   2> 	at java.base/sun.security.ssl.SSLSocketInputRecord.read(SSLSocketInputRecord.java:425)
   [junit4]   2> 	at java.base/sun.security.ssl.SSLSocketInputRecord.bytesInCompletePacket(SSLSocketInputRecord.java:65)
   [junit4]   2> 	at java.base/sun.security.ssl.SSLSocketImpl.bytesInCompletePacket(SSLSocketImpl.java:913)
   [junit4]   2> 	at java.base/sun.security.ssl.AppInputStream.read(AppInputStream.java:144)
   [junit4]   2> 	at org.apache.http.impl.io.SessionInputBufferImpl.streamRead(SessionInputBufferImpl.java:139)
   [junit4]   2> 	at org.apache.http.impl.io.SessionInputBufferImpl.fillBuffer(SessionInputBufferImpl.java:155)
   [junit4]   2> 	at org.apache.http.impl.io.SessionInputBufferImpl.readLine(SessionInputBufferImpl.java:284)
   [junit4]   2> 	at org.apache.http.impl.conn.DefaultHttpResponseParser.parseHead(DefaultHttpResponseParser.java:140)
   [junit4]   2> 	at org.apache.http.impl.conn.DefaultHttpResponseParser.parseHead(DefaultHttpResponseParser.java:57)
   [junit4]   2> 	at org.apache.http.impl.io.AbstractMessageParser.parse(AbstractMessageParser.java:261)
   [junit4]   2> 	at org.apache.http.impl.DefaultBHttpClientConnection.receiveResponseHeader(DefaultBHttpClientConnection.java:165)
   [junit4]   2> 	at org.apache.http.impl.conn.CPoolProxy.receiveResponseHeader(CPoolProxy.java:167)
   [junit4]   2> 	at org.apache.http.protocol.HttpRequestExecutor.doReceiveResponse(HttpRequestExecutor.java:272)
   [junit4]   2> 	at org.apache.http.protocol.HttpRequestExecutor.execute(HttpRequestExecutor.java:124)
   [junit4]   2> 	at org.apache.solr.util.stats.InstrumentedHttpRequestExecutor.execute(InstrumentedHttpRequestExecutor.java:61)
   [junit4]   2> 	at org.apache.http.impl.execchain.MainClientExec.execute(MainClientExec.java:271)
   [junit4]   2> 	at org.apache.http.impl.execchain.ProtocolExec.execute(ProtocolExec.java:184)
   [junit4]   2> 	at org.apache.http.impl.execchain.RetryExec.execute(RetryExec.java:88)
   [junit4]   2> 	at org.apache.http.impl.execchain.RedirectExec.execute(RedirectExec.java:110)
   [junit4]   2> 	at org.apache.http.impl.client.InternalHttpClient.doExecute(InternalHttpClient.java:184)
   [junit4]   2> 	at org.apache.http.impl.client.CloseableHttpClient.execute(CloseableHttpClient.java:82)
   [junit4]   2> 	at org.apache.http.impl.client.CloseableHttpClient.execute(CloseableHttpClient.java:55)
   [junit4]   2> 	at org.apache.solr.client.solrj.impl.HttpSolrClient.executeMethod(HttpSolrClient.java:532)
   [junit4]   2> 	... 11 more
   [junit4]   2> 798694 ERROR (OverseerThreadFactory-944-thread-3) [    ] o.a.s.c.OverseerCollectionMessageHandler Cleaning up collection [aliasedCollection].
   [junit4]   2> 798694 INFO  (OverseerThreadFactory-944-thread-3) [    ] o.a.s.c.OverseerCollectionMessageHandler Executing Collection Cmd : action=UNLOAD&deleteInstanceDir=true&deleteDataDir=true
   [junit4]   2> 828705 INFO  (zkCallback-260-thread-2) [    ] o.a.s.c.c.ZkStateReader A cluster state change: [WatchedEvent state:SyncConnected type:NodeDeleted path:/collections/aliasedCollection/state.json] for collection [aliasedCollection] has occurred - updating... (live nodes size: [4])
   [junit4]   2> 828705 ERROR (OverseerThreadFactory-944-thread-3) [    ] o.a.s.c.OverseerCollectionMessageHandler Collection: aliasedCollection operation: create failed:org.apache.solr.common.SolrException: Could not fully remove collection: aliasedCollection
   [junit4]   2> 	at org.apache.solr.cloud.DeleteCollectionCmd.call(DeleteCollectionCmd.java:99)
   [junit4]   2> 	at org.apache.solr.cloud.OverseerCollectionMessageHandler.cleanupCollection(OverseerCollectionMessageHandler.java:694)
   [junit4]   2> 	at org.apache.solr.cloud.CreateCollectionCmd.call(CreateCollectionCmd.java:276)
   [junit4]   2> 	at org.apache.solr.cloud.OverseerCollectionMessageHandler.processMessage(OverseerCollectionMessageHandler.java:224)
   [junit4]   2> 	at org.apache.solr.cloud.OverseerTaskProcessor$Runner.run(OverseerTaskProcessor.java:463)
   [junit4]   2> 	at org.apache.solr.common.util.ExecutorUtil$MDCAwareThreadPoolExecutor.lambda$execute$0(ExecutorUtil.java:229)
   [junit4]   2> 	at java.base/java.util.concurrent.ThreadPoolExecutor.runWorker(ThreadPoolExecutor.java:1161)
   [junit4]   2> 	at java.base/java.util.concurrent.ThreadPoolExecutor$Worker.run(ThreadPoolExecutor.java:635)
   [junit4]   2> 	at java.base/java.lang.Thread.run(Thread.java:844)
   [junit4]   2> 
   [junit4]   2> 828712 INFO  (OverseerThreadFactory-944-thread-3) [    ] o.a.s.c.OverseerTaskQueue Response ZK path: /overseer/collection-queue-work/qnr-0000000004 doesn't exist.  Requestor may have disconnected from ZooKeeper
   [junit4]   2> 828713 INFO  (OverseerStateUpdate-97195206778093578-127.0.0.1:33371_solr-n_0000000000) [    ] o.a.s.c.Overseer Overseer Loop exiting : 127.0.0.1:33371_solr
   [junit4]   2> 828714 WARN  (OverseerExitThread) [    ] o.a.s.c.Overseer I'm exiting, but I'm still the leader
   [junit4]   2> 828714 INFO  (OverseerExitThread) [    ] o.a.s.c.Overseer Overseer (id=97195206778093578-127.0.0.1:33371_solr-n_0000000000) closing
   [junit4]   2> 828715 INFO  (zkCallback-265-thread-5) [    ] o.a.s.c.OverseerElectionContext I am going to be the leader 127.0.0.1:44067_solr
   [junit4]   2> 828715 INFO  (zkCallback-265-thread-5) [    ] o.a.s.c.Overseer Overseer (id=97195206778093580-127.0.0.1:44067_solr-n_0000000001) starting
   [junit4]   2> 828720 INFO  (OverseerThreadFactory-954-thread-1) [    ] o.a.s.c.CreateCollectionCmd Create collection solrj_test_splitshard
   [junit4]   2> 828720 INFO  (OverseerThreadFactory-954-thread-2) [    ] o.a.s.c.CreateCollectionCmd Create collection balancedProperties
   [junit4]   2> 828721 INFO  (OverseerThreadFactory-954-thread-3) [    ] o.a.s.c.CreateCollectionCmd Create collection solrj_test_core_props
   [junit4]   2> 828827 INFO  (qtp1318974581-1337) [    ] o.a.s.h.a.CoreAdminOperation core create command qt=/admin/cores&collection.configName=conf&newCollection=true&name=balancedProperties_shard1_replica2&action=CREATE&numShards=2&collection=balancedProperties&shard=shard1&wt=javabin&version=2
   [junit4]   2> 828827 INFO  (qtp1795947352-1472) [    ] o.a.s.h.a.CoreAdminOperation core create command qt=/admin/cores&collection.configName=conf&newCollection=true&name=balancedProperties_shard2_replica1&action=CREATE&numShards=2&collection=balancedProperties&shard=shard2&wt=javabin&version=2
   [junit4]   2> 828828 INFO  (qtp1795947352-1364) [    ] o.a.s.h.a.CoreAdminOperation core create command qt=/admin/cores&collection.configName=conf&newCollection=true&name=solrj_test_splitshard_shard1_replica1&action=CREATE&numShards=2&collection=solrj_test_splitshard&shard=shard1&wt=javabin&version=2
   [junit4]   2> 828834 INFO  (zkCallback-265-thread-6) [    ] o.a.s.c.c.ZkStateReader A cluster state change: [WatchedEvent state:SyncConnected type:NodeDataChanged path:/collections/balancedProperties/state.json] for collection [balancedProperties] has occurred - updating... (live nodes size: [4])
   [junit4]   2> 828834 INFO  (zkCallback-260-thread-3) [    ] o.a.s.c.c.ZkStateReader A cluster state change: [WatchedEvent state:SyncConnected type:NodeDataChanged path:/collections/balancedProperties/state.json] for collection [balancedProperties] has occurred - updating... (live nodes size: [4])
   [junit4]   2> 828846 INFO  (qtp519501797-1367) [    ] o.a.s.h.a.CoreAdminOperation core create command qt=/admin/cores&collection.configName=conf&newCollection=true&name=balancedProperties_shard2_replica2&action=CREATE&numShards=2&collection=balancedProperties&shard=shard2&wt=javabin&version=2
   [junit4]   2> 828847 INFO  (qtp1750628220-1336) [    ] o.a.s.h.a.CoreAdminOperation core create command qt=/admin/cores&collection.configName=conf&newCollection=true&name=balancedProperties_shard1_replica1&action=CREATE&numShards=2&collection=balancedProperties&shard=shard1&wt=javabin&version=2
   [junit4]   2> 828847 INFO  (qtp519501797-1356) [    ] o.a.s.h.a.CoreAdminOperation core create command qt=/admin/cores&collection.configName=conf&newCollection=true&name=solrj_test_splitshard_shard2_replica1&action=CREATE&numShards=2&collection=solrj_test_splitshard&shard=shard2&wt=javabin&version=2
   [junit4]   2> 828848 INFO  (zkCallback-265-thread-6) [    ] o.a.s.c.c.ZkStateReader A cluster state change: [WatchedEvent state:SyncConnected type:NodeDataChanged path:/collections/solrj_test_splitshard/state.json] for collection [solrj_test_splitshard] has occurred - updating... (live nodes size: [4])
   [junit4]   2> 828850 INFO  (zkCallback-265-thread-6) [    ] o.a.s.c.c.ZkStateReader A cluster state change: [WatchedEvent state:SyncConnected type:NodeDataChanged path:/collections/balancedProperties/state.json] for collection [balancedProperties] has occurred - updating... (live nodes size: [4])
   [junit4]   2> 828850 INFO  (zkCallback-260-thread-3) [    ] o.a.s.c.c.ZkStateReader A cluster state change: [WatchedEvent state:SyncConnected type:NodeDataChanged path:/collections/balancedProperties/state.json] for collection [balancedProperties] has occurred - updating... (live nodes size: [4])
   [junit4]   2> 828850 INFO  (zkCallback-266-thread-2) [    ] o.a.s.c.c.ZkStateReader A cluster state change: [WatchedEvent state:SyncConnected type:NodeDataChanged path:/collections/balancedProperties/state.json] for collection [balancedProperties] has occurred - updating... (live nodes size: [4])
   [junit4]   2> 828850 INFO  (zkCallback-264-thread-4) [    ] o.a.s.c.c.ZkStateReader A cluster state change: [WatchedEvent state:SyncConnected type:NodeDataChanged path:/collections/balancedProperties/state.json] for collection [balancedProperties] has occurred - updating... (live nodes size: [4])
   [junit4]   2> 828925 INFO  (qtp1795947352-1477) [    ] o.a.s.h.a.CoreAdminOperation core create command property.ulogDir=/home/jenkins/workspace/Lucene-Solr-master-Linux/solr/build/solr-core/test/J2/temp/solr.cloud.CollectionsAPISolrJTest_C78FE6B86EB3B01C-001/testPropertyParamsForCreate-001/ulogDir-kig&qt=/admin/cores&property.dataDir=/home/jenkins/workspace/Lucene-Solr-master-Linux/solr/build/solr-core/test/J2/temp/solr.cloud.CollectionsAPISolrJTest_C78FE6B86EB3B01C-001/testPropertyParamsForCreate-001/dataDir-ezu&collection.configName=conf&newCollection=true&name=solrj_test_core_props_shard1_replica1&action=CREATE&numShards=1&collection=solrj_test_core_props&shard=shard1&wt=javabin&version=2
   [junit4]   2> 828927 INFO  (zkCallback-265-thread-6) [    ] o.a.s.c.c.ZkStateReader A cluster state change: [WatchedEvent state:SyncConnected type:NodeDataChanged path:/collections/solrj_test_splitshard/state.json] for collection [solrj_test_splitshard] has occurred - updating... (live nodes size: [4])
   [junit4]   2> 828927 INFO  (zkCallback-264-thread-4) [    ] o.a.s.c.c.ZkStateReader A cluster state change: [WatchedEvent state:SyncConnected type:NodeDataChanged path:/collections/solrj_test_splitshard/state.json] for collection [solrj_test_splitshard] has occurred - updating... (live nodes size: [4])
   [junit4]   2> 829028 INFO  (zkCallback-265-thread-6) [    ] o.a.s.c.c.ZkStateReader A cluster state change: [WatchedEvent state:SyncConnected type:NodeDataChanged path:/collections/solrj_test_core_props/state.json] for collection [solrj_test_core_props] has occurred - updating... (live nodes size: [4])
   [junit4]   2> 829837 INFO  (qtp1318974581-1337) [    ] o.a.s.c.SolrConfig Using Lucene MatchVersion: 7.0.0
   [junit4]   2> 829837 INFO  (qtp1795947352-1364) [    ] o.a.s.c.SolrConfig Using Lucene MatchVersion: 7.0.0
   [junit4]   2> 829837 INFO  (qtp1795947352-1472) [    ] o.a.s.c.SolrConfig Using Lucene MatchVersion: 7.0.0
   [junit4]   2> 829843 INFO  (qtp1795947352-1472) [    ] o.a.s.s.IndexSchema [balancedProperties_shard2_replica1] Schema name=minimal
   [junit4]   2> 829843 INFO  (qtp1795947352-1364) [    ] o.a.s.s.IndexSchema [solrj_test_splitshard_shard1_replica1] Schema name=minimal
   [junit4]   2> 829843 INFO  (qtp1318974581-1337) [    ] o.a.s.s.IndexSchema [balancedProperties_shard1_replica2] Schema name=minimal
   [junit4]   2> 829844 INFO  (qtp1318974581-1337) [    ] o.a.s.s.IndexSchema Loaded schema minimal/1.1 with uniqueid field id
   [junit4]   2> 829844 INFO  (qtp1795947352-1364) [    ] o.a.s.s.IndexSchema Loaded schema minimal/1.1 with uniqueid field id
   [junit4]   2> 829844 INFO  (qtp1795947352-1472) [    ] o.a.s.s.IndexSchema Loaded schema minimal/1.1 with uniqueid field id
   [junit4]   2> 829845 INFO  (qtp1318974581-1337) [    ] o.a.s.c.CoreContainer Creating SolrCore 'balancedProperties_shard1_replica2' using configuration from collection balancedProperties
   [junit4]   2> 829845 INFO  (qtp1795947352-1364) [    ] o.a.s.c.CoreContainer Creating SolrCore 'solrj_test_splitshard_shard1_replica1' using configuration from collection solrj_test_splitshard
   [junit4]   2> 829845 INFO  (qtp1795947352-1472) [    ] o.a.s.c.CoreContainer Creating SolrCore 'balancedProperties_shard2_replica1' using configuration from collection balancedProperties
   [junit4]   2> 829845 INFO  (qtp1795947352-1472) [    ] o.a.s.c.SolrCore [[balancedProperties_shard2_replica1] ] Opening new SolrCore at [/home/jenkins/workspace/Lucene-Solr-master-Linux/solr/build/solr-core/test/J2/temp/solr.cloud.CollectionsAPISolrJTest_C78FE6B86EB3B01C-001/tempDir-001/node3/balancedProperties_shard2_replica1], dataDir=[/home/jenkins/workspace/Lucene-Solr-master-Linux/solr/build/solr-core/test/J2/temp/solr.cloud.CollectionsAPISolrJTest_C78FE6B86EB3B01C-001/tempDir-001/node3/./balancedProperties_shard2_replica1/data/]
   [junit4]   2> 829845 INFO  (qtp1318974581-1337) [    ] o.a.s.c.SolrCore [[balancedProperties_shard1_replica2] ] Opening new SolrCore at [/home/jenkins/workspace/Lucene-Solr-master-Linux/solr/build/solr-core/test/J2/temp/solr.cloud.CollectionsAPISolrJTest_C78FE6B86EB3B01C-001/tempDir-001/node2/balancedProperties_shard1_replica2], dataDir=[/home/jenkins/workspace/Lucene-Solr-master-Linux/solr/build/solr-core/test/J2/temp/solr.cloud.CollectionsAPISolrJTest_C78FE6B86EB3B01C-001/tempDir-001/node2/./balancedProperties_shard1_replica2/data/]
   [junit4]   2> 829845 INFO  (qtp1795947352-1364) [    ] o.a.s.c.SolrCore [[solrj_test_splitshard_shard1_replica1] ] Opening new SolrCore at [/home/jenkins/workspace/Lucene-Solr-master-Linux/solr/build/solr-core/test/J2/temp/solr.cloud.CollectionsAPISolrJTest_C78FE6B86EB3B01C-001/tempDir-001/node3/solrj_test_splitshard_shard1_replica1], dataDir=[/home/jenkins/workspace/Lucene-Solr-master-Linux/solr/build/solr-core/test/J2/temp/solr.cloud.CollectionsAPISolrJTest_C78FE6B86EB3B01C-001/tempDir-001/node3/./solrj_test_splitshard_shard1_replica1/data/]
   [junit4]   2> 829853 INFO  (qtp519501797-1356) [    ] o.a.s.c.SolrConfig Using Lucene MatchVersion: 7.0.0
   [junit4]   2> 829859 INFO  (qtp519501797-1367) [    ] o.a.s.c.SolrConfig Using Lucene MatchVersion: 7.0.0
   [junit4]   2> 829860 INFO  (qtp1750628220-1336) [    ] o.a.s.c.SolrConfig Using Lucene MatchVersion: 7.0.0
   [junit4]   2> 829864 INFO  (qtp1795947352-1364) [    ] o.a.s.u.UpdateHandler Using UpdateLog implementation: org.apache.solr.update.UpdateLog
   [junit4]   2> 829864 INFO  (qtp1795947352-1472) [    ] o.a.s.u.UpdateHandler Using UpdateLog implementation: org.apache.solr.update.UpdateLog
   [junit4]   2> 829864 INFO  (qtp1795947352-1364) [    ] o.a.s.u.UpdateLog Initializing UpdateLog: dataDir=null defaultSyncLevel=FLUSH numRecordsToKeep=100 maxNumLogsToKeep=10 numVersionBuckets=65536
   [junit4]   2> 829864 INFO  (qtp1795947352-1472) [    ] o.a.s.u.UpdateLog Initializing UpdateLog: dataDir=null defaultSyncLevel=FLUSH numRecordsToKeep=100 maxNumLogsToKeep=10 numVersionBuckets=65536
   [junit4]   2> 829865 INFO  (qtp1318974581-1337) [    ] o.a.s.u.UpdateHandler Using UpdateLog implementation: org.apache.solr.update.UpdateLog
   [junit4]   2> 829865 INFO  (qtp1318974581-1337) [    ] o.a.s.u.UpdateLog Initializing UpdateLog: dataDir=null defaultSyncLevel=FLUSH numRecordsToKeep=100 maxNumLogsToKeep=10 numVersionBuckets=65536
   [junit4]   2> 829865 INFO  (qtp1795947352-1364) [    ] o.a.s.u.CommitTracker Hard AutoCommit: disabled
   [junit4]   2> 829865 INFO  (qtp1795947352-1364) [    ] o.a.s.u.CommitTracker Soft AutoCommit: disabled
   [junit4]   2> 829865 INFO  (qtp1795947352-1472) [    ] o.a.s.u.CommitTracker Hard AutoCommit: disabled
   [junit4]   2> 829865 INFO  (qtp1795947352-1472) [    ] o.a.s.u.CommitTracker Soft AutoCommit: disabled
   [junit4]   2> 829865 INFO  (qtp1795947352-1364) [    ] o.a.s.s.SolrIndexSearcher Opening [Searcher@6dcb7441[solrj_test_splitshard_shard1_replica1] main]
   [junit4]   2> 829865 INFO  (qtp1795947352-1472) [    ] o.a.s.s.SolrIndexSearcher Opening [Searcher@35cbd0e2[balancedProperties_shard2_replica1] main]
   [junit4]   2> 829866 INFO  (qtp519501797-1356) [    ] o.a.s.s.IndexSchema [solrj_test_splitshard_shard2_replica1] Schema name=minimal
   [junit4]   2> 829866 INFO  (qtp1795947352-1472) [    ] o.a.s.r.ManagedResourceStorage Configured ZooKeeperStorageIO with znodeBase: /configs/conf
   [junit4]   2> 829866 INFO  (qtp1795947352-1364) [    ] o.a.s.r.ManagedResourceStorage Configured ZooKeeperStorageIO with znodeBase: /configs/conf
   [junit4]   2> 829866 INFO  (qtp519501797-1367) [    ] o.a.s.s.IndexSchema [balancedProperties_shard2_replica2] Schema name=minimal
   [junit4]   2> 829866 INFO  (qtp1795947352-1472) [    ] o.a.s.r.ManagedResourceStorage Loaded null at path _rest_managed.json using ZooKeeperStorageIO:path=/configs/conf
   [junit4]   2> 829866 INFO  (qtp1795947352-1364) [    ] o.a.s.r.ManagedResourceStorage Loaded null at path _rest_managed.json using ZooKeeperStorageIO:path=/configs/conf
   [junit4]   2> 829866 INFO  (qtp1795947352-1364) [    ] o.a.s.h.ReplicationHandler Commits will be reserved for  10000
   [junit4]   2> 829866 INFO  (qtp1795947352-1472) [    ] o.a.s.h.ReplicationHandler Commits will be reserved for  10000
   [junit4]   2> 829866 INFO  (qtp1318974581-1337) [    ] o.a.s.u.CommitTracker Hard AutoCommit: disabled
   [junit4]   2> 829866 INFO  (qtp1318974581-1337) [    ] o.a.s.u.CommitTracker Soft AutoCommit: disabled
   [junit4]   2> 829866 INFO  (qtp1795947352-1472) [    ] o.a.s.u.UpdateLog Could not find max version in index or recent updates, using new clock 1555123971276406784
   [junit4]   2> 829866 INFO  (qtp1795947352-1364) [    ] o.a.s.u.UpdateLog Could not find max version in index or recent updates, using new clock 1555123971276406784
   [junit4]   2> 829866 INFO  (qtp1750628220-1336) [    ] o.a.s.s.IndexSchema [balancedProperties_shard1_replica1] Schema name=minimal
   [junit4]   2> 829867 INFO  (qtp1318974581-1337) [    ] o.a.s.s.SolrIndexSearcher Opening [Searcher@4f57f5a7[balancedProperties_shard1_replica2] main]
   [junit4]   2> 829868 INFO  (qtp519501797-1367) [    ] o.a.s.s.IndexSchema Loaded schema minimal/1.1 with uniqueid field id
   [junit4]   2> 829868 INFO  (qtp519501797-1356) [    ] o.a.s.s.IndexSchema Loaded schema minimal/1.1 with uniqueid field id
   [junit4]   2> 829868 INFO  (qtp1318974581-1337) [    ] o.a.s.r.ManagedResourceStorage Configured ZooKeeperStorageIO with znodeBase: /configs/conf
   [junit4]   2> 829868 INFO  (searcherExecutor-956-thread-1) [    ] o.a.s.c.SolrCore [solrj_test_splitshard_shard1_replica1] Registered new searcher Searcher@6dcb7441[solrj_test_splitshard_shard1_replica1] main{ExitableDirectoryReader(UninvertingDirectoryReader())}
   [junit4]   2> 829869 INFO  (searcherExecutor-957-thread-1) [    ] o.a.s.c.SolrCore [balancedProperties_shard2_replica1] Registered new searcher Searcher@35cbd0e2[balancedProperties_shard2_replica1] main{ExitableDirectoryReader(UninvertingDirectoryReader())}
   [junit4]   2> 829869 INFO  (qtp1750628220-1336) [    ] o.a.s.s.IndexSchema Loaded schema minimal/1.1 with uniqueid field id
   [junit4]   2> 829869 INFO  (qtp1318974581-1337) [    ] o.a.s.r.ManagedResourceStorage Loaded null at path _rest_managed.json using ZooKeeperStorageIO:path=/configs/conf
   [junit4]   2> 829869 INFO  (qtp519501797-1356) [    ] o.a.s.c.CoreContainer Creating SolrCore 'solrj_test_splitshard_shard2_replica1' using configuration from collection solrj_test_splitshard
   [junit4]   2> 829869 INFO  (qtp1318974581-1337) [    ] o.a.s.h.ReplicationHandler Commits will be reserved for  10000
   [junit4]   2> 829869 INFO  (qtp519501797-1367) [    ] o.a.s.c.CoreContainer Creating SolrCore 'balancedProperties_shard2_replica2' using configuration from collection balancedProperties
   [junit4]   2> 829869 INFO  (qtp1318974581-1337) [    ] o.a.s.u.UpdateLog Could not find max version in index or recent updates, using new clock 1555123971279552512
   [junit4]   2> 829869 INFO  (qtp1750628220-1336) [    ] o.a.s.c.CoreContainer Creating SolrCore 'balancedProperties_shard1_replica1' using configuration from collection balancedProperties
   [junit4]   2> 829870 INFO  (qtp519501797-1356) [    ] o.a.s.c.SolrCore [[solrj_test_splitshard_shard2_replica1] ] Opening new SolrCore at [/home/jenkins/workspace/Lucene-Solr-master-Linux/solr/build/solr-core/test/J2/temp/solr.cloud.CollectionsAPISolrJTest_C78FE6B86EB3B01C-001/tempDir-001/node4/solrj_test_splitshard_shard2_replica1], dataDir=[/home/jenkins/workspace/Lucene-Solr-master-Linux/solr/build/solr-core/test/J2/temp/solr.cloud.CollectionsAPISolrJTest_C78FE6B86EB3B01C-001/tempDir-001/node4/./solrj_test_splitshard_shard2_replica1/data/]
   [junit4]   2> 829870 INFO  (qtp519501797-1367) [    ] o.a.s.c.SolrCore [[balancedProperties_shard2_replica2] ] Opening new SolrCore at [/home/j

[...truncated too long message...]

.CoreAdminHandler$CallInfo.call(CoreAdminHandler.java:365)
   [junit4]   2> 	at org.apache.solr.handler.admin.CoreAdminHandler.handleRequestBody(CoreAdminHandler.java:156)
   [junit4]   2> 	at org.apache.solr.handler.RequestHandlerBase.handleRequest(RequestHandlerBase.java:169)
   [junit4]   2> 	at org.apache.solr.servlet.HttpSolrCall.handleAdminRequest(HttpSolrCall.java:664)
   [junit4]   2> 	at org.apache.solr.servlet.HttpSolrCall.call(HttpSolrCall.java:445)
   [junit4]   2> 	at org.apache.solr.servlet.SolrDispatchFilter.doFilter(SolrDispatchFilter.java:345)
   [junit4]   2> 	at org.apache.solr.servlet.SolrDispatchFilter.doFilter(SolrDispatchFilter.java:296)
   [junit4]   2> 	at org.eclipse.jetty.servlet.ServletHandler$CachedChain.doFilter(ServletHandler.java:1699)
   [junit4]   2> 	at org.apache.solr.client.solrj.embedded.JettySolrRunner$DebugFilter.doFilter(JettySolrRunner.java:113)
   [junit4]   2> 	at org.eclipse.jetty.servlet.ServletHandler$CachedChain.doFilter(ServletHandler.java:1699)
   [junit4]   2> 	at org.eclipse.jetty.servlet.ServletHandler.doHandle(ServletHandler.java:582)
   [junit4]   2> 	at org.eclipse.jetty.server.session.SessionHandler.doHandle(SessionHandler.java:224)
   [junit4]   2> 	at org.eclipse.jetty.server.handler.ContextHandler.doHandle(ContextHandler.java:1180)
   [junit4]   2> 	at org.eclipse.jetty.servlet.ServletHandler.doScope(ServletHandler.java:512)
   [junit4]   2> 	at org.eclipse.jetty.server.session.SessionHandler.doScope(SessionHandler.java:185)
   [junit4]   2> 	at org.eclipse.jetty.server.handler.ContextHandler.doScope(ContextHandler.java:1112)
   [junit4]   2> 	at org.eclipse.jetty.server.handler.ScopedHandler.handle(ScopedHandler.java:141)
   [junit4]   2> 	at org.eclipse.jetty.server.handler.gzip.GzipHandler.handle(GzipHandler.java:462)
   [junit4]   2> 	at org.eclipse.jetty.server.handler.HandlerWrapper.handle(HandlerWrapper.java:134)
   [junit4]   2> 	at org.eclipse.jetty.server.Server.handle(Server.java:534)
   [junit4]   2> 	at org.eclipse.jetty.server.HttpChannel.handle(HttpChannel.java:320)
   [junit4]   2> 	at org.eclipse.jetty.server.HttpConnection.onFillable(HttpConnection.java:251)
   [junit4]   2> 	at org.eclipse.jetty.io.AbstractConnection$ReadCallback.succeeded(AbstractConnection.java:273)
   [junit4]   2> 	at org.eclipse.jetty.io.FillInterest.fillable(FillInterest.java:95)
   [junit4]   2> 	at org.eclipse.jetty.io.ssl.SslConnection.onFillable(SslConnection.java:202)
   [junit4]   2> 	at org.eclipse.jetty.io.AbstractConnection$ReadCallback.succeeded(AbstractConnection.java:273)
   [junit4]   2> 	at org.eclipse.jetty.io.FillInterest.fillable(FillInterest.java:95)
   [junit4]   2> 	at org.eclipse.jetty.io.SelectChannelEndPoint$2.run(SelectChannelEndPoint.java:93)
   [junit4]   2> 	at org.eclipse.jetty.util.thread.strategy.ExecuteProduceConsume.executeProduceConsume(ExecuteProduceConsume.java:303)
   [junit4]   2> 	at org.eclipse.jetty.util.thread.strategy.ExecuteProduceConsume.produceConsume(ExecuteProduceConsume.java:148)
   [junit4]   2> 	at org.eclipse.jetty.util.thread.strategy.ExecuteProduceConsume.run(ExecuteProduceConsume.java:136)
   [junit4]   2> 	at org.eclipse.jetty.util.thread.QueuedThreadPool.runJob(QueuedThreadPool.java:671)
   [junit4]   2> 	at org.eclipse.jetty.util.thread.QueuedThreadPool$2.run(QueuedThreadPool.java:589)
   [junit4]   2> 	at java.base/java.lang.Thread.run(Thread.java:844)
   [junit4]   2> 
   [junit4]   2> 851320 INFO  (qtp1750628220-1340) [    ] o.a.s.s.HttpSolrCall [admin] webapp=null path=/admin/cores params={nodeName=127.0.0.1:32882_solr&onlyIfLeaderActive=true&core=solrj_replicatests_shard1_replica1&coreNodeName=core_node3&action=PREPRECOVERY&checkLive=true&state=recovering&onlyIfLeader=true&wt=javabin&version=2} status=400 QTime=8001
   [junit4]   2> 852406 WARN  (zkCallback-264-thread-5) [    ] o.a.s.c.c.ZkStateReader ZooKeeper watch triggered, but Solr cannot talk to ZK: [KeeperErrorCode = Session expired for /collections/solrj_implicit/state.json]
   [junit4]   2> 852406 WARN  (zkCallback-260-thread-2) [    ] o.a.s.c.c.ZkStateReader ZooKeeper watch triggered, but Solr cannot talk to ZK: [KeeperErrorCode = Session expired for /collections/solrj_implicit/state.json]
   [junit4]   2> 852406 WARN  (zkCallback-266-thread-3) [    ] o.a.s.c.c.ZkStateReader ZooKeeper watch triggered, but Solr cannot talk to ZK: [KeeperErrorCode = Session expired for /live_nodes]
   [junit4]   2> 852406 WARN  (zkCallback-264-thread-6) [    ] o.a.s.c.c.ZkStateReader ZooKeeper watch triggered, but Solr cannot talk to ZK: [KeeperErrorCode = Session expired for /live_nodes]
   [junit4]   2> 852406 INFO  (jetty-launcher-245-thread-5) [    ] o.a.s.m.SolrMetricManager Closing metric reporters for: solr.node
   [junit4]   2> 852406 WARN  (zkCallback-260-thread-4) [    ] o.a.s.c.c.ZkStateReader ZooKeeper watch triggered, but Solr cannot talk to ZK: [KeeperErrorCode = Session expired for /live_nodes]
   [junit4]   2> 852406 INFO  (jetty-launcher-245-thread-5) [    ] o.e.j.s.h.ContextHandler Stopped o.e.j.s.ServletContextHandler@3b1b6221{/solr,null,UNAVAILABLE}
   [junit4]   2> 852407 INFO  (jetty-launcher-245-thread-6) [    ] o.a.s.m.SolrMetricManager Closing metric reporters for: solr.node
   [junit4]   2> 852407 INFO  (jetty-launcher-245-thread-6) [    ] o.e.j.s.h.ContextHandler Stopped o.e.j.s.ServletContextHandler@928215c{/solr,null,UNAVAILABLE}
   [junit4]   2> 852408 INFO  (jetty-launcher-245-thread-7) [    ] o.a.s.m.SolrMetricManager Closing metric reporters for: solr.node
   [junit4]   2> 852408 INFO  (jetty-launcher-245-thread-7) [    ] o.e.j.s.h.ContextHandler Stopped o.e.j.s.ServletContextHandler@617e3bf3{/solr,null,UNAVAILABLE}
   [junit4]   2> 852409 WARN  (zkCallback-265-thread-5) [    ] o.a.s.c.c.ZkStateReader ZooKeeper watch triggered, but Solr cannot talk to ZK: [KeeperErrorCode = Session expired for /live_nodes]
   [junit4]   2> 852410 INFO  (jetty-launcher-245-thread-8) [    ] o.a.s.m.SolrMetricManager Closing metric reporters for: solr.node
   [junit4]   2> 852410 INFO  (jetty-launcher-245-thread-8) [    ] o.e.j.s.h.ContextHandler Stopped o.e.j.s.ServletContextHandler@785b2864{/solr,null,UNAVAILABLE}
   [junit4]   2> 852410 INFO  (SUITE-CollectionsAPISolrJTest-seed#[C78FE6B86EB3B01C]-worker) [    ] o.a.s.c.ZkTestServer connecting to 127.0.0.1:34141 34141
   [junit4]   2> 852502 INFO  (Thread-257) [    ] o.a.s.c.ZkTestServer connecting to 127.0.0.1:34141 34141
   [junit4]   2> 852502 WARN  (Thread-257) [    ] o.a.s.c.ZkTestServer Watch limit violations: 
   [junit4]   2> Maximum concurrent create/delete watches above limit:
   [junit4]   2> 
   [junit4]   2> 	5	/solr/collections/solrj_test/state.json
   [junit4]   2> 	5	/solr/aliases.json
   [junit4]   2> 	4	/solr/security.json
   [junit4]   2> 	4	/solr/configs/conf
   [junit4]   2> 
   [junit4]   2> Maximum concurrent data watches above limit:
   [junit4]   2> 
   [junit4]   2> 	7	/solr/collections/replicaProperties/state.json
   [junit4]   2> 	5	/solr/clusterprops.json
   [junit4]   2> 	5	/solr/clusterstate.json
   [junit4]   2> 	5	/solr/collections/solrj_newstateformat/state.json
   [junit4]   2> 	4	/solr/collections/balancedProperties/state.json
   [junit4]   2> 	3	/solr/collections/solrj_implicit/state.json
   [junit4]   2> 	3	/solr/collections/solrj_replicatests/state.json
   [junit4]   2> 	2	/solr/collections/solrj_test_splitshard/state.json
   [junit4]   2> 
   [junit4]   2> Maximum concurrent children watches above limit:
   [junit4]   2> 
   [junit4]   2> 	49	/solr/overseer/queue
   [junit4]   2> 	12	/solr/overseer/queue-work
   [junit4]   2> 	5	/solr/live_nodes
   [junit4]   2> 	5	/solr/collections
   [junit4]   2> 	3	/solr/overseer/collection-queue-work
   [junit4]   2> 
   [junit4]   2> 852502 INFO  (SUITE-CollectionsAPISolrJTest-seed#[C78FE6B86EB3B01C]-worker) [    ] o.a.s.SolrTestCaseJ4 ###deleteCore
   [junit4]   2> NOTE: leaving temporary files on disk at: /home/jenkins/workspace/Lucene-Solr-master-Linux/solr/build/solr-core/test/J2/temp/solr.cloud.CollectionsAPISolrJTest_C78FE6B86EB3B01C-001
   [junit4]   2> Dec 30, 2016 7:10:12 AM com.carrotsearch.randomizedtesting.ThreadLeakControl checkThreadLeaks
   [junit4]   2> WARNING: Will linger awaiting termination of 1 leaked thread(s).
   [junit4]   2> NOTE: test params are: codec=Asserting(Lucene70): {}, docValues:{}, maxPointsInLeafNode=585, maxMBSortInHeap=7.422328811391599, sim=RandomSimilarity(queryNorm=false): {}, locale=nl-BE, timezone=America/Maceio
   [junit4]   2> NOTE: Linux 4.4.0-53-generic amd64/Oracle Corporation 9-ea (64-bit)/cpus=12,threads=1,free=57465112,total=504889344
   [junit4]   2> NOTE: All tests run in this JVM: [ResourceLoaderTest, SolrCloudExampleTest, JSONWriterTest, TestRawResponseWriter, TestShardHandlerFactory, TestUseDocValuesAsStored, DistributedQueueTest, AssignTest, BinaryUpdateRequestHandlerTest, SuggesterTSTTest, TestZkChroot, URLClassifyProcessorTest, TolerantUpdateProcessorTest, SolrTestCaseJ4Test, TestSolrDeletionPolicy1, SuggesterTest, ClassificationUpdateProcessorIntegrationTest, TestCloudDeleteByQuery, TestSolrXml, TestHdfsBackupRestoreCore, FieldAnalysisRequestHandlerTest, SolrJmxReporterTest, RestartWhileUpdatingTest, TestSolrFieldCacheMBean, TestIndexSearcher, LeaderInitiatedRecoveryOnShardRestartTest, SparseHLLTest, TestCSVResponseWriter, FullHLLTest, StatsReloadRaceTest, DataDrivenBlockJoinTest, TestDistributedStatsComponentCardinality, AutoCommitTest, TestConfig, SolrIndexConfigTest, DirectUpdateHandlerOptimizeTest, TestInitParams, BlobRepositoryCloudTest, CoreAdminHandlerTest, SaslZkACLProviderTest, TestNoOpRegenerator, TestJsonFacetRefinement, AddSchemaFieldsUpdateProcessorFactoryTest, SolrCoreCheckLockOnStartupTest, HighlighterConfigTest, TestNumericTerms32, CoreSorterTest, CdcrRequestHandlerTest, ExternalFileFieldSortTest, CollectionsAPISolrJTest]
   [junit4] Completed [247/673 (1!)] on J2 in 655.02s, 12 tests, 3 errors <<< FAILURES!

[...truncated 52900 lines...]


Mime
View raw message